{"text_format":"1","workbook":"xlsx","n_sheets":3,"sheets":["Itinerário","Itinerário Envio","PDF-Email"],"not_rendered":{"charts":0,"images":2,"macros":1,"external_links":1,"defined_names":46,"comments":0,"pivot_tables":0},"unopened":[],"bounds":{"document_bytes":16777216,"sheet_cells":100000,"rows_first":2000,"rows_last":500,"rows_between":2000,"halvings":0,"cell_chars":16384,"cell_head_chars":4096},"cells_cut":0,"cells_raw":0,"read":"whole","date_system":"1900"}

{"sheet":"Itinerário","index":0,"n_rows":875,"n_cols":12,"rows_kept":875,"cut":false,"hidden":false,"merged":[[580,3,589,3],[620,3,629,3],[601,3,619,3],[590,3,600,3],[630,1,689,1],[630,3,639,3],[640,3,649,3],[650,3,659,3],[680,3,689,3],[670,3,679,3],[660,3,669,3],[548,1,629,1],[548,3,557,3],[558,3,579,3],[358,3,367,3],[368,1,427,1],[368,3,377,3],[378,3,387,3],[388,3,397,3],[418,3,427,3],[308,1,367,1],[308,3,317,3],[348,3,357,3],[338,3,347,3],[408,3,417,3],[398,3,407,3],[318,3,327,3],[328,3,337,3],[53,3,62,3],[3,1,62,1],[63,1,122,1],[73,3,82,3],[83,3,92,3],[33,3,42,3],[43,3,52,3],[93,3,102,3],[103,3,112,3],[113,3,122,3],[63,3,72,3],[0,1,0,8],[1,1,1,8],[3,3,12,3],[13,3,22,3],[23,3,32,3],[183,1,247,1],[183,3,192,3],[193,3,207,3],[208,3,217,3],[238,3,247,3],[228,3,237,3],[218,3,227,3],[123,1,182,1],[123,3,132,3],[133,3,142,3],[143,3,152,3],[173,3,182,3],[153,3,162,3],[163,3,172,3],[248,1,307,1],[248,3,257,3],[258,3,267,3],[268,3,277,3],[298,3,307,3],[288,3,297,3],[278,3,287,3],[528,3,537,3],[518,3,527,3],[428,1,487,1],[428,3,437,3],[438,3,447,3],[448,3,457,3],[478,3,487,3],[468,3,477,3],[458,3,467,3],[488,1,547,1],[488,3,497,3],[498,3,507,3],[538,3,547,3],[508,3,517,3],[690,1,749,1],[690,3,699,3],[700,3,709,3],[710,3,719,3],[740,3,749,3],[730,3,739,3],[720,3,729,3],[770,3,784,3],[805,3,814,3],[815,1,874,1],[815,3,824,3],[825,3,834,3],[835,3,844,3],[865,3,874,3],[750,1,814,1],[750,3,759,3],[760,3,769,3],[795,3,804,3],[785,3,794,3],[855,3,864,3],[845,3,854,3]]}
[null,"Associação Catarinense"]
[null,"Itinerário 2º Semestre de 2018"]
[null,"Depart.",null,"Mês",null,"Data","Atividade a Desempenhar","Igreja","Distrito",null,"IGREJA","DISTRITO"]
[1,"APOLO STREICHER ABRÁSCIO",{"$f":"IF(B4=0,C3,B4)","v":"APOLO STREICHER ABRÁSCIO"},"JULHO",{"$f":"IF(D4=0,E3,D4)","v":"JULHO"},7,"Pregação e visitação professores","Morro da Fumaça",{"$f":"IFERROR(VLOOKUP(H4,K3:L246,2,FALSE),\"\")","v":"Próspera"},null,"Águas Claras","Brusque"]
[2,null,{"$f":"IF(B5=0,C4,B5)","v":"APOLO STREICHER ABRÁSCIO"},null,{"$f":"IF(D5=0,E4,D5)","v":"JULHO"},8,"Pregação","Canasvieiras",{"$f":"IFERROR(VLOOKUP(H5,K4:L252,2,FALSE),\"\")","v":"Ingleses"},null,"Aguas Mornas","Caminho Novo"]
[3,null,"APOLO STREICHER ABRÁSCIO",null,"JULHO",14,"Pregação","Tubarão",{"$f":"IFERROR(VLOOKUP(H6,K5:L253,2,FALSE),\"\")","v":"Tubarão"},null,"Alfredo Wagner","Bom Retiro"]
[4,null,"APOLO STREICHER ABRÁSCIO",null,"JULHO",14,"Anciori","AC","AC",null,"Alto Arroio","Imbituba"]
[5,null,"APOLO STREICHER ABRÁSCIO",null,"JULHO",22,"Encontro Terceira Idade","Termas do Gravatal",{"$f":"IFERROR(VLOOKUP(H8,K7:L255,2,FALSE),\"\")","v":"São Martinho"},null,"Alto São Bento","Camboriú"]
[6,null,"APOLO STREICHER ABRÁSCIO",null,"JULHO",28,"Pregação e treinamento pela tarde","Palhoça","Palhoça",null,"Andrino","Tubarão"]
[7,null,"APOLO STREICHER ABRÁSCIO",null,"JULHO",null,null,null,{"$f":"IFERROR(VLOOKUP(H10,K9:L257,2,FALSE),\"\")","v":""},null,"Anita Garibaldi","Santa Helena"]
[8,null,"APOLO STREICHER ABRÁSCIO",null,"JULHO",null,null,null,"",null,"Antonio Carlos","Biguaçu"]
[9,null,"APOLO STREICHER ABRÁSCIO",null,"JULHO",null,null,null,"",null,"Araranguá","Araranguá"]
[10,null,"APOLO STREICHER ABRÁSCIO",null,"JULHO",null,null,null,"",null,"Araucária","Santa Helena"]
[11,null,"APOLO STREICHER ABRÁSCIO","AGOSTO",{"$f":"IF(D14=0,E13,D14)","v":"AGOSTO"},"3 e 4","Final de semana da família","Revoredo","Revoredo",null,"Areias","Barreiros"]
[12,null,"APOLO STREICHER ABRÁSCIO",null,{"$f":"IF(D15=0,E14,D15)","v":"AGOSTO"},5,"Pregação","Sambaqui","Universitario",null,"Areias do Meio","Biguaçu"]
[13,null,"APOLO STREICHER ABRÁSCIO",null,"AGOSTO",10,"Teorico Prático ","AC","AC",null,"Aririú","Palhoça"]
[14,null,"APOLO STREICHER ABRÁSCIO",null,"AGOSTO",11,"Pregação e visitação professores","Cabeçuda",{"$f":"IFERROR(VLOOKUP(H17,K16:L264,2,FALSE),\"\")","v":"Laguna"},null,"Armazem","São Martinho"]
[15,null,"APOLO STREICHER ABRÁSCIO",null,"AGOSTO",14,"PGL ","Balneário Camboriú",{"$f":"IFERROR(VLOOKUP(H18,K17:L265,2,FALSE),\"\")","v":"Balneário Camboriú"},null,"Azambuja","Brusque"]
[16,null,"APOLO STREICHER ABRÁSCIO",null,"AGOSTO",18,"Aniversário Igreja","Florianópolis",{"$f":"IFERROR(VLOOKUP(H19,K18:L266,2,FALSE),\"\")","v":"Florianópolis"},null,"Baía Sul","Florianópolis"]
[17,null,"APOLO STREICHER ABRÁSCIO",null,"AGOSTO",18,"Anciori","AC","AC",null,"Bairro Cigana","Laguna"]
[18,null,"APOLO STREICHER ABRÁSCIO",null,"AGOSTO",25,"Pregação e visitação professores","Itajaí",{"$f":"IFERROR(VLOOKUP(H21,K20:L268,2,FALSE),\"\")","v":"Itajaí"},null,"Bairro dos Municípios","Balneário Camboriú"]
[19,null,"APOLO STREICHER ABRÁSCIO",null,"AGOSTO",31,"Enduro","Grão Pará","São Martinho",null,"Bairro Passagem","Revoredo"]
[20,null,"APOLO STREICHER ABRÁSCIO",null,"AGOSTO",null,null,null,{"$f":"IFERROR(VLOOKUP(H23,K22:L270,2,FALSE),\"\")","v":""},null,"Bairro São Paulo","Navegantes"]
[21,null,"APOLO STREICHER ABRÁSCIO","SETEMBRO",{"$f":"IF(D24=0,E23,D24)","v":"SETEMBRO"},1,"Pregação e visitação professores","Lageado Alto","Lageado Baixo",null,"Balneário Arroio Do Silva","Araranguá"]
[22,null,"APOLO STREICHER ABRÁSCIO",null,{"$f":"IF(D25=0,E24,D25)","v":"SETEMBRO"},8,"Pregação e visitação professores","Santo Amaro da Imperatriz","Caminho Novo",null,"Balneário Camboriú","Balneário Camboriú"]
[23,null,"APOLO STREICHER ABRÁSCIO",null,"SETEMBRO",15,"Pregação e visitação professores","Universitária","Universitario",null,"Balneario Gaivota","Sombrio"]
[24,null,"APOLO STREICHER ABRÁSCIO",null,"SETEMBRO",22,"Pregação e Batismo da Primavera","Brusque","Brusque",null,"Balneario Rincão","Içara"]
[25,null,"APOLO STREICHER ABRÁSCIO",null,"SETEMBRO",29,"Pregação e visitação professores","Santa Luzia","Criciúma",null,"Barra","Balneário Camboriú"]
[26,null,"APOLO STREICHER ABRÁSCIO",null,"SETEMBRO",null,null,null,"",null,"Barra Aririú","Palhoça"]
[27,null,"APOLO STREICHER ABRÁSCIO",null,"SETEMBRO",null,null,null,"",null,"Barra da Lagoa","Universitario"]
[28,null,"APOLO STREICHER ABRÁSCIO",null,"SETEMBRO",null,null,null,"",null,"Barreiros","Barreiros"]
[29,null,"APOLO STREICHER ABRÁSCIO",null,"SETEMBRO",null,null,null,{"$f":"IFERROR(VLOOKUP(H32,K31:L299,2,FALSE),\"\")","v":""},null,"Barreiros II","Jardim Atlântico"]
[30,null,"APOLO STREICHER ABRÁSCIO",null,"SETEMBRO",null,null,null,{"$f":"IFERROR(VLOOKUP(H33,K32:L300,2,FALSE),\"\")","v":""},null,"Bateias","Brusque"]
[31,null,"APOLO STREICHER ABRÁSCIO","OUTUBRO","OUTUBRO",13,"Pregação e visitação professores","Ingleses","Ingleses",null,"Bela Vista I","Jardim Atlântico"]
[32,null,"APOLO STREICHER ABRÁSCIO",null,"OUTUBRO",14,"Pregação","Bom Retiro","Bom Retiro",null,"Bentos","Laguna"]
[33,null,"APOLO STREICHER ABRÁSCIO",null,"OUTUBRO",27,"Pregação e visitação professores","Popular","Um ano em missão",null,"Beth B'nei Tsion","Florianópolis"]
[34,null,"APOLO STREICHER ABRÁSCIO",null,"OUTUBRO",null,null,null,null,null,"Biguaçu","Biguaçu"]
[35,null,"APOLO STREICHER ABRÁSCIO",null,"OUTUBRO",null,null,null,null,null,"Boa Esperança","Sombrio"]
[36,null,"APOLO STREICHER ABRÁSCIO",null,"OUTUBRO",null,null,null,null,null,"Bom Jardim da Serra","São Joaquim"]
[37,null,"APOLO STREICHER ABRÁSCIO",null,"OUTUBRO",null,null,null,null,null,"Bom Retiro","Bom Retiro"]
[38,null,"APOLO STREICHER ABRÁSCIO",null,"OUTUBRO",null,null,null,null,null,"Bom Retiro Do Brilhante","Limoeiro"]
[39,null,"APOLO STREICHER ABRÁSCIO",null,"OUTUBRO",null,null,null,null,null,"Bom Viver","Barreiros"]
[40,null,"APOLO STREICHER ABRÁSCIO",null,"OUTUBRO",null,null,null,null,null,"Bombas","Itapema"]
[41,null,"APOLO STREICHER ABRÁSCIO","NOVEMBRO","NOVEMBRO",3,"Pregação e visitação professores","Estância Do Meio","São Joaquim",null,"Braço Do Norte","São Martinho"]
[42,null,"APOLO STREICHER ABRÁSCIO",null,"NOVEMBRO","4 a 10","Evangelismo Criciuma","AC","AC",null,"Brilhante II","Limoeiro"]
[43,null,"APOLO STREICHER ABRÁSCIO",null,"NOVEMBRO",17,"Campori de Jovens","USB","USB",null,"Brusque","Brusque"]
[44,null,"APOLO STREICHER ABRÁSCIO",null,"NOVEMBRO",24,"Aventuri",null,null,null,"Cabeçuda","Laguna"]
[45,null,"APOLO STREICHER ABRÁSCIO",null,"NOVEMBRO",null,null,null,null,null,"Cachoeira Do Bom Jesus","Ingleses"]
[46,null,"APOLO STREICHER ABRÁSCIO",null,"NOVEMBRO",null,null,null,null,null,"Camboriú","Camboriú"]
[47,null,"APOLO STREICHER ABRÁSCIO",null,"NOVEMBRO",null,null,null,null,null,"Caminho Novo","Caminho Novo"]
[48,null,"APOLO STREICHER ABRÁSCIO",null,"NOVEMBRO",null,null,null,null,null,"Campeche","Rio Tavares"]
[49,null,"APOLO STREICHER ABRÁSCIO",null,"NOVEMBRO",null,null,null,null,null,"Campinas","Campinas"]
[50,null,"APOLO STREICHER ABRÁSCIO",null,"NOVEMBRO",null,null,null,null,null,"Campo Belo Do Sul","Santa Helena"]
[51,null,{"$f":"IF(B54=0,C33,B54)","v":"APOLO STREICHER ABRÁSCIO"},"DEZEMBRO",{"$f":"IF(D54=0,E33,D54)","v":"DEZEMBRO"},1,"Pregação e visitação professores","Nova Brasília",{"$f":"IFERROR(VLOOKUP(H54,K33:L301,2,FALSE),\"\")","v":"Nova Brasília"},null,"Campo Duna","Garopaba"]
[52,null,"APOLO STREICHER ABRÁSCIO",null,{"$f":"IF(D55=0,E54,D55)","v":"DEZEMBRO"},2,"Culto de ações de graças","AC","AC",null,"Campo Verde","Laguna"]
[53,null,"APOLO STREICHER ABRÁSCIO",null,"DEZEMBRO",8,"CelebrAC (CATRE)","CATRE","CATRE",null,"Campos Novos","Joaçaba"]
[54,null,"APOLO STREICHER ABRÁSCIO",null,"DEZEMBRO",15,"Pregação","Limoeiro",{"$f":"IFERROR(VLOOKUP(H57,K36:L304,2,FALSE),\"\")","v":"Limoeiro"},null,"Canasvieiras","Ingleses"]
[55,null,"APOLO STREICHER ABRÁSCIO",null,"DEZEMBRO",null,null,null,"",null,"Canelinha","Tijucas"]
[56,null,"APOLO STREICHER ABRÁSCIO",null,"DEZEMBRO",null,null,null,"",null,"Cangueri de Fora","Nova Brasília"]
[57,null,"APOLO STREICHER ABRÁSCIO",null,"DEZEMBRO",null,null,null,"",null,"Cangueri de Quadro","Nova Brasília"]
[58,null,"APOLO STREICHER ABRÁSCIO",null,"DEZEMBRO",null,null,null,"",null,"Canto Grande","Itapema"]
[59,null,"APOLO STREICHER ABRÁSCIO",null,"DEZEMBRO",null,null,null,"",null,"Capão Alto","Santa Helena"]
[60,null,{"$f":"IF(B63=0,C62,B63)","v":"APOLO STREICHER ABRÁSCIO"},null,"DEZEMBRO",null,null,null,"",null,"Capinzal","Joaçaba"]
[61,"PAULO ROBERTO BARBOSA LOPES",{"$f":"IF(B64=0,C63,B64)","v":"PAULO ROBERTO BARBOSA LOPES"},"JULHO",{"$f":"IF(D64=0,E63,D64)","v":"JULHO"},7,"Pregação","Barreiros","Barreiros",null,"Capivari de Baixo","Revoredo"]
[62,null,{"$f":"IF(B65=0,C64,B65)","v":"PAULO ROBERTO BARBOSA LOPES"},null,{"$f":"IF(D65=0,E64,D65)","v":"JULHO"},21,"Pregação","Estreito","Estreito",null,"Capoeiras","Estreito"]
[63,null,"PAULO ROBERTO BARBOSA LOPES",null,"JULHO",28,"Pregação","Sambaqui","Universitario",null,"Caputera","Imbituba"]
[64,null,"PAULO ROBERTO BARBOSA LOPES",null,"JULHO",null,null,null,null,null,"Carianos","Rio Tavares"]
[65,null,"PAULO ROBERTO BARBOSA LOPES",null,"JULHO",null,null,null,{"$f":"IFERROR(VLOOKUP(H68,K47:L315,2,FALSE),\"\")","v":""},null,"Catuíra","Bom Retiro"]
[66,null,"PAULO ROBERTO BARBOSA LOPES",null,"JULHO",null,null,null,"",null,"Cedrinho","Brusque"]
[67,null,"PAULO ROBERTO BARBOSA LOPES",null,"JULHO",null,null,null,"",null,"Cedro","Camboriú"]
[68,null,"PAULO ROBERTO BARBOSA LOPES",null,"JULHO",null,null,null,"",null,"Ceniro Martins","Jardim Eldorado"]
[69,null,"PAULO ROBERTO BARBOSA LOPES",null,"JULHO",null,null,null,"",null,"Cidade Nova","São Vicente"]
[70,null,"PAULO ROBERTO BARBOSA LOPES",null,"JULHO",null,null,null,"",null,"Cocal do Sul","Próspera"]
[71,null,"PAULO ROBERTO BARBOSA LOPES","AGOSTO",{"$f":"IF(D74=0,E73,D74)","v":"AGOSTO"},4,"Pregação e Treinamento","Araranguá","Araranguá",null,"Colonia Santana","Jardim Eldorado"]
[72,null,"PAULO ROBERTO BARBOSA LOPES",null,{"$f":"IF(D75=0,E74,D75)","v":"AGOSTO"},11,"Pregação e Reencontro","Universitária","Universitario",null,"Coloninha","Araranguá"]
[73,null,"PAULO ROBERTO BARBOSA LOPES",null,"AGOSTO",18,"Pregação","Ingleses","Ingleses",null,"Congonhas","Tubarão"]
[74,null,"PAULO ROBERTO BARBOSA LOPES",null,"AGOSTO",25,"Pregação","Jardim Eldorado","Jardim Eldorado",null,"Coqueiros","Jardim Atlântico"]
[75,null,"PAULO ROBERTO BARBOSA LOPES",null,"AGOSTO",null,null,null,{"$f":"IFERROR(VLOOKUP(H78,K57:L325,2,FALSE),\"\")","v":""},null,"Correia Pinto","Lages"]
[76,null,"PAULO ROBERTO BARBOSA LOPES",null,"AGOSTO",null,null,null,"",null,"Costa Cavalcante","São Vicente"]
[77,null,"PAULO ROBERTO BARBOSA LOPES",null,"AGOSTO",null,null,null,"",null,"Criciúma","Criciúma"]
[78,null,"PAULO ROBERTO BARBOSA LOPES",null,"AGOSTO",null,null,null,"",null,"Curitibanos","Lages"]
[79,null,"PAULO ROBERTO BARBOSA LOPES",null,"AGOSTO",null,null,null,"",null,"Despraiado","São Joaquim"]
[80,null,"PAULO ROBERTO BARBOSA LOPES",null,"AGOSTO",null,null,null,"",null,"Divinéia","Imbituba"]
[81,null,"PAULO ROBERTO BARBOSA LOPES","SETEMBRO",{"$f":"IF(D84=0,E83,D84)","v":"SETEMBRO"},1,"Pregação","Escalvado","Navegantes",null,"Dunas","Ingleses"]
[82,null,"PAULO ROBERTO BARBOSA LOPES",null,{"$f":"IF(D85=0,E84,D85)","v":"SETEMBRO"},8,"Pregação","Florianópolis","Florianópolis",null,"Ermo","Araranguá"]
[83,null,"PAULO ROBERTO BARBOSA LOPES",null,"SETEMBRO",22,"Pregação","Bom Jardim da Serra","São Joaquim",null,"Erval Velho","Joaçaba"]
[84,null,"PAULO ROBERTO BARBOSA LOPES",null,"SETEMBRO",29,"Encontro de Novos Membros",null,{"$f":"IFERROR(VLOOKUP(H87,K66:L334,2,FALSE),\"\")","v":""},null,"Escalvado","Navegantes"]
[85,null,"PAULO ROBERTO BARBOSA LOPES",null,"SETEMBRO",null,null,null,{"$f":"IFERROR(VLOOKUP(H88,K67:L335,2,FALSE),\"\")","v":""},null,"Estância Do Meio","São Joaquim"]
[86,null,"PAULO ROBERTO BARBOSA LOPES",null,"SETEMBRO",null,null,null,{"$f":"IFERROR(VLOOKUP(H89,K68:L336,2,FALSE),\"\")","v":""},null,"Estreito","Estreito"]
[87,null,"PAULO ROBERTO BARBOSA LOPES",null,"SETEMBRO",null,null,null,{"$f":"IFERROR(VLOOKUP(H90,K69:L337,2,FALSE),\"\")","v":""},null,"Fábio Silva","Revoredo"]
[88,null,"PAULO ROBERTO BARBOSA LOPES",null,"SETEMBRO",null,null,null,{"$f":"IFERROR(VLOOKUP(H91,K70:L338,2,FALSE),\"\")","v":""},null,"Fazenda","Balneário Camboriú"]
[89,null,"PAULO ROBERTO BARBOSA LOPES",null,"SETEMBRO",null,null,null,{"$f":"IFERROR(VLOOKUP(H92,K71:L359,2,FALSE),\"\")","v":""},null,"Fazenda São Paulo","Nova Brasília"]
[90,null,"PAULO ROBERTO BARBOSA LOPES",null,"SETEMBRO",null,null,null,{"$f":"IFERROR(VLOOKUP(H93,K72:L360,2,FALSE),\"\")","v":""},null,"Flor de Nápolis","Caminho Novo"]
[91,null,"PAULO ROBERTO BARBOSA LOPES","OUTUBRO","OUTUBRO",13,"Encontro de Novos Membros",null,null,null,"Florianópolis","Florianópolis"]
[92,null,"PAULO ROBERTO BARBOSA LOPES",null,"OUTUBRO",20,"Pregação","Santo Amaro da Imperatriz","Caminho Novo",null,"Forquilhinha","Içara"]
[93,null,"PAULO ROBERTO BARBOSA LOPES",null,"OUTUBRO",27,"Pregação","Itajaí","Itajaí",null,"Forquilhinhas","Caminho Novo"]
[94,null,"PAULO ROBERTO BARBOSA LOPES",null,"OUTUBRO",null,null,null,null,null,"Garopaba","Garopaba"]
[95,null,"PAULO ROBERTO BARBOSA LOPES",null,"OUTUBRO",null,null,null,null,null,"Gaspar Alto","Lageado Baixo"]
[96,null,"PAULO ROBERTO BARBOSA LOPES",null,"OUTUBRO",null,null,null,null,null,"Gethal","Lages"]
[97,null,"PAULO ROBERTO BARBOSA LOPES",null,"OUTUBRO",null,null,null,null,null,"Grafunda","Joaçaba"]
[98,null,"PAULO ROBERTO BARBOSA LOPES",null,"OUTUBRO",null,null,null,null,null,"Gravatá","Navegantes"]
[99,null,"PAULO ROBERTO BARBOSA LOPES",null,"OUTUBRO",null,null,null,null,null,"Guabiruba","Lageado Baixo"]
[100,null,"PAULO ROBERTO BARBOSA LOPES",null,"OUTUBRO",null,null,null,null,null,"Guabiruba Sul","Lageado Baixo"]
[101,null,"PAULO ROBERTO BARBOSA LOPES","NOVEMBRO","NOVEMBRO",3,"Encontro de Novos Membros",null,null,null,"Bom Pastor","São Martinho"]
[102,null,"PAULO ROBERTO BARBOSA LOPES",null,"NOVEMBRO",10,"Impacto Evangelístico Criciúma","AC","AC",null,"Guarujá","Lages"]
[103,null,"PAULO ROBERTO BARBOSA LOPES",null,"NOVEMBRO",24,"Pregação e Treinamento","Lageado Baixo","Lageado Baixo",null,"Herval D` Oeste","Joaçaba"]
[104,null,"PAULO ROBERTO BARBOSA LOPES",null,"NOVEMBRO",17,"Campori de Jovens USB","USB","USB",null,"Humaita de Cima","Revoredo"]
[105,null,"PAULO ROBERTO BARBOSA LOPES",null,"NOVEMBRO",24,"Aventuri","AC","AC",null,"Ibicaré","Joaçaba"]
[106,null,"PAULO ROBERTO BARBOSA LOPES",null,"NOVEMBRO",null,null,null,null,null,"Içara","Içara"]
[107,null,"PAULO ROBERTO BARBOSA LOPES",null,"NOVEMBRO",null,null,null,null,null,"Imaruí - Nova Brasilia","Nova Brasília"]
[108,null,"PAULO ROBERTO BARBOSA LOPES",null,"NOVEMBRO",null,null,null,null,null,"Imaruí-Itajaí","Itajaí"]
[109,null,"PAULO ROBERTO BARBOSA LOPES",null,"NOVEMBRO",null,null,null,null,null,"Imbituba","Imbituba"]
[110,null,"PAULO ROBERTO BARBOSA LOPES",null,"NOVEMBRO",null,null,null,null,null,"Ingleses","Ingleses"]
[111,null,{"$f":"IF(B114=0,C93,B114)","v":"PAULO ROBERTO BARBOSA LOPES"},"DEZEMBRO",{"$f":"IF(D114=0,E93,D114)","v":"DEZEMBRO"},1,"Encontro de Novos Membros",null,null,null,"Ipira","Joaçaba"]
[112,null,"PAULO ROBERTO BARBOSA LOPES",null,{"$f":"IF(D115=0,E114,D115)","v":"DEZEMBRO"},8,"Pregação","Canasvieiras","Ingleses",null,"Itajaí","Itajaí"]
[113,null,"PAULO ROBERTO BARBOSA LOPES",null,"DEZEMBRO",15,"Encontro de Novos Membros",null,{"$f":"IFERROR(VLOOKUP(H116,K75:L363,2,FALSE),\"\")","v":""},null,"Itapema","Itapema"]
[114,null,"PAULO ROBERTO BARBOSA LOPES",null,"DEZEMBRO",null,null,null,"",null,"Jacinto Machado","Sombrio"]
[115,null,"PAULO ROBERTO BARBOSA LOPES",null,"DEZEMBRO",null,null,null,"",null,"Jaguaruna","Revoredo"]
[116,null,"PAULO ROBERTO BARBOSA LOPES",null,"DEZEMBRO",null,null,null,"",null,"Januária","Sombrio"]
[117,null,"PAULO ROBERTO BARBOSA LOPES",null,"DEZEMBRO",null,null,null,"",null,"Jardim Atlântico","Jardim Atlântico"]
[118,null,"PAULO ROBERTO BARBOSA LOPES",null,"DEZEMBRO",null,null,null,"",null,"Jardim Carandaí","Biguaçu"]
[119,null,"PAULO ROBERTO BARBOSA LOPES",null,"DEZEMBRO",null,null,null,"",null,"Jardim Eldorado","Jardim Eldorado"]
[120,null,"PAULO ROBERTO BARBOSA LOPES",null,"DEZEMBRO",null,null,null,"",null,"Jardim Esperança","Navegantes"]
[121,"LUCIANO RODRIGO BARBOSA SANCHES",{"$f":"IF(B124=0,C123,B124)","v":"LUCIANO RODRIGO BARBOSA SANCHES"},"JULHO",{"$f":"IF(D124=0,E123,D124)","v":"JULHO"},7,"Pregação e Visita Tesoureiro","São Vicente","São Vicente",null,"Jardim Progresso","São Vicente"]
[122,null,{"$f":"IF(B125=0,C124,B125)","v":"LUCIANO RODRIGO BARBOSA SANCHES"},null,{"$f":"IF(D125=0,E124,D125)","v":"JULHO"},28,"Pregação e Visita Tesoureiro","Areias","Barreiros",null,"Jardim São Paulo","Tijucas"]
[123,null,"LUCIANO RODRIGO BARBOSA SANCHES",null,"JULHO",null,null,null,{"$f":"IFERROR(VLOOKUP(H126,K85:L373,2,FALSE),\"\")","v":""},null,"Joaçaba","Joaçaba"]
[124,null,"LUCIANO RODRIGO BARBOSA SANCHES",null,"JULHO",null,null,null,"",null,"Lageado Alto","Lageado Baixo"]
[125,null,"LUCIANO RODRIGO BARBOSA SANCHES",null,"JULHO",null,null,null,"",null,"Lageado Baixo","Lageado Baixo"]
[126,null,"LUCIANO RODRIGO BARBOSA SANCHES",null,"JULHO",null,null,null,"",null,"Lages","Lages"]
[127,null,"LUCIANO RODRIGO BARBOSA SANCHES",null,"JULHO",null,null,null,"",null,"Lagoa da Conceição","Rio Tavares"]
[128,null,"LUCIANO RODRIGO BARBOSA SANCHES",null,"JULHO",null,null,null,"",null,"Lagoa de Fora","Sombrio"]
[129,null,"LUCIANO RODRIGO BARBOSA SANCHES",null,"JULHO",null,null,null,"",null,"Laguna","Laguna"]
[130,null,"LUCIANO RODRIGO BARBOSA SANCHES",null,"JULHO",null,null,null,"",null,"Lauro Muller","São Martinho"]
[131,null,"LUCIANO RODRIGO BARBOSA SANCHES","AGOSTO",{"$f":"IF(D134=0,E133,D134)","v":"AGOSTO"},4,"Pregação","Bom Retiro","Bom Retiro",null,"Limeira","Limoeiro"]
[132,null,"LUCIANO RODRIGO BARBOSA SANCHES",null,{"$f":"IF(D135=0,E134,D135)","v":"AGOSTO"},11,"Pregação","Brusque","Brusque",null,"Limoeiro","Limoeiro"]
[133,null,"LUCIANO RODRIGO BARBOSA SANCHES",null,"AGOSTO",18,"ECC Tubarão","Tubarão","Tubarão",null,"Madri","Caminho Novo"]
[134,null,"LUCIANO RODRIGO BARBOSA SANCHES",null,"AGOSTO",null,null,null,{"$f":"IFERROR(VLOOKUP(H137,K96:L384,2,FALSE),\"\")","v":""},null,"Maracaja","Araranguá"]
[135,null,"LUCIANO RODRIGO BARBOSA SANCHES",null,"AGOSTO",null,null,null,"",null,"Mato Alto","Araranguá"]
[136,null,"LUCIANO RODRIGO BARBOSA SANCHES",null,"AGOSTO",null,null,null,"",null,"Mato Francês","Bom Retiro"]
[137,null,"LUCIANO RODRIGO BARBOSA SANCHES",null,"AGOSTO",null,null,null,"",null,"Mineração","Içara"]
[138,null,"LUCIANO RODRIGO BARBOSA SANCHES",null,"AGOSTO",null,null,null,"",null,"Ministério da Prisão","Itajaí"]
[139,null,"LUCIANO RODRIGO BARBOSA SANCHES",null,"AGOSTO",null,null,null,"",null,"Monte Alegre","Camboriú"]
[140,null,"LUCIANO RODRIGO BARBOSA SANCHES",null,"AGOSTO",null,null,null,"",null,"Morretes","Itapema"]
[141,null,"LUCIANO RODRIGO BARBOSA SANCHES","SETEMBRO",{"$f":"IF(D144=0,E143,D144)","v":"SETEMBRO"},1,"Pregação e Visita Tesoureiro","Barreiros","Barreiros",null,"Morrinhos","Tubarão"]
[142,null,"LUCIANO RODRIGO BARBOSA SANCHES",null,{"$f":"IF(D145=0,E144,D145)","v":"SETEMBRO"},8,"Encontro Filhos de Obreiros - USB","CATRE","CATRE",null,"Morro da Fumaça","Próspera"]
[143,null,"LUCIANO RODRIGO BARBOSA SANCHES",null,"SETEMBRO",15,"Pregação e Visita Tesoureiro","Próspera","Próspera",null,"Morro Do Horácio","Florianópolis"]
[144,null,"LUCIANO RODRIGO BARBOSA SANCHES",null,"SETEMBRO",29,"Pregação e Visita Tesoureiro","Praia Brava","Balneário Camboriú",null,"Morro dos Conventos","Araranguá"]
[145,null,"LUCIANO RODRIGO BARBOSA SANCHES",null,"SETEMBRO",null,null,null,{"$f":"IFERROR(VLOOKUP(H148,K107:L395,2,FALSE),\"\")","v":""},null,"Morro Grande","Araranguá"]
[146,null,"LUCIANO RODRIGO BARBOSA SANCHES",null,"SETEMBRO",null,null,null,{"$f":"IFERROR(VLOOKUP(H149,K108:L396,2,FALSE),\"\")","v":""},null,"Navegantes","Navegantes"]
[147,null,"LUCIANO RODRIGO BARBOSA SANCHES",null,"SETEMBRO",null,null,null,{"$f":"IFERROR(VLOOKUP(H150,K109:L397,2,FALSE),\"\")","v":""},null,"Nova Brasília","Nova Brasília"]
[148,null,"LUCIANO RODRIGO BARBOSA SANCHES",null,"SETEMBRO",null,null,null,{"$f":"IFERROR(VLOOKUP(H151,K110:L398,2,FALSE),\"\")","v":""},null,"Nova Esperança","Jardim Eldorado"]
[149,null,"LUCIANO RODRIGO BARBOSA SANCHES",null,"SETEMBRO",null,null,null,{"$f":"IFERROR(VLOOKUP(H152,K111:L419,2,FALSE),\"\")","v":""},null,"Orleans","São Martinho"]
[150,null,{"$f":"IF(B153=0,C152,B153)","v":"LUCIANO RODRIGO BARBOSA SANCHES"},null,"SETEMBRO",null,null,null,{"$f":"IFERROR(VLOOKUP(H153,K112:L420,2,FALSE),\"\")","v":""},null,"Otacílio Costa","Lages"]
[151,null,"LUCIANO RODRIGO BARBOSA SANCHES","OUTUBRO","OUTUBRO",6,"Encontro Administradores Escolares USB","USB","USB",null,"Ouro Negro","Içara"]
[152,null,"LUCIANO RODRIGO BARBOSA SANCHES",null,"OUTUBRO",20,"ECC Estreito","Estreito","Estreito",null,"Pachecos","Palhoça"]
[153,null,"LUCIANO RODRIGO BARBOSA SANCHES",null,"OUTUBRO",27,"Pregação e Visita Tesoureiro","Revoredo","Revoredo",null,"Paciencia","Limoeiro"]
[154,null,"LUCIANO RODRIGO BARBOSA SANCHES",null,"OUTUBRO",null,null,null,null,null,"Palhoça","Palhoça"]
[155,null,"LUCIANO RODRIGO BARBOSA SANCHES",null,"OUTUBRO",null,null,null,null,null,"Palmas","Biguaçu"]
[156,null,"LUCIANO RODRIGO BARBOSA SANCHES",null,"OUTUBRO",null,null,null,null,null,"Parque Lisboa","Jardim Eldorado"]
[157,null,"LUCIANO RODRIGO BARBOSA SANCHES",null,"OUTUBRO",null,null,null,null,null,"Passo de Torres","Sombrio"]
[158,null,"LUCIANO RODRIGO BARBOSA SANCHES",null,"OUTUBRO",null,null,null,null,null,"Paulo Lopes","Garopaba"]
[159,null,"LUCIANO RODRIGO BARBOSA SANCHES",null,"OUTUBRO",null,null,null,null,null,"Penha-Lages","Lages"]
[160,null,"LUCIANO RODRIGO BARBOSA SANCHES",null,"OUTUBRO",null,null,null,null,null,"Penha-Paulo Lopes","Garopaba"]
[161,null,"LUCIANO RODRIGO BARBOSA SANCHES","NOVEMBRO","NOVEMBRO",10,"Impacto Criciuma","AC","AC",null,"Perequê","Itapema"]
[162,null,"LUCIANO RODRIGO BARBOSA SANCHES",null,"NOVEMBRO",17,"Campori de Jovens USB","USB","USB",null,"Pescaria Brava","Laguna"]
[163,null,"LUCIANO RODRIGO BARBOSA SANCHES",null,"NOVEMBRO",24,"Pregação e Visita Tesoureiro","Criciúma","Criciúma",null,"Pinheiro","Içara"]
[164,null,"LUCIANO RODRIGO BARBOSA SANCHES",null,"NOVEMBRO",null,null,null,null,null,"Pioneiros","Brusque"]
[165,null,"LUCIANO RODRIGO BARBOSA SANCHES",null,"NOVEMBRO",null,null,null,null,null,"Pontal","Palhoça"]
[166,null,"LUCIANO RODRIGO BARBOSA SANCHES",null,"NOVEMBRO",null,null,null,null,null,"Ponte Alta Do Sul","Lages"]
[167,null,"LUCIANO RODRIGO BARBOSA SANCHES",null,"NOVEMBRO",null,null,null,null,null,"Popular","Santa Helena"]
[168,null,"LUCIANO RODRIGO BARBOSA SANCHES",null,"NOVEMBRO",null,null,null,null,null,"Portal","São Vicente"]
[169,null,"LUCIANO RODRIGO BARBOSA SANCHES",null,"NOVEMBRO",null,null,null,null,null,"Porto Belo","Itapema"]
[170,null,"LUCIANO RODRIGO BARBOSA SANCHES",null,"NOVEMBRO",null,null,null,null,null,"Porto de Itajaí","Espaço Vida e Saúde"]
[171,null,{"$f":"IF(B174=0,C153,B174)","v":"LUCIANO RODRIGO BARBOSA SANCHES"},"DEZEMBRO",{"$f":"IF(D174=0,E153,D174)","v":"DEZEMBRO"},8,"Pregação e Visita Tesoureiro","Biguaçu","Biguaçu",null,"Potecas","Barreiros"]
[172,null,"LUCIANO RODRIGO BARBOSA SANCHES",null,{"$f":"IF(D175=0,E174,D175)","v":"DEZEMBRO"},null,null,null,{"$f":"IFERROR(VLOOKUP(H175,K114:L422,2,FALSE),\"\")","v":""},null,"Praça","Tijucas"]
[173,null,"LUCIANO RODRIGO BARBOSA SANCHES",null,"DEZEMBRO",null,null,null,"",null,"Prado","Biguaçu"]
[174,null,"LUCIANO RODRIGO BARBOSA SANCHES",null,"DEZEMBRO",null,null,null,"",null,"Praia Brava","Balneário Camboriú"]
[175,null,"LUCIANO RODRIGO BARBOSA SANCHES",null,"DEZEMBRO",null,null,null,"",null,"Praia Comprida","Campinas"]
[176,null,"LUCIANO RODRIGO BARBOSA SANCHES",null,"DEZEMBRO",null,null,null,"",null,"Praia Do Camacho","Laguna"]
[177,null,"LUCIANO RODRIGO BARBOSA SANCHES",null,"DEZEMBRO",null,null,null,"",null,"Praia Do Rosa","Garopaba"]
[178,null,"LUCIANO RODRIGO BARBOSA SANCHES",null,"DEZEMBRO",null,null,null,"",null,"Praia do Sonho","Palhoça"]
[179,null,"LUCIANO RODRIGO BARBOSA SANCHES",null,"DEZEMBRO",null,null,null,"",null,"Praia Grande","Sombrio"]
[180,null,"LUCIANO RODRIGO BARBOSA SANCHES",null,"DEZEMBRO",null,null,null,"",null,"Presidente Vargas","Próspera"]
[181,"DÉBORA MOROZ MARTINS ABRÁSCIO",{"$f":"IF(B184=0,C123,B184)","v":"DÉBORA MOROZ MARTINS ABRÁSCIO"},"JULHO",{"$f":"IF(D184=0,E183,D184)","v":"JULHO"},7,"Atendimento distrital MM e AFAM","Santa Helena","Santa Helena",null,"Primavera","Universitario"]
[182,null,{"$f":"IF(B185=0,C184,B185)","v":"DÉBORA MOROZ MARTINS ABRÁSCIO"},null,{"$f":"IF(D185=0,E184,D185)","v":"JULHO"},14,"Artendimento Distrital","Rio Tavares",{"$f":"IFERROR(VLOOKUP(H185,K124:L432,2,FALSE),\"\")","v":"Rio Tavares"},null,"Projeto Theos","Lages"]
[183,null,"DÉBORA MOROZ MARTINS ABRÁSCIO",null,"JULHO","16-26","Férias",null,"",null,"Próspera","Próspera"]
[184,null,"DÉBORA MOROZ MARTINS ABRÁSCIO",null,"JULHO",28,"LIVRE",null,"",null,"Ratones","Universitario"]
[185,null,"DÉBORA MOROZ MARTINS ABRÁSCIO",null,"JULHO",null,null,null,"",null,"Renascer","Próspera"]
[186,null,"DÉBORA MOROZ MARTINS ABRÁSCIO",null,"JULHO",null,null,null,"",null,"Revoredo","Revoredo"]
[187,null,"DÉBORA MOROZ MARTINS ABRÁSCIO",null,"JULHO",null,null,null,"",null,"Riacho","Nova Brasília"]
[188,null,"DÉBORA MOROZ MARTINS ABRÁSCIO",null,"JULHO",null,null,null,"",null,"Ribanceira Do Sul","Tijucas"]
[189,null,"DÉBORA MOROZ MARTINS ABRÁSCIO",null,"JULHO",null,null,null,"",null,"Rio Bonito","São Vicente"]
[190,null,"DÉBORA MOROZ MARTINS ABRÁSCIO",null,"JULHO",null,null,null,"",null,"Rio Grande","Palhoça"]
[191,null,"DÉBORA MOROZ MARTINS ABRÁSCIO","AGOSTO",{"$f":"IF(D194=0,E193,D194)","v":"AGOSTO"},4,"Retiro de Anciãos com esposas","Revoredo","Revoredo",null,"Rio Maina","Criciúma"]
[192,null,"DÉBORA MOROZ MARTINS ABRÁSCIO",null,{"$f":"IF(D195=0,E194,D195)","v":"AGOSTO"},5,"Chá Evangelístico ","Sertão do Valongo",{"$f":"IFERROR(VLOOKUP(H195,K134:L442,2,FALSE),\"\")","v":"Tijucas"},null,"Rio Tavares","Rio Tavares"]
[193,null,"DÉBORA MOROZ MARTINS ABRÁSCIO",null,"AGOSTO",11,"Atendimento Distrital (Gravatá e Escalvados)","Gravatá","Navegantes",null,"Rio Vermelho","Ingleses"]
[194,null,"DÉBORA MOROZ MARTINS ABRÁSCIO",null,"AGOSTO",13,"PGESP Região Capital","AC","AC",null,"Roçado","Jardim Atlântico"]
[195,null,"DÉBORA MOROZ MARTINS ABRÁSCIO",null,"AGOSTO",14,"PGESP Região Serra","AC","AC",null,"Rua Nova","Sombrio"]
[196,null,"DÉBORA MOROZ MARTINS ABRÁSCIO",null,"AGOSTO",15,"PGESP Região Sul","AC","AC",null,"Sambaqui","Universitario"]
[197,null,"DÉBORA MOROZ MARTINS ABRÁSCIO",null,"AGOSTO",16,"PGESP Região Norte","AC","AC",null,"Santa Augusta","Criciúma"]
[198,null,"DÉBORA MOROZ MARTINS ABRÁSCIO",null,"AGOSTO",18,"Congresso MM Região Serra",null,"Bom Retiro",null,"Santa Cruz","Içara"]
[null,null,null,null,"AGOSTO",18,"Congresso MM Região Serra",null,"Joaçaba",null,"Santa Helena","Santa Helena"]
[null,null,null,null,"AGOSTO",18,"Congresso MM Região Serra",null,"Lages",null,"Santa Luzia","Criciúma"]
[null,null,null,null,"AGOSTO",18,"Congresso MM Região Serra",null,"Santa Helena",null,"Santa Regina","Camboriú"]
[null,null,null,null,"AGOSTO",18,"Congresso MM Região Serra",null,"São Joaquim",null,"Santa Rosa Do Sul","Sombrio"]
[null,null,null,null,"AGOSTO",18,"Congresso MM Região Serra",null,"Um ano em missão",null,"Santa Terezinha","Limoeiro"]
[199,null,{"$f":"IF(B207=0,C201,B207)","v":"DÉBORA MOROZ MARTINS ABRÁSCIO"},null,{"$f":"IF(D207=0,E201,D207)","v":"AGOSTO"},25,"Sermão QS e atendimento distrital","Campinas","Campinas",null,"Santo Amaro da Imperatriz","Caminho Novo"]
[200,null,"DÉBORA MOROZ MARTINS ABRÁSCIO",null,"AGOSTO",null,null,null,{"$f":"IFERROR(VLOOKUP(H208,K142:L450,2,FALSE),\"\")","v":""},null,"Santos Saraiva","Jardim Eldorado"]
[201,null,"DÉBORA MOROZ MARTINS ABRÁSCIO","SETEMBRO",{"$f":"IF(D209=0,E208,D209)","v":"SETEMBRO"},1,"Atendimento distrital ","Areias do Meio","Biguaçu",null,"São João Batista","Tijucas"]
[202,null,"DÉBORA MOROZ MARTINS ABRÁSCIO",null,"SETEMBRO","06 à 09","Concílio Filhos de Obreiros USB","CATRE","CATRE",null,"São João de Pelotas","São Joaquim"]
[203,null,"DÉBORA MOROZ MARTINS ABRÁSCIO",null,"SETEMBRO",15,"LIVRE",null,{"$f":"IFERROR(VLOOKUP(H211,K145:L453,2,FALSE),\"\")","v":""},null,"São João-Itajaí","São Vicente"]
[204,null,"DÉBORA MOROZ MARTINS ABRÁSCIO",null,"SETEMBRO",18,"PGCD junto com PGP  Região Serra 12h","AC","AC",null,"São Joaquim","São Joaquim"]
[205,null,"DÉBORA MOROZ MARTINS ABRÁSCIO",null,"SETEMBRO",19,"PGCD junto com PGP Região Sul 9h","AC","AC",null,"São José","Campinas"]
[206,null,"DÉBORA MOROZ MARTINS ABRÁSCIO",null,"SETEMBRO",20,"PGCD junto com PGP  Região Capital 9h","AC","AC",null,"São José - Bom Retiro","Bom Retiro"]
[207,null,"DÉBORA MOROZ MARTINS ABRÁSCIO",null,"SETEMBRO",20,"PGCD junto com PGP Região Norte 15h","AC","AC",null,"São José Do Cerrito","Lages"]
[208,null,"DÉBORA MOROZ MARTINS ABRÁSCIO",null,"SETEMBRO",22,"Pregação ","Roçado","Jardim Atlântico",null,"São Ludgero","São Martinho"]
[209,null,"DÉBORA MOROZ MARTINS ABRÁSCIO",null,"SETEMBRO",22,"Pregação - Encontro com esposa de anciãos e Amigos de fé","Jardim Atlântico","Jardim Atlântico",null,"São Martinho","São Martinho"]
[210,null,"DÉBORA MOROZ MARTINS ABRÁSCIO",null,"SETEMBRO",29,"Pregação","Sambaqui",{"$f":"IFERROR(VLOOKUP(H218,K152:L480,2,FALSE),\"\")","v":"Universitario"},null,"São Sebastião","Caminho Novo"]
[211,null,"DÉBORA MOROZ MARTINS ABRÁSCIO","OUTUBRO","OUTUBRO",6,"Programa Educação","AC","AC",null,"São Sebastião-Criciúma","Criciúma"]
[212,null,"DÉBORA MOROZ MARTINS ABRÁSCIO",null,"OUTUBRO",13,"LIVRE",null,null,null,"São Vicente","São Vicente"]
[213,null,"DÉBORA MOROZ MARTINS ABRÁSCIO",null,"OUTUBRO",16,"PGESP Região Serra","AC","AC",null,"Serraria","Barreiros"]
[214,null,"DÉBORA MOROZ MARTINS ABRÁSCIO",null,"OUTUBRO",16,"PGESP Região Capital","AC","AC",null,"Sertão Do Trombudo","Itapema"]
[215,null,"DÉBORA MOROZ MARTINS ABRÁSCIO",null,"OUTUBRO",17,"PGESP Região Sul","AC","AC",null,"Sertão Do Valongo","Tijucas"]
[216,null,"DÉBORA MOROZ MARTINS ABRÁSCIO",null,"OUTUBRO",18,"PGESP Região Norte","AC","AC",null,"Sertão dos Corrêas","Revoredo"]
[217,null,"DÉBORA MOROZ MARTINS ABRÁSCIO",null,"OUTUBRO",20,"Pregação","Brilhante II","Limoeiro",null,"Sideropolis","Criciúma"]
[218,null,"DÉBORA MOROZ MARTINS ABRÁSCIO",null,"OUTUBRO",20,"Tarde Mulheres asunto modéstia cristã","Limeira","Limoeiro",null,"Sombrio","Sombrio"]
[219,null,"DÉBORA MOROZ MARTINS ABRÁSCIO",null,"OUTUBRO",27,"Atendimento distrital MM e AFAM",null,"Içara",null,"Tabuleiro","Camboriú"]
[220,null,"DÉBORA MOROZ MARTINS ABRÁSCIO",null,"OUTUBRO",null,null,null,null,null,"Tapera","Rio Tavares"]
[221,null,"DÉBORA MOROZ MARTINS ABRÁSCIO","NOVEMBRO","NOVEMBRO",3,"Atendimento Distrital",null,"Camboriú",null,"Termas Do Gravatal","São Martinho"]
[222,null,"DÉBORA MOROZ MARTINS ABRÁSCIO",null,"NOVEMBRO",10,"Impacto Criciúma","AC","AC",null,"Terra Nova","Caminho Novo"]
[223,null,"DÉBORA MOROZ MARTINS ABRÁSCIO",null,"NOVEMBRO",17,"Campori de Jovens","USB","USB",null,"Tijucas","Tijucas"]
[224,null,"DÉBORA MOROZ MARTINS ABRÁSCIO",null,"NOVEMBRO",19,"PGCD junto com PGP  Região Serra 9h","AC","AC",null,"Treze de Maio","Próspera"]
[225,null,"DÉBORA MOROZ MARTINS ABRÁSCIO",null,"NOVEMBRO",20,"PGCD junto com PGP Região Sul 9h","AC","AC",null,"Tubarão","Tubarão"]
[226,null,"DÉBORA MOROZ MARTINS ABRÁSCIO",null,"NOVEMBRO",21,"PGCD junto com PGP Região Norte 9h","AC","AC",null,"Universitária","Universitario"]
[227,null,"DÉBORA MOROZ MARTINS ABRÁSCIO",null,"NOVEMBRO",22,"PGCD junto com PGP  Região Capital 9h","AC","AC",null,"Urubici","Bom Retiro"]
[228,null,"DÉBORA MOROZ MARTINS ABRÁSCIO",null,"NOVEMBRO",24,"Aventuri","AC","AC",null,"Urupema","Santa Helena"]
[229,null,"DÉBORA MOROZ MARTINS ABRÁSCIO",null,"NOVEMBRO",null,null,null,null,null,"Urussanga","Próspera"]
[230,null,"DÉBORA MOROZ MARTINS ABRÁSCIO",null,"NOVEMBRO",null,null,null,null,null,"Vargem Do Bom Jesus","Ingleses"]
[231,null,{"$f":"IF(B239=0,C218,B239)","v":"DÉBORA MOROZ MARTINS ABRÁSCIO"},"DEZEMBRO",{"$f":"IF(D239=0,E218,D239)","v":"DEZEMBRO"},1,"Pregação","Porto Belo",{"$f":"IFERROR(VLOOKUP(H239,K153:L481,2,FALSE),\"\")","v":"Itapema"},null,"Vargem Grande","Ingleses"]
[232,null,"DÉBORA MOROZ MARTINS ABRÁSCIO",null,"DEZEMBRO",1,"Atendimento distrital ",null,"Itapema",null,"Várzea","Santa Helena"]
[233,null,"DÉBORA MOROZ MARTINS ABRÁSCIO",null,"DEZEMBRO",8,"Pregação","Jardim Eldorado","Jardim Eldorado",null,"Vida Nova","Próspera"]
[234,null,"DÉBORA MOROZ MARTINS ABRÁSCIO",null,"DEZEMBRO",15,"Atendimento Distrital","Campo Duna","Garopaba",null,"Vidal Ramos","Bom Retiro"]
[235,null,"DÉBORA MOROZ MARTINS ABRÁSCIO",null,"DEZEMBRO",22,"Férias",null,{"$f":"IFERROR(VLOOKUP(H243,K157:L485,2,FALSE),\"\")","v":""},null,"Vila Alvorada","Imbituba"]
[236,null,"DÉBORA MOROZ MARTINS ABRÁSCIO",null,"DEZEMBRO",null,null,null,"",null,"Vila Formosa","Jardim Eldorado"]
[237,null,"DÉBORA MOROZ MARTINS ABRÁSCIO",null,"DEZEMBRO",null,null,null,"",null,"Vila Nova","Imbituba"]
[238,null,"DÉBORA MOROZ MARTINS ABRÁSCIO",null,"DEZEMBRO",null,null,null,"",null,"Zimbros","Itapema"]
[239,null,"DÉBORA MOROZ MARTINS ABRÁSCIO",null,"DEZEMBRO",null,null,null,""]
[240,null,"DÉBORA MOROZ MARTINS ABRÁSCIO",null,"DEZEMBRO",null,null,null,""]
[241,"EDVALDO MACIEL DA SILVA",{"$f":"IF(B249=0,C183,B249)","v":"EDVALDO MACIEL DA SILVA"},"JULHO","JULHO","07 a 08","Escola de Evangelistas Voluntários","CATRE","CATRE"]
[242,null,{"$f":"IF(B250=0,C249,B250)","v":"EDVALDO MACIEL DA SILVA"},null,"JULHO",14,"Colheita Navegantes","Navegantes","Navegantes"]
[243,null,"EDVALDO MACIEL DA SILVA",null,"JULHO",21,"Pregação ","Primavera","Universitario"]
[244,null,"EDVALDO MACIEL DA SILVA",null,"JULHO",null,null,null,{"$f":"IFERROR(VLOOKUP(H252,K166:L494,2,FALSE),\"\")","v":""}]
[245,null,"EDVALDO MACIEL DA SILVA",null,"JULHO",null,null,null,""]
[246,null,"EDVALDO MACIEL DA SILVA",null,"JULHO",null,null,null,""]
[247,null,"EDVALDO MACIEL DA SILVA",null,"JULHO",null,null,null,""]
[248,null,"EDVALDO MACIEL DA SILVA",null,"JULHO",null,null,null,""]
[249,null,"EDVALDO MACIEL DA SILVA",null,"JULHO",null,null,null,""]
[250,null,"EDVALDO MACIEL DA SILVA",null,"JULHO",null,null,null,""]
[251,null,"EDVALDO MACIEL DA SILVA","AGOSTO","AGOSTO",4,"Lançamento da Colheita","Balneário Camboriú","Balneário Camboriú"]
[252,null,"EDVALDO MACIEL DA SILVA",null,"AGOSTO",11,"Colheita Universitário","Primavera","Universitario"]
[253,null,"EDVALDO MACIEL DA SILVA",null,"AGOSTO",18,"Colheita/Plantio Universitário","Universitária","Universitario"]
[254,null,"EDVALDO MACIEL DA SILVA",null,"AGOSTO",25,"Lançamento da Colheita","Lages",""]
[255,null,"EDVALDO MACIEL DA SILVA",null,"AGOSTO",null,null,null,{"$f":"IFERROR(VLOOKUP(H263,K177:L505,2,FALSE),\"\")","v":""}]
[256,null,"EDVALDO MACIEL DA SILVA",null,"AGOSTO",null,null,null,""]
[257,null,"EDVALDO MACIEL DA SILVA",null,"AGOSTO",null,null,null,""]
[258,null,"EDVALDO MACIEL DA SILVA",null,"AGOSTO",null,null,null,""]
[259,null,"EDVALDO MACIEL DA SILVA",null,"AGOSTO",null,null,null,""]
[260,null,"EDVALDO MACIEL DA SILVA",null,"AGOSTO",null,null,null,""]
[261,null,"EDVALDO MACIEL DA SILVA","SETEMBRO","SETEMBRO",1,"Colheita Balneário Camboriú","Balneário Camboriú","Balneário Camboriú"]
[262,null,"EDVALDO MACIEL DA SILVA",null,"SETEMBRO",8,"Pregação ","Ingleses","Ingleses"]
[263,null,"EDVALDO MACIEL DA SILVA",null,"SETEMBRO",15,"Colheita Jardim Eldorado","Jardim Eldorado","Jardim Eldorado"]
[264,null,"EDVALDO MACIEL DA SILVA",null,"SETEMBRO",22,"Pregação ","São Sebastião","Jardim Eldorado"]
[265,null,"EDVALDO MACIEL DA SILVA",null,"SETEMBRO",29,"Colheita Zimbros","Zimbros","Itapema"]
[266,null,"EDVALDO MACIEL DA SILVA",null,"SETEMBRO",null,null,null,{"$f":"IFERROR(VLOOKUP(H274,K188:L516,2,FALSE),\"\")","v":""}]
[267,null,"EDVALDO MACIEL DA SILVA",null,"SETEMBRO",null,null,null,{"$f":"IFERROR(VLOOKUP(H275,K189:L517,2,FALSE),\"\")","v":""}]
[268,null,"EDVALDO MACIEL DA SILVA",null,"SETEMBRO",null,null,null,{"$f":"IFERROR(VLOOKUP(H276,K190:L518,2,FALSE),\"\")","v":""}]
[269,null,"EDVALDO MACIEL DA SILVA",null,"SETEMBRO",null,null,null,{"$f":"IFERROR(VLOOKUP(H277,K191:L539,2,FALSE),\"\")","v":""}]
[270,null,"EDVALDO MACIEL DA SILVA",null,"SETEMBRO",null,null,null,{"$f":"IFERROR(VLOOKUP(H278,K192:L540,2,FALSE),\"\")","v":""}]
[271,null,"EDVALDO MACIEL DA SILVA","OUTUBRO","OUTUBRO",6,"Pregação ","Tijucas","Tijucas"]
[272,null,"EDVALDO MACIEL DA SILVA",null,"OUTUBRO",13,"Lançamento da Colheita","Alfredo Wagner","Bom Retiro"]
[273,null,"EDVALDO MACIEL DA SILVA",null,"OUTUBRO",20,"Colheita Lages","Lages","Lages"]
[274,null,"EDVALDO MACIEL DA SILVA",null,"OUTUBRO",27,"Pregação ","Santa Helena","Santa Helena"]
[275,null,"EDVALDO MACIEL DA SILVA",null,"OUTUBRO"]
[276,null,"EDVALDO MACIEL DA SILVA",null,"OUTUBRO"]
[277,null,"EDVALDO MACIEL DA SILVA",null,"OUTUBRO"]
[278,null,"EDVALDO MACIEL DA SILVA",null,"OUTUBRO"]
[279,null,"EDVALDO MACIEL DA SILVA",null,"OUTUBRO"]
[280,null,"EDVALDO MACIEL DA SILVA",null,"OUTUBRO"]
[281,null,"EDVALDO MACIEL DA SILVA","NOVEMBRO","NOVEMBRO","03 a 10","Impacto Cricíuma","AC","AC"]
[282,null,"EDVALDO MACIEL DA SILVA",null,"NOVEMBRO",17,"Pregação ","Jardim Atlântico","Jardim Atlântico"]
[283,null,"EDVALDO MACIEL DA SILVA",null,"NOVEMBRO",24,"Colheita Bom Retiro","Bom Retiro","Bom Retiro"]
[284,null,"EDVALDO MACIEL DA SILVA",null,"NOVEMBRO"]
[285,null,"EDVALDO MACIEL DA SILVA",null,"NOVEMBRO"]
[286,null,"EDVALDO MACIEL DA SILVA",null,"NOVEMBRO"]
[287,null,"EDVALDO MACIEL DA SILVA",null,"NOVEMBRO"]
[288,null,"EDVALDO MACIEL DA SILVA",null,"NOVEMBRO"]
[289,null,"EDVALDO MACIEL DA SILVA",null,"NOVEMBRO"]
[290,null,"EDVALDO MACIEL DA SILVA",null,"NOVEMBRO"]
[291,null,{"$f":"IF(B299=0,C278,B299)","v":"EDVALDO MACIEL DA SILVA"},"DEZEMBRO",{"$f":"IF(D299=0,E278,D299)","v":"DEZEMBRO"},1,"Colheita/Plantio Bom Retiro","Bom Retiro","Bom Retiro"]
[292,null,"EDVALDO MACIEL DA SILVA",null,"DEZEMBRO",null,null,null,{"$f":"IFERROR(VLOOKUP(H300,K194:L542,2,FALSE),\"\")","v":""}]
[293,null,"EDVALDO MACIEL DA SILVA",null,"DEZEMBRO",null,null,null,""]
[294,null,"EDVALDO MACIEL DA SILVA",null,"DEZEMBRO",null,null,null,""]
[295,null,"EDVALDO MACIEL DA SILVA",null,"DEZEMBRO",null,null,null,""]
[296,null,"EDVALDO MACIEL DA SILVA",null,{"$f":"IF(D304=0,E303,D304)","v":"DEZEMBRO"},null,null,null,""]
[297,null,"EDVALDO MACIEL DA SILVA",null,"DEZEMBRO",null,null,null,""]
[298,null,"EDVALDO MACIEL DA SILVA",null,"DEZEMBRO",null,null,null,""]
[299,null,"EDVALDO MACIEL DA SILVA",null,"DEZEMBRO",null,null,null,""]
[300,null,"EDVALDO MACIEL DA SILVA",null,"DEZEMBRO",null,null,null,""]
[301,"EVANDRO PEREIRA DE VARGAS",{"$f":"IF(B309=0,C308,B309)","v":"EVANDRO PEREIRA DE VARGAS"},"JULHO",{"$f":"IF(D309=0,E308,D309)","v":"JULHO"},7,"Pregação ","Capinzal","Joaçaba"]
[302,null,{"$f":"IF(B310=0,C309,B310)","v":"EVANDRO PEREIRA DE VARGAS"},null,"JULHO","14-21","Férias",null,{"$f":"IFERROR(VLOOKUP(H310,K204:L552,2,FALSE),\"\")","v":""}]
[303,null,"EVANDRO PEREIRA DE VARGAS",null,"JULHO",28,"Pregação (programa Colportagem)","Navegantes","Navegantes"]
[304,null,"EVANDRO PEREIRA DE VARGAS",null,"JULHO",null,null,null,{"$f":"IFERROR(VLOOKUP(H312,K206:L554,2,FALSE),\"\")","v":""}]
[305,null,"EVANDRO PEREIRA DE VARGAS",null,"JULHO",null,null,null,""]
[306,null,"EVANDRO PEREIRA DE VARGAS",null,"JULHO",null,null,null,""]
[307,null,"EVANDRO PEREIRA DE VARGAS",null,"JULHO",null,null,null,""]
[308,null,"EVANDRO PEREIRA DE VARGAS",null,"JULHO",null,null,null,""]
[309,null,"EVANDRO PEREIRA DE VARGAS",null,"JULHO",null,null,null,""]
[310,null,"EVANDRO PEREIRA DE VARGAS",null,"JULHO",null,null,null,""]
[311,null,"EVANDRO PEREIRA DE VARGAS","AGOSTO","AGOSTO",4,"Pregação (Dia do Espirito de Profecia)","Estreito","Estreito"]
[312,null,"EVANDRO PEREIRA DE VARGAS",null,"AGOSTO",11,"Pregação (programa Colportagem)","Santo Amaro da Imperatriz","Caminho Novo"]
[313,null,"EVANDRO PEREIRA DE VARGAS",null,"AGOSTO",18,"Pregação (programa Colportagem)","Próspera","Próspera"]
[314,null,"EVANDRO PEREIRA DE VARGAS",null,"AGOSTO",25,"Pregação (programa Colportagem)","Forquilhinhas","Parque Lisboa"]
[315,null,"EVANDRO PEREIRA DE VARGAS",null,"AGOSTO",null,null,null,{"$f":"IFERROR(VLOOKUP(H323,K217:L577,2,FALSE),\"\")","v":""}]
[316,null,"EVANDRO PEREIRA DE VARGAS",null,"AGOSTO",null,null,null,""]
[317,null,"EVANDRO PEREIRA DE VARGAS",null,"AGOSTO",null,null,null,""]
[318,null,"EVANDRO PEREIRA DE VARGAS",null,"AGOSTO",null,null,null,""]
[319,null,"EVANDRO PEREIRA DE VARGAS",null,"AGOSTO",null,null,null,""]
[320,null,"EVANDRO PEREIRA DE VARGAS",null,"AGOSTO",null,null,null,""]
[321,null,"EVANDRO PEREIRA DE VARGAS","SETEMBRO","SETEMBRO",1,"Pregação (programa Colportagem)","Zimbros","Itapema"]
[322,null,"EVANDRO PEREIRA DE VARGAS",null,"SETEMBRO",15,"Encontro de Líderes","UNASP","UNASP"]
[323,null,"EVANDRO PEREIRA DE VARGAS",null,"SETEMBRO",22,"Pregação - Recrutamento","São Vicente","São Vicente"]
[324,null,"EVANDRO PEREIRA DE VARGAS",null,"SETEMBRO",29,"Pregação (programa Colportagem)","Ingleses","Ingleses"]
[325,null,"EVANDRO PEREIRA DE VARGAS",null,"SETEMBRO",null,null,null,{"$f":"IFERROR(VLOOKUP(H333,K227:L587,2,FALSE),\"\")","v":""}]
[326,null,"EVANDRO PEREIRA DE VARGAS",null,"SETEMBRO",null,null,null,{"$f":"IFERROR(VLOOKUP(H334,K228:L588,2,FALSE),\"\")","v":""}]
[327,null,"EVANDRO PEREIRA DE VARGAS",null,"SETEMBRO",null,null,null,{"$f":"IFERROR(VLOOKUP(H335,K229:L589,2,FALSE),\"\")","v":""}]
[328,null,"EVANDRO PEREIRA DE VARGAS",null,"SETEMBRO",null,null,null,{"$f":"IFERROR(VLOOKUP(H336,K230:L590,2,FALSE),\"\")","v":""}]
[329,null,"EVANDRO PEREIRA DE VARGAS",null,"SETEMBRO",null,null,null,{"$f":"IFERROR(VLOOKUP(H337,K231:L621,2,FALSE),\"\")","v":""}]
[330,null,"EVANDRO PEREIRA DE VARGAS",null,"SETEMBRO",null,null,null,{"$f":"IFERROR(VLOOKUP(H338,K232:L622,2,FALSE),\"\")","v":""}]
[331,null,"EVANDRO PEREIRA DE VARGAS","OUTUBRO","OUTUBRO",6,"Semana de Colportagem ","IAP","IAP"]
[332,null,"EVANDRO PEREIRA DE VARGAS",null,"OUTUBRO",20,"Pregação (programa Colportagem)","Itapema","Itapema"]
[333,null,"EVANDRO PEREIRA DE VARGAS",null,"OUTUBRO",27,"Semana de Colportagem ","UNASP","UNASP"]
[334,null,"EVANDRO PEREIRA DE VARGAS",null,"OUTUBRO"]
[335,null,"EVANDRO PEREIRA DE VARGAS",null,"OUTUBRO"]
[336,null,"EVANDRO PEREIRA DE VARGAS",null,"OUTUBRO"]
[337,null,"EVANDRO PEREIRA DE VARGAS",null,"OUTUBRO"]
[338,null,"EVANDRO PEREIRA DE VARGAS",null,"OUTUBRO"]
[339,null,"EVANDRO PEREIRA DE VARGAS",null,"OUTUBRO"]
[340,null,"EVANDRO PEREIRA DE VARGAS",null,"OUTUBRO"]
[341,null,"EVANDRO PEREIRA DE VARGAS","NOVEMBRO","NOVEMBRO",3,"Pregação (programa Colportagem)","São João Batista","Tijucas"]
[342,null,"EVANDRO PEREIRA DE VARGAS",null,"NOVEMBRO",10,"Pregação (programa Colportagem)","Nova Brasília","Nova Brasília"]
[343,null,"EVANDRO PEREIRA DE VARGAS",null,"NOVEMBRO",17,"Pregação (programa Colportagem)","Garopaba","Garopaba"]
[344,null,"EVANDRO PEREIRA DE VARGAS",null,"NOVEMBRO",24,"Evangelismo"]
[345,null,"EVANDRO PEREIRA DE VARGAS",null,"NOVEMBRO"]
[346,null,"EVANDRO PEREIRA DE VARGAS",null,"NOVEMBRO"]
[347,null,"EVANDRO PEREIRA DE VARGAS",null,"NOVEMBRO"]
[348,null,"EVANDRO PEREIRA DE VARGAS",null,"NOVEMBRO"]
[349,null,"EVANDRO PEREIRA DE VARGAS",null,"NOVEMBRO"]
[350,null,"EVANDRO PEREIRA DE VARGAS",null,"NOVEMBRO"]
[351,null,"EVANDRO PEREIRA DE VARGAS","DEZEMBRO",{"$f":"IF(D359=0,E338,D359)","v":"DEZEMBRO"},1,"Pregação (programa Colportagem)","Campeche","Rio Tavares"]
[352,null,"EVANDRO PEREIRA DE VARGAS",null,"DEZEMBRO",7,"Pregação (programa Colportagem)","Palhoça","Palhoça"]
[353,null,"EVANDRO PEREIRA DE VARGAS",null,"DEZEMBRO",15,"Pregação (programa Colportagem)","Imbituba","Imbituba"]
[354,null,"EVANDRO PEREIRA DE VARGAS",null,"DEZEMBRO","22-29","Equipe Estudantes","AC","AC"]
[355,null,"EVANDRO PEREIRA DE VARGAS",null,"DEZEMBRO",null,null,null,{"$f":"IFERROR(VLOOKUP(H363,K237:L627,2,FALSE),\"\")","v":""}]
[356,null,"EVANDRO PEREIRA DE VARGAS",null,"DEZEMBRO",null,null,null,""]
[357,null,"EVANDRO PEREIRA DE VARGAS",null,"DEZEMBRO",null,null,null,""]
[358,null,"EVANDRO PEREIRA DE VARGAS",null,"DEZEMBRO",null,null,null,""]
[359,null,"EVANDRO PEREIRA DE VARGAS",null,"DEZEMBRO",null,null,null,""]
[360,null,"EVANDRO PEREIRA DE VARGAS",null,"DEZEMBRO",null,null,null,""]
[361,"FRANCISCO FRANCIEUDO FONSECA",{"$f":"IF(B369=0,C368,B369)","v":"FRANCISCO FRANCIEUDO FONSECA"},"JULHO","JULHO",7,"Aliança de Fé","Nova Brasília","Nova Brasília"]
[362,null,{"$f":"IF(B370=0,C369,B370)","v":"FRANCISCO FRANCIEUDO FONSECA"},null,"JULHO",14,"Aliança de Fé","Itapema","Itapema"]
[363,null,"FRANCISCO FRANCIEUDO FONSECA",null,"JULHO",16,"Aliança de Fé","Araranguá","Araranguá"]
[364,null,"FRANCISCO FRANCIEUDO FONSECA",null,"JULHO",21,"Férias",null,{"$f":"IFERROR(VLOOKUP(H372,K246:L636,2,FALSE),\"\")","v":""}]
[365,null,"FRANCISCO FRANCIEUDO FONSECA",null,"JULHO",null,null,null,{"$f":"IFERROR(VLOOKUP(H373,K252:L637,2,FALSE),\"\")","v":""}]
[366,null,"FRANCISCO FRANCIEUDO FONSECA",null,"JULHO",null,null,null,""]
[367,null,"FRANCISCO FRANCIEUDO FONSECA",null,"JULHO",null,null,null,""]
[368,null,"FRANCISCO FRANCIEUDO FONSECA",null,"JULHO",null,null,null,""]
[369,null,"FRANCISCO FRANCIEUDO FONSECA",null,"JULHO",null,null,null,""]
[370,null,"FRANCISCO FRANCIEUDO FONSECA",null,"JULHO",null,null,null,""]
[371,null,"FRANCISCO FRANCIEUDO FONSECA","AGOSTO","AGOSTO",4,"Aliança de Fé","Biguaçu","Biguaçu"]
[372,null,"FRANCISCO FRANCIEUDO FONSECA",null,"AGOSTO",11,"Aliança de Fé","Revoredo","Revoredo"]
[373,null,"FRANCISCO FRANCIEUDO FONSECA",null,"AGOSTO",18,"Aliança de Fé","Bom Retiro","Bom Retiro"]
[374,null,"FRANCISCO FRANCIEUDO FONSECA",null,"AGOSTO",25,"Aliança de Fé","Lages","Lages"]
[375,null,"FRANCISCO FRANCIEUDO FONSECA",null,"AGOSTO",null,null,null,{"$f":"IFERROR(VLOOKUP(H383,K262:L647,2,FALSE),\"\")","v":""}]
[376,null,"FRANCISCO FRANCIEUDO FONSECA",null,"AGOSTO",null,null,null,""]
[377,null,"FRANCISCO FRANCIEUDO FONSECA",null,"AGOSTO",null,null,null,""]
[378,null,"FRANCISCO FRANCIEUDO FONSECA",null,"AGOSTO",null,null,null,""]
[379,null,"FRANCISCO FRANCIEUDO FONSECA",null,"AGOSTO",null,null,null,""]
[380,null,"FRANCISCO FRANCIEUDO FONSECA",null,"AGOSTO",null,null,null,""]
[381,null,"FRANCISCO FRANCIEUDO FONSECA","SETEMBRO","SETEMBRO",1,"Aliança de Fé","São Vicente","São Vicente"]
[382,null,"FRANCISCO FRANCIEUDO FONSECA",null,"SETEMBRO",8,"Encontro Filhos de Obreiros CATRE","CATRE","CATRE"]
[383,null,"FRANCISCO FRANCIEUDO FONSECA",null,"SETEMBRO",15,"Aliança de Fé","Navegantes","Navegantes"]
[384,null,"FRANCISCO FRANCIEUDO FONSECA",null,"SETEMBRO",22,"Aliança de Fé","Imbituba","Imbituba"]
[385,null,"FRANCISCO FRANCIEUDO FONSECA",null,{"$f":"IF(D393=0,E392,D393)","v":"SETEMBRO"},29,"Ajuste",null,{"$f":"IFERROR(VLOOKUP(H393,K272:L656,2,FALSE),\"\")","v":""}]
[386,null,"FRANCISCO FRANCIEUDO FONSECA",null,"SETEMBRO",null,null,null,{"$f":"IFERROR(VLOOKUP(H394,K273:L658,2,FALSE),\"\")","v":""}]
[387,null,"FRANCISCO FRANCIEUDO FONSECA",null,"SETEMBRO",null,null,null,{"$f":"IFERROR(VLOOKUP(H395,K274:L659,2,FALSE),\"\")","v":""}]
[388,null,"FRANCISCO FRANCIEUDO FONSECA",null,"SETEMBRO",null,null,null,{"$f":"IFERROR(VLOOKUP(H396,K275:L660,2,FALSE),\"\")","v":""}]
[389,null,"FRANCISCO FRANCIEUDO FONSECA",null,"SETEMBRO",null,null,null,{"$f":"IFERROR(VLOOKUP(H397,K276:L681,2,FALSE),\"\")","v":""}]
[390,null,"FRANCISCO FRANCIEUDO FONSECA",null,"SETEMBRO",null,null,null,{"$f":"IFERROR(VLOOKUP(H398,K277:L682,2,FALSE),\"\")","v":""}]
[391,null,"FRANCISCO FRANCIEUDO FONSECA","OUTUBRO","OUTUBRO",6,"Aliança de Fé","Criciúma","Criciúma"]
[392,null,"FRANCISCO FRANCIEUDO FONSECA",null,"OUTUBRO",13,"Aliança de Fé","Balneário Camboriú","Balneário Camboriú"]
[393,null,"FRANCISCO FRANCIEUDO FONSECA",null,"OUTUBRO",20,"Aliança de Fé","Joaçaba","Joaçaba"]
[394,null,"FRANCISCO FRANCIEUDO FONSECA",null,"OUTUBRO","26-28","Santa Covocação (Seminário Teórico Prático)","AC","AC"]
[395,null,"FRANCISCO FRANCIEUDO FONSECA",null,"OUTUBRO"]
[396,null,"FRANCISCO FRANCIEUDO FONSECA",null,"OUTUBRO"]
[397,null,"FRANCISCO FRANCIEUDO FONSECA",null,"OUTUBRO"]
[398,null,"FRANCISCO FRANCIEUDO FONSECA",null,"OUTUBRO"]
[399,null,"FRANCISCO FRANCIEUDO FONSECA",null,"OUTUBRO"]
[400,null,"FRANCISCO FRANCIEUDO FONSECA",null,"OUTUBRO"]
[401,null,"FRANCISCO FRANCIEUDO FONSECA","NOVEMBRO","NOVEMBRO",3,"Aliança de Fé","Jardim Eldorado","Jardim Eldorado"]
[402,null,"FRANCISCO FRANCIEUDO FONSECA",null,"NOVEMBRO",10,"Aliança de Fé","Limoeiro","Limoeiro"]
[403,null,"FRANCISCO FRANCIEUDO FONSECA",null,"NOVEMBRO",17,"Aliança de Fé","Próspera","Próspera"]
[404,null,"FRANCISCO FRANCIEUDO FONSECA",null,"NOVEMBRO",24,"Aliança de Fé","Jardim Atlântico","Jardim Atlântico"]
[405,null,"FRANCISCO FRANCIEUDO FONSECA",null,"NOVEMBRO"]
[406,null,"FRANCISCO FRANCIEUDO FONSECA",null,"NOVEMBRO"]
[407,null,"FRANCISCO FRANCIEUDO FONSECA",null,"NOVEMBRO"]
[408,null,"FRANCISCO FRANCIEUDO FONSECA",null,"NOVEMBRO"]
[409,null,"FRANCISCO FRANCIEUDO FONSECA",null,"NOVEMBRO"]
[410,null,"FRANCISCO FRANCIEUDO FONSECA",null,"NOVEMBRO"]
[411,null,{"$f":"IF(B419=0,C398,B419)","v":"FRANCISCO FRANCIEUDO FONSECA"},"DEZEMBRO",{"$f":"IF(D419=0,E398,D419)","v":"DEZEMBRO"},1,"Aliança de Fé","Caminho Novo","Caminho Novo"]
[412,null,"FRANCISCO FRANCIEUDO FONSECA",null,"DEZEMBRO",8,"Aliança de Fé","Garopaba","Garopaba"]
[413,null,"FRANCISCO FRANCIEUDO FONSECA",null,"DEZEMBRO",15,"Ajuste",null,{"$f":"IFERROR(VLOOKUP(H421,K300:L684,2,FALSE),\"\")","v":""}]
[414,null,"FRANCISCO FRANCIEUDO FONSECA",null,"DEZEMBRO",null,null,null,{"$f":"IFERROR(VLOOKUP(H422,K301:L686,2,FALSE),\"\")","v":""}]
[415,null,"FRANCISCO FRANCIEUDO FONSECA",null,"DEZEMBRO",null,null,null,""]
[416,null,"FRANCISCO FRANCIEUDO FONSECA",null,"DEZEMBRO",null,null,null,""]
[417,null,"FRANCISCO FRANCIEUDO FONSECA",null,"DEZEMBRO",null,null,null,""]
[418,null,"FRANCISCO FRANCIEUDO FONSECA",null,"DEZEMBRO",null,null,null,""]
[419,null,"FRANCISCO FRANCIEUDO FONSECA",null,"DEZEMBRO",null,null,null,""]
[420,null,"FRANCISCO FRANCIEUDO FONSECA",null,"DEZEMBRO",null,null,null,""]
[421,"JEFERSON FORTES LORENZI",{"$f":"IF(B429=0,C428,B429)","v":"JEFERSON FORTES LORENZI"},"JULHO","JULHO","7 e 8","Escola de Evangelistas Voluntários","CATRE","CATRE"]
[422,null,{"$f":"IF(B430=0,C429,B430)","v":"JEFERSON FORTES LORENZI"},null,"JULHO",14,"Semana de Colheita","Parque Lisboa","Parque Lisboa"]
[423,null,"JEFERSON FORTES LORENZI",null,"JULHO",21,"Preparação Semana de Colheita","Barreiros","Barreiros"]
[424,null,"JEFERSON FORTES LORENZI",null,"JULHO",28,"Congresso Missionário","Palhoça","Palhoça"]
[425,null,"JEFERSON FORTES LORENZI",null,"JULHO",null,null,null,{"$f":"IFERROR(VLOOKUP(H433,K312:L697,2,FALSE),\"\")","v":""}]
[426,null,"JEFERSON FORTES LORENZI",null,"JULHO",null,null,null,""]
[427,null,"JEFERSON FORTES LORENZI",null,"JULHO",null,null,null,""]
[428,null,"JEFERSON FORTES LORENZI",null,"JULHO",null,null,null,""]
[429,null,"JEFERSON FORTES LORENZI",null,"JULHO",null,null,null,""]
[430,null,"JEFERSON FORTES LORENZI",null,"JULHO",null,null,null,""]
[431,null,"JEFERSON FORTES LORENZI","AGOSTO","AGOSTO",4,"Lançamento Colheita","Camboriú","Camboriú"]
[432,null,"JEFERSON FORTES LORENZI",null,"AGOSTO",11,"Semana de Colheita","Barreiros","Barreiros"]
[433,null,"JEFERSON FORTES LORENZI",null,"AGOSTO",18,"Encerramento Semana de Colheita","Barreiros","Barreiros"]
[434,null,"JEFERSON FORTES LORENZI",null,"AGOSTO",25,"Sermão","Santo Amaro da Imperatriz","Caminho Novo"]
[435,null,"JEFERSON FORTES LORENZI",null,"AGOSTO",null,null,null,{"$f":"IFERROR(VLOOKUP(H443,K322:L707,2,FALSE),\"\")","v":""}]
[436,null,"JEFERSON FORTES LORENZI",null,"AGOSTO",null,null,null,""]
[437,null,"JEFERSON FORTES LORENZI",null,"AGOSTO",null,null,null,""]
[438,null,"JEFERSON FORTES LORENZI",null,"AGOSTO",null,null,null,""]
[439,null,"JEFERSON FORTES LORENZI",null,"AGOSTO",null,null,null,""]
[440,null,"JEFERSON FORTES LORENZI",null,"AGOSTO",null,null,null,""]
[441,null,"JEFERSON FORTES LORENZI","SETEMBRO","SETEMBRO",1,"Semana de Colheita","Itajaí","Itajaí"]
[442,null,"JEFERSON FORTES LORENZI",null,"SETEMBRO",8,"Encerramento Semana de Colheita","Itajaí","Itajaí"]
[443,null,"JEFERSON FORTES LORENZI",null,"SETEMBRO",15,"Semana de Colheita","Tubarão","Tubarão"]
[444,null,"JEFERSON FORTES LORENZI",null,"SETEMBRO",22,"Preparação Semana de Colheita","Biguaçu","Biguaçu"]
[445,null,"JEFERSON FORTES LORENZI",null,"SETEMBRO",29,"Semana de Colheita","Camboriú","Camboriú"]
[446,null,"JEFERSON FORTES LORENZI",null,"SETEMBRO",null,null,null,{"$f":"IFERROR(VLOOKUP(H454,K333:L718,2,FALSE),\"\")","v":""}]
[447,null,"JEFERSON FORTES LORENZI",null,"SETEMBRO",null,null,null,{"$f":"IFERROR(VLOOKUP(H455,K334:L719,2,FALSE),\"\")","v":""}]
[448,null,"JEFERSON FORTES LORENZI",null,"SETEMBRO",null,null,null,{"$f":"IFERROR(VLOOKUP(H456,K335:L720,2,FALSE),\"\")","v":""}]
[449,null,"JEFERSON FORTES LORENZI",null,"SETEMBRO",null,null,null,{"$f":"IFERROR(VLOOKUP(H457,K336:L741,2,FALSE),\"\")","v":""}]
[450,null,"JEFERSON FORTES LORENZI",null,"SETEMBRO",null,null,null,{"$f":"IFERROR(VLOOKUP(H458,K337:L742,2,FALSE),\"\")","v":""}]
[451,null,"JEFERSON FORTES LORENZI","OUTUBRO","OUTUBRO",6,"Encerramento Semana de Colheita","Camboriú","Camboriú"]
[452,null,"JEFERSON FORTES LORENZI",null,"OUTUBRO",13,"Preparação Semana de Colheita","Tijucas","Tijucas"]
[453,null,"JEFERSON FORTES LORENZI",null,"OUTUBRO",20,"Semana de Colheita","Biguaçu","Biguaçu"]
[454,null,"JEFERSON FORTES LORENZI",null,"OUTUBRO",27,"Encerramento Semana de Colheita","Biguaçu","Biguaçu"]
[455,null,"JEFERSON FORTES LORENZI",null,"OUTUBRO"]
[456,null,"JEFERSON FORTES LORENZI",null,"OUTUBRO"]
[457,null,"JEFERSON FORTES LORENZI",null,"OUTUBRO"]
[458,null,"JEFERSON FORTES LORENZI",null,"OUTUBRO"]
[459,null,"JEFERSON FORTES LORENZI",null,"OUTUBRO"]
[460,null,"JEFERSON FORTES LORENZI",null,"OUTUBRO"]
[461,null,"JEFERSON FORTES LORENZI","NOVEMBRO","NOVEMBRO","03 a 10","Impacto Criciúma","AC","AC"]
[462,null,"JEFERSON FORTES LORENZI",null,"NOVEMBRO",17,"Sermão","Estreito","Estreito"]
[463,null,"JEFERSON FORTES LORENZI",null,"NOVEMBRO",24,"Semana de Colheita","Tijucas","Tijucas"]
[464,null,"JEFERSON FORTES LORENZI",null,"NOVEMBRO"]
[465,null,"JEFERSON FORTES LORENZI",null,"NOVEMBRO"]
[466,null,"JEFERSON FORTES LORENZI",null,"NOVEMBRO"]
[467,null,"JEFERSON FORTES LORENZI",null,"NOVEMBRO"]
[468,null,"JEFERSON FORTES LORENZI",null,"NOVEMBRO"]
[469,null,"JEFERSON FORTES LORENZI",null,"NOVEMBRO"]
[470,null,"JEFERSON FORTES LORENZI",null,"NOVEMBRO"]
[471,null,{"$f":"IF(B479=0,C458,B479)","v":"JEFERSON FORTES LORENZI"},"DEZEMBRO",{"$f":"IF(D479=0,E458,D479)","v":"DEZEMBRO"},1,"Encerramento Semana de Colheita","Tijucas","Tijucas"]
[472,null,"JEFERSON FORTES LORENZI",null,"DEZEMBRO",8,"Sermão","Ingleses","Ingleses"]
[473,null,"JEFERSON FORTES LORENZI",null,"DEZEMBRO",15,"Sermão","Rio Tavares","Rio Tavares"]
[474,null,"JEFERSON FORTES LORENZI",null,"DEZEMBRO",null,null,null,{"$f":"IFERROR(VLOOKUP(H482,K361:L746,2,FALSE),\"\")","v":""}]
[475,null,"JEFERSON FORTES LORENZI",null,"DEZEMBRO",null,null,null,""]
[476,null,"JEFERSON FORTES LORENZI",null,"DEZEMBRO",null,null,null,""]
[477,null,"JEFERSON FORTES LORENZI",null,"DEZEMBRO",null,null,null,""]
[478,null,"JEFERSON FORTES LORENZI",null,"DEZEMBRO",null,null,null,""]
[479,null,"JEFERSON FORTES LORENZI",null,"DEZEMBRO",null,null,null,""]
[480,null,"JEFERSON FORTES LORENZI",null,"DEZEMBRO",null,null,null,""]
[481,"JOÃO NICOLAU GONÇALVES",{"$f":"IF(B489=0,C488,B489)","v":"JOÃO NICOLAU GONÇALVES"},"JULHO","JULHO",7,"Pregação, Treinamento e Visitação","Parque Lisboa","Parque Lisboa"]
[482,null,{"$f":"IF(B490=0,C489,B490)","v":"JOÃO NICOLAU GONÇALVES"},null,"JULHO",14,"Pregação, Treinamento e Visitação","Lageado Baixo","Lageado Baixo"]
[483,null,"JOÃO NICOLAU GONÇALVES",null,"JULHO",21,"Férias",null,{"$f":"IFERROR(VLOOKUP(H491,K370:L755,2,FALSE),\"\")","v":""}]
[484,null,"JOÃO NICOLAU GONÇALVES",null,"JULHO",28,"Pregação, Treinamento e Visitação","Caminho Novo","Caminho Novo"]
[485,null,"JOÃO NICOLAU GONÇALVES",null,"JULHO",null,null,null,{"$f":"IFERROR(VLOOKUP(H493,K372:L757,2,FALSE),\"\")","v":""}]
[486,null,"JOÃO NICOLAU GONÇALVES",null,"JULHO",null,null,null,""]
[487,null,"JOÃO NICOLAU GONÇALVES",null,"JULHO",null,null,null,""]
[488,null,"JOÃO NICOLAU GONÇALVES",null,"JULHO",null,null,null,""]
[489,null,"JOÃO NICOLAU GONÇALVES",null,{"$f":"IF(D497=0,E496,D497)","v":"JULHO"},null,null,null,""]
[490,null,"JOÃO NICOLAU GONÇALVES",null,"JULHO",null,null,null,""]
[491,null,"JOÃO NICOLAU GONÇALVES","AGOSTO",{"$f":"IF(D499=0,E498,D499)","v":"AGOSTO"},4,"Pregação, Treinamento e Visitação","São Joaquim","São Joaquim"]
[492,null,"JOÃO NICOLAU GONÇALVES",null,"AGOSTO",11,"Pregação, Treinamento e Visitação","Nova Brasília","Nova Brasília"]
[493,null,"JOÃO NICOLAU GONÇALVES",null,"AGOSTO",18,"Pregação, Treinamento e Visitação","Biguaçu","Biguaçu"]
[494,null,"JOÃO NICOLAU GONÇALVES",null,"AGOSTO",25,"Pregação, Treinamento e Visitação","Revoredo","Revoredo"]
[495,null,"JOÃO NICOLAU GONÇALVES",null,"AGOSTO",null,null,null,{"$f":"IFERROR(VLOOKUP(H503,K382:L767,2,FALSE),\"\")","v":""}]
[496,null,"JOÃO NICOLAU GONÇALVES",null,"AGOSTO",null,null,null,""]
[497,null,"JOÃO NICOLAU GONÇALVES",null,"AGOSTO",null,null,null,""]
[498,null,"JOÃO NICOLAU GONÇALVES",null,"AGOSTO",null,null,null,""]
[499,null,"JOÃO NICOLAU GONÇALVES",null,"AGOSTO",null,null,null,""]
[500,null,"JOÃO NICOLAU GONÇALVES",null,"AGOSTO",null,null,null,""]
[501,null,"JOÃO NICOLAU GONÇALVES","SETEMBRO","SETEMBRO",1,"Pregação, Treinamento e Visitação","Tubarão","Tubarão"]
[502,null,"JOÃO NICOLAU GONÇALVES",null,"SETEMBRO",8,"Pregação, Treinamento e Visitação","Lagoa da Conceição","Rio Tavares"]
[503,null,"JOÃO NICOLAU GONÇALVES",null,"SETEMBRO",15,"Pregação e Convenção ","Itapema","Itapema"]
[504,null,"JOÃO NICOLAU GONÇALVES",null,"SETEMBRO",22,"Pregação, Treinamento e Visitação","Campinas","Campinas"]
[505,null,"JOÃO NICOLAU GONÇALVES",null,"SETEMBRO",29,"Pregação e Convenção ","Bairro dos Municipios","Balneário Camboriú"]
[506,null,"JOÃO NICOLAU GONÇALVES",null,"SETEMBRO",null,null,null,{"$f":"IFERROR(VLOOKUP(H514,K393:L778,2,FALSE),\"\")","v":""}]
[507,null,"JOÃO NICOLAU GONÇALVES",null,"SETEMBRO",null,null,null,{"$f":"IFERROR(VLOOKUP(H515,K394:L779,2,FALSE),\"\")","v":""}]
[508,null,"JOÃO NICOLAU GONÇALVES",null,"SETEMBRO",null,null,null,{"$f":"IFERROR(VLOOKUP(H516,K395:L785,2,FALSE),\"\")","v":""}]
[509,null,"JOÃO NICOLAU GONÇALVES",null,"SETEMBRO",null,null,null,{"$f":"IFERROR(VLOOKUP(H517,K396:L806,2,FALSE),\"\")","v":""}]
[510,null,"JOÃO NICOLAU GONÇALVES",null,"SETEMBRO",null,null,null,{"$f":"IFERROR(VLOOKUP(H518,K397:L807,2,FALSE),\"\")","v":""}]
[511,null,"JOÃO NICOLAU GONÇALVES","OUTUBRO","OUTUBRO",6,"Pregação, Treinamento e Visitação","Limoeiro","Limoeiro"]
[512,null,"JOÃO NICOLAU GONÇALVES",null,"OUTUBRO",13,"Pregação, Treinamento e Visitação","Bom Retiro","Bom Retiro"]
[513,null,"JOÃO NICOLAU GONÇALVES",null,"OUTUBRO",20,"Pregação Planta Maluche","Planta Maluche","Brusque"]
[514,null,"JOÃO NICOLAU GONÇALVES",null,"OUTUBRO",27,"Pregação e Convenção ","Navegantes","Navegantes"]
[515,null,"JOÃO NICOLAU GONÇALVES",null,"OUTUBRO"]
[516,null,"JOÃO NICOLAU GONÇALVES",null,"OUTUBRO"]
[517,null,"JOÃO NICOLAU GONÇALVES",null,"OUTUBRO"]
[518,null,"JOÃO NICOLAU GONÇALVES",null,"OUTUBRO"]
[519,null,"JOÃO NICOLAU GONÇALVES",null,"OUTUBRO"]
[520,null,"JOÃO NICOLAU GONÇALVES",null,"OUTUBRO"]
[521,null,"JOÃO NICOLAU GONÇALVES","NOVEMBRO","NOVEMBRO",3,"Pregação, Treinamento e Visitação","Estreito","Estreito"]
[522,null,"JOÃO NICOLAU GONÇALVES",null,"NOVEMBRO",10,"Impacto Criciúma","AC","AC"]
[523,null,"JOÃO NICOLAU GONÇALVES",null,"NOVEMBRO",17,"Pregação, Treinamento e Visitação","Santa Helena","Várzea"]
[524,null,"JOÃO NICOLAU GONÇALVES",null,"NOVEMBRO",24,"Aventuri","Canelinha","Tijucas"]
[525,null,"JOÃO NICOLAU GONÇALVES",null,"NOVEMBRO"]
[526,null,"JOÃO NICOLAU GONÇALVES",null,"NOVEMBRO"]
[527,null,"JOÃO NICOLAU GONÇALVES",null,"NOVEMBRO"]
[528,null,"JOÃO NICOLAU GONÇALVES",null,"NOVEMBRO"]
[529,null,"JOÃO NICOLAU GONÇALVES",null,"NOVEMBRO"]
[530,null,"JOÃO NICOLAU GONÇALVES",null,"NOVEMBRO"]
[531,null,{"$f":"IF(B539=0,C518,B539)","v":"JOÃO NICOLAU GONÇALVES"},"DEZEMBRO",{"$f":"IF(D539=0,E518,D539)","v":"DEZEMBRO"},1,"Pregação, Treinamento e Visitação","Laguna","Laguna"]
[532,null,"JOÃO NICOLAU GONÇALVES",null,"DEZEMBRO",8,"Pregação","Primavera","Universitário"]
[533,null,"JOÃO NICOLAU GONÇALVES",null,"DEZEMBRO",15,"Pregação, Treinamento e Visitação","Ingleses","Ingleses"]
[534,null,"JOÃO NICOLAU GONÇALVES",null,"DEZEMBRO",22,"Pregação","Garopaba","Garopaba"]
[535,null,"JOÃO NICOLAU GONÇALVES",null,"DEZEMBRO",null,null,null,{"$f":"IFERROR(VLOOKUP(H543,K422:L812,2,FALSE),\"\")","v":""}]
[536,null,"JOÃO NICOLAU GONÇALVES",null,"DEZEMBRO",null,null,null,""]
[537,null,"JOÃO NICOLAU GONÇALVES",null,"DEZEMBRO",null,null,null,""]
[538,null,"JOÃO NICOLAU GONÇALVES",null,"DEZEMBRO",null,null,null,""]
[539,null,"JOÃO NICOLAU GONÇALVES",null,"DEZEMBRO",null,null,null,""]
[540,null,"JOÃO NICOLAU GONÇALVES",null,"DEZEMBRO",null,null,null,""]
[541,"JOEL MORAIS",{"$f":"IF(B549=0,C548,B549)","v":"JOEL MORAIS"},"JULHO",{"$f":"IF(D549=0,E548,D549)","v":"JULHO"},1,"TREINAMENTO GPS","AC","AC"]
[542,null,{"$f":"IF(B550=0,C549,B550)","v":"JOEL MORAIS"},null,"JULHO",7,"CATRE","CATRE","CATRE"]
[543,null,"JOEL MORAIS",null,"JULHO",14,"Investidura ","Dunas","Ingleses"]
[544,null,"JOEL MORAIS",null,"JULHO","14-15","Anciori Sul  - Distrital",null,"São Martinho"]
[545,null,"JOEL MORAIS",null,"JULHO",15,"Reunião de Diretores","Imbituba","Imbituba"]
[546,null,"JOEL MORAIS",null,"JULHO",21,"Pregação","Camboriú","Camboriú"]
[547,null,"JOEL MORAIS",null,"JULHO",28,"Congresso Mundial","Kussel","Alemanha"]
[548,null,"JOEL MORAIS",null,"JULHO",null,null,null,{"$f":"IFERROR(VLOOKUP(H556,K435:L825,2,FALSE),\"\")","v":""}]
[549,null,"JOEL MORAIS",null,"JULHO",null,null,null,{"$f":"IFERROR(VLOOKUP(H557,K436:L826,2,FALSE),\"\")","v":""}]
[550,null,"JOEL MORAIS",null,"JULHO",null,null,null,{"$f":"IFERROR(VLOOKUP(H558,K437:L827,2,FALSE),\"\")","v":""}]
[551,null,"JOEL MORAIS","AGOSTO","AGOSTO","4 a 11","Congresso Mundial","Kussel","Alemanha"]
[552,null,"JOEL MORAIS",null,"AGOSTO",18,"1º Hora Pregação","Santo Amaro","Caminho Novo"]
[553,null,"JOEL MORAIS",null,"AGOSTO","18-19","Anciori Norte - Distrital em Itapema",null,"Itapema"]
[null,null,null,null,"AGOSTO","18-19","Anciori Norte - Distrital em Itapema",null,"Balneário Camboriú"]
[null,null,null,null,"AGOSTO","18-19","Anciori Norte - Distrital em Itapema",null,"Camboriú"]
[null,null,null,null,"AGOSTO","18-19","Anciori Norte - Distrital em Itapema",null,"Espaço Vida e Saúde"]
[null,null,null,null,"AGOSTO","18-19","Anciori Norte - Distrital em Itapema",null,"Itajaí"]
[null,null,null,null,"AGOSTO","18-19","Anciori Norte - Distrital em Itapema",null,"Navegantes"]
[null,null,null,null,"AGOSTO","18-19","Anciori Norte - Distrital em Itapema",null,"São Vicente"]
[null,null,null,null,"AGOSTO","18-19","Anciori Norte - Distrital em Itapema",null,"Tijucas"]
[null,null,null,null,"AGOSTO","18-19","Anciori Norte - Distrital em Itapema",null,"Brusque"]
[null,null,null,null,"AGOSTO","18-19","Anciori Norte - Distrital em Itapema",null,"Lageado Baixo"]
[null,null,null,null,"AGOSTO","18-19","Anciori Norte - Distrital em Itapema",null,"Limoeiro"]
[554,null,{"$f":"IF(B572=0,C561,B572)","v":"JOEL MORAIS"},null,{"$f":"IF(D572=0,E561,D572)","v":"AGOSTO"},25,"Pregação ","Azambuja","Brusque"]
[555,null,"JOEL MORAIS",null,"AGOSTO",26,"Olimpori - Distrital",null,"Brusque"]
[null,null,null,null,"AGOSTO",26,"Olimpori - Distrital",null,"Lageado Baixo"]
[null,null,null,null,"AGOSTO",26,"Olimpori - Distrital",null,"Limoeiro"]
[556,null,{"$f":"IF(B576=0,C573,B576)","v":"JOEL MORAIS"},null,{"$f":"IF(D576=0,E573,D576)","v":"AGOSTO"},26,"Comemoração","Brilhante II","Limoeiro"]
[557,null,"JOEL MORAIS",null,"AGOSTO",31,"II Enduro","Grão Pará","São Martinho"]
[558,null,"JOEL MORAIS",null,"AGOSTO"]
[559,null,"JOEL MORAIS",null,"AGOSTO",null,null,null,{"$f":"IFERROR(VLOOKUP(H579,K446:L836,2,FALSE),\"\")","v":""}]
[560,null,"JOEL MORAIS",null,"AGOSTO",null,null,null,{"$f":"IFERROR(VLOOKUP(H580,K447:L837,2,FALSE),\"\")","v":""}]
[561,null,"JOEL MORAIS","SETEMBRO","SETEMBRO","1 a 2","II Enduro","Grão Pará","São Martinho"]
[562,null,"JOEL MORAIS",null,"SETEMBRO",8,"Pregação","Porto de Itajaí","Espaço Vida e Saúde"]
[563,null,"JOEL MORAIS",null,"SETEMBRO",9,"Festival de Ordem Unida","Estreito","Estreito"]
[564,null,"JOEL MORAIS",null,"SETEMBRO",9,"Culto","Estreito","Estreito"]
[565,null,"JOEL MORAIS",null,"SETEMBRO",14,"RECILCLAGEM","AC","AC "]
[566,null,"JOEL MORAIS",null,"SETEMBRO",15,"Dia Mundial ","Coloninha","Araranguá"]
[567,null,"JOEL MORAIS",null,"SETEMBRO",22,"Comemoração","Jardim Eldorado","Jardim Eldorado"]
[568,null,"JOEL MORAIS",null,{"$f":"IF(D588=0,E587,D588)","v":"SETEMBRO"},23,"Especialoidades Samia ","Imbitiba","Imbituba"]
[569,null,"JOEL MORAIS",null,"SETEMBRO"]
[570,null,"JOEL MORAIS",null,"SETEMBRO",null,null,null,{"$f":"IFERROR(VLOOKUP(H590,K457:L847,2,FALSE),\"\")","v":""}]
[571,null,"JOEL MORAIS","OUTUBRO","OUTUBRO",6,"Sermão","Itapema","Itapema"]
[572,null,"JOEL MORAIS",null,"OUTUBRO",7,"Plantador Intensivo","CATRE","CATRE"]
[573,null,"JOEL MORAIS",null,"OUTUBRO","12 a 13","Camponi Norte","Canelinha","Tijucas"]
[574,null,"JOEL MORAIS",null,"OUTUBRO",13,"Camponi Sul",null,"Criciúma"]
[575,null,"JOEL MORAIS",null,"OUTUBRO",14,"Camponi Serra",null,"Lages "]
[576,null,"JOEL MORAIS",null,"OUTUBRO",19,"??"]
[577,null,"JOEL MORAIS",null,"OUTUBRO",20,"??"]
[578,null,"JOEL MORAIS",null,"OUTUBRO",21,"Olimpori 9 região","Itajai","Itajaí"]
[579,null,"JOEL MORAIS",null,"OUTUBRO",26,"??"]
[null,null,null,null,"OUTUBRO",27,"Pregação ","Canto Grande","Itapema"]
[580,null,{"$f":"IF(B601=0,C599,B601)","v":"JOEL MORAIS"},null,"OUTUBRO",28,"??"]
[581,null,"JOEL MORAIS","NOVEMBRO","NOVEMBRO",1,"Abertura Camponi 2ª  Região - Distrital","??","Ingleses"]
[582,null,"JOEL MORAIS",null,"NOVEMBRO",2,"Aventuri ACP","ACP","ACP"]
[583,null,"JOEL MORAIS",null,"NOVEMBRO",3,"Camponi Norte - Distrital",null,"Balneário Camboriú"]
[null,null,null,null,"NOVEMBRO",3,"Camponi Norte - Distrital",null,"Camboriú"]
[null,null,null,null,"NOVEMBRO",3,"Camponi Norte - Distrital",null,"Espaço Vida e Saúde"]
[null,null,null,null,"NOVEMBRO",3,"Camponi Norte - Distrital",null,"Itapema"]
[null,null,null,null,"NOVEMBRO",3,"Camponi Norte - Distrital",null,"Navegantes"]
[null,null,null,null,"NOVEMBRO",3,"Camponi Norte - Distrital",null,"São Vicente"]
[null,null,null,null,"NOVEMBRO",3,"Camponi Norte - Distrital",null,"Tijucas"]
[null,null,null,null,"NOVEMBRO",3,"Camponi Norte - Distrital",null,"Brusque"]
[null,null,null,null,"NOVEMBRO",3,"Camponi Norte - Distrital",null,"Lageado Baixo"]
[null,null,null,null,"NOVEMBRO",3,"Camponi Norte - Distrital",null,"Limoeiro"]
[584,null,{"$f":"IF(B614=0,C604,B614)","v":"JOEL MORAIS"},null,"NOVEMBRO",10,"Investidura ","Joaçaba","Joaçaba"]
[585,null,"JOEL MORAIS",null,"NOVEMBRO",16,"Camponi  1ª Região","ANC","ANC"]
[586,null,"JOEL MORAIS",null,"NOVEMBRO",17,"Campori de Jovens","USB","USB"]
[587,null,"JOEL MORAIS",null,"NOVEMBRO","23-25","XIII Aventuri","AC","AC"]
[588,null,"JOEL MORAIS",null,"NOVEMBRO"]
[589,null,"JOEL MORAIS",null,"NOVEMBRO"]
[590,null,"JOEL MORAIS",null,"NOVEMBRO"]
[591,null,{"$f":"IF(B621=0,C590,B621)","v":"JOEL MORAIS"},"DEZEMBRO",{"$f":"IF(D621=0,E590,D621)","v":"DEZEMBRO"},null,null,null,{"$f":"IFERROR(VLOOKUP(H621,K458:L848,2,FALSE),\"\")","v":""}]
[592,null,"JOEL MORAIS",null,"DEZEMBRO",null,null,null,{"$f":"IFERROR(VLOOKUP(H622,K479:L849,2,FALSE),\"\")","v":""}]
[593,null,"JOEL MORAIS",null,"DEZEMBRO",null,null,null,""]
[594,null,"JOEL MORAIS",null,"DEZEMBRO",null,null,null,""]
[595,null,"JOEL MORAIS",null,"DEZEMBRO",null,null,null,""]
[596,null,"JOEL MORAIS",null,"DEZEMBRO",null,null,null,""]
[597,null,"JOEL MORAIS",null,"DEZEMBRO",null,null,null,""]
[598,null,"JOEL MORAIS",null,"DEZEMBRO",null,null,null,""]
[599,null,"JOEL MORAIS",null,"DEZEMBRO",null,null,null,""]
[600,null,"JOEL MORAIS",null,{"$f":"IF(D630=0,E629,D630)","v":"DEZEMBRO"},null,null,null,""]
[601,"LEANDRO MUNIZ DA SILVA",{"$f":"IF(B631=0,C630,B631)","v":"LEANDRO MUNIZ DA SILVA"},"JULHO",{"$f":"IF(D631=0,E630,D631)","v":"JULHO"},7,"Pregação","Joaçaba","Joaçaba"]
[602,null,{"$f":"IF(B632=0,C631,B632)","v":"LEANDRO MUNIZ DA SILVA"},null,"JULHO",14,"Campanha de Estudantes","AC","AC"]
[603,null,"LEANDRO MUNIZ DA SILVA",null,"JULHO",21,"Campanha de Estudantes","AC","AC"]
[604,null,"LEANDRO MUNIZ DA SILVA",null,"JULHO",28,"Pregação","Itajaí","Itajaí"]
[605,null,"LEANDRO MUNIZ DA SILVA",null,"JULHO",null,null,null,{"$f":"IFERROR(VLOOKUP(H635,K492:L862,2,FALSE),\"\")","v":""}]
[606,null,"LEANDRO MUNIZ DA SILVA",null,"JULHO",null,null,null,""]
[607,null,"LEANDRO MUNIZ DA SILVA",null,"JULHO",null,null,null,""]
[608,null,"LEANDRO MUNIZ DA SILVA",null,"JULHO",null,null,null,""]
[609,null,"LEANDRO MUNIZ DA SILVA",null,"JULHO",null,null,null,""]
[610,null,"LEANDRO MUNIZ DA SILVA",null,"JULHO",null,null,null,""]
[611,null,"LEANDRO MUNIZ DA SILVA","AGOSTO","AGOSTO",4,"Campanha de Estudantes","AC","AC"]
[612,null,"LEANDRO MUNIZ DA SILVA",null,"AGOSTO",11,"Campanha de Estudantes","AC","AC"]
[613,null,"LEANDRO MUNIZ DA SILVA",null,"AGOSTO",18,"Pregação com enfâse na divugação da colportagem e crescimento do CRM","Jardim Atlântico","Jardim Atlântico"]
[614,null,"LEANDRO MUNIZ DA SILVA",null,"AGOSTO",25,"Pregação com enfâse na divugação da colportagem e crescimento do CRM","Roçado","Jardim Atlântico"]
[615,null,"LEANDRO MUNIZ DA SILVA",null,"AGOSTO",null,null,null,{"$f":"IFERROR(VLOOKUP(H645,K502:L872,2,FALSE),\"\")","v":""}]
[616,null,"LEANDRO MUNIZ DA SILVA",null,"AGOSTO",null,null,null,{"$f":"IFERROR(VLOOKUP(H646,K503:L873,2,FALSE),\"\")","v":""}]
[617,null,"LEANDRO MUNIZ DA SILVA",null,"AGOSTO",null,null,null,{"$f":"IFERROR(VLOOKUP(H647,K504:L874,2,FALSE),\"\")","v":""}]
[618,null,"LEANDRO MUNIZ DA SILVA",null,"AGOSTO",null,null,null,{"$f":"IFERROR(VLOOKUP(H648,K505:L875,2,FALSE),\"\")","v":""}]
[619,null,"LEANDRO MUNIZ DA SILVA",null,"AGOSTO",null,null,null,{"$f":"IFERROR(VLOOKUP(H649,K506:L875,2,FALSE),\"\")","v":""}]
[620,null,"LEANDRO MUNIZ DA SILVA",null,"AGOSTO",null,null,null,{"$f":"IFERROR(VLOOKUP(H650,K507:L875,2,FALSE),\"\")","v":""}]
[621,null,"LEANDRO MUNIZ DA SILVA","SETEMBRO","SETEMBRO",1,"Pregação com enfâse na divugação da colportagem e crescimento do CRM","Nova Brasília","Nova Brasília"]
[622,null,"LEANDRO MUNIZ DA SILVA",null,"SETEMBRO",15,"Encontro de líderes ","UNASP","UNASP"]
[623,null,"LEANDRO MUNIZ DA SILVA",null,"SETEMBRO",22,"Pregação com enfâse na divugação da colportagem e crescimento do CRM","São João-Itajaí","São Vicente"]
[624,null,"LEANDRO MUNIZ DA SILVA",null,"SETEMBRO",29,"Pregação com enfâse na divugação da colportagem e crescimento do CRM","Itajaí","Itajaí"]
[625,null,"LEANDRO MUNIZ DA SILVA",null,"SETEMBRO",null,null,null,{"$f":"IFERROR(VLOOKUP(H655,K512:L875,2,FALSE),\"\")","v":""}]
[626,null,"LEANDRO MUNIZ DA SILVA",null,"SETEMBRO",null,null,null,{"$f":"IFERROR(VLOOKUP(H656,K513:L875,2,FALSE),\"\")","v":""}]
[627,null,"LEANDRO MUNIZ DA SILVA",null,"SETEMBRO",null,null,null,{"$f":"IFERROR(VLOOKUP(H657,K514:L875,2,FALSE),\"\")","v":""}]
[628,null,"LEANDRO MUNIZ DA SILVA",null,{"$f":"IF(D658=0,E657,D658)","v":"SETEMBRO"},null,null,null,{"$f":"IFERROR(VLOOKUP(H658,K515:L875,2,FALSE),\"\")","v":""}]
[629,null,"LEANDRO MUNIZ DA SILVA",null,"SETEMBRO",null,null,null,{"$f":"IFERROR(VLOOKUP(H659,K516:L875,2,FALSE),\"\")","v":""}]
[630,null,"LEANDRO MUNIZ DA SILVA",null,"SETEMBRO",null,null,null,{"$f":"IFERROR(VLOOKUP(H660,K517:L875,2,FALSE),\"\")","v":""}]
[631,null,"LEANDRO MUNIZ DA SILVA","OUTUBRO","OUTUBRO",6,"Semana da Colportagem ","IAP","IAP"]
[632,null,"LEANDRO MUNIZ DA SILVA",null,"OUTUBRO",20,"Pregação com enfâse na divugação da colportagem e crescimento do CRM","Divinéia","Imbituba"]
[633,null,"LEANDRO MUNIZ DA SILVA",null,"OUTUBRO",27,"Semana da Colportagem ","UNASP","UNASP"]
[634,null,"LEANDRO MUNIZ DA SILVA",null,"OUTUBRO"]
[635,null,"LEANDRO MUNIZ DA SILVA",null,"OUTUBRO"]
[636,null,"LEANDRO MUNIZ DA SILVA",null,"OUTUBRO"]
[637,null,"LEANDRO MUNIZ DA SILVA",null,"OUTUBRO"]
[638,null,"LEANDRO MUNIZ DA SILVA",null,"OUTUBRO"]
[639,null,"LEANDRO MUNIZ DA SILVA",null,"OUTUBRO"]
[640,null,"LEANDRO MUNIZ DA SILVA",null,"OUTUBRO"]
[641,null,"LEANDRO MUNIZ DA SILVA","NOVEMBRO","NOVEMBRO",3,"Pregação com enfâse na divugação da colportagem e crescimento do CRM","Tijucas","Tijucas"]
[642,null,"LEANDRO MUNIZ DA SILVA",null,"NOVEMBRO",10,"Evangelismo Criciuma - será definida a igreja depois","AC","AC"]
[643,null,"LEANDRO MUNIZ DA SILVA",null,"NOVEMBRO",17,"Pregação com enfâse na divugação da colportagem e crescimento do CRM","Bela Vista I","Jardim Atlântico"]
[644,null,"LEANDRO MUNIZ DA SILVA",null,"NOVEMBRO",24,"Pregação com enfâse na divugação da colportagem e crescimento do CRM","Coqueiros","Jardim Atlântico"]
[645,null,"LEANDRO MUNIZ DA SILVA",null,"NOVEMBRO"]
[646,null,"LEANDRO MUNIZ DA SILVA",null,"NOVEMBRO"]
[647,null,"LEANDRO MUNIZ DA SILVA",null,"NOVEMBRO"]
[648,null,"LEANDRO MUNIZ DA SILVA",null,"NOVEMBRO"]
[649,null,"LEANDRO MUNIZ DA SILVA",null,"NOVEMBRO"]
[650,null,"LEANDRO MUNIZ DA SILVA",null,"NOVEMBRO"]
[651,null,{"$f":"IF(B681=0,C660,B681)","v":"LEANDRO MUNIZ DA SILVA"},"DEZEMBRO",{"$f":"IF(D681=0,E660,D681)","v":"DEZEMBRO"},1,"Pregação com enfâse na divugação da colportagem e crescimento do CRM","Praia Brava","Balneário Camboriú"]
[652,null,"LEANDRO MUNIZ DA SILVA",null,"DEZEMBRO",8,"Pregação com enfâse na divugação da colportagem e crescimento do CRM","Vila Alvorada","Imbituba"]
[653,null,"LEANDRO MUNIZ DA SILVA",null,"DEZEMBRO",15,"Pregação com enfâse na divugação da colportagem e crescimento do CRM","Porto Belo","Itapema"]
[654,null,"LEANDRO MUNIZ DA SILVA",null,"DEZEMBRO",22,"Pregação com enfâse na divugação da colportagem e crescimento do CRM","Criciúma","Criciúma"]
[655,null,"LEANDRO MUNIZ DA SILVA",null,"DEZEMBRO",29,"Campanha de Estudantes","AC","AC"]
[656,null,"LEANDRO MUNIZ DA SILVA",null,"DEZEMBRO",null,null,null,{"$f":"IFERROR(VLOOKUP(H686,K543:L875,2,FALSE),\"\")","v":""}]
[657,null,"LEANDRO MUNIZ DA SILVA",null,"DEZEMBRO",null,null,null,{"$f":"IFERROR(VLOOKUP(H687,K544:L875,2,FALSE),\"\")","v":""}]
[658,null,"LEANDRO MUNIZ DA SILVA",null,"DEZEMBRO",null,null,null,{"$f":"IFERROR(VLOOKUP(H688,K545:L875,2,FALSE),\"\")","v":""}]
[659,null,"LEANDRO MUNIZ DA SILVA",null,"DEZEMBRO",null,null,null,{"$f":"IFERROR(VLOOKUP(H689,K546:L875,2,FALSE),\"\")","v":""}]
[660,null,"LEANDRO MUNIZ DA SILVA",null,"DEZEMBRO",null,null,null,{"$f":"IFERROR(VLOOKUP(H690,K547:L875,2,FALSE),\"\")","v":""}]
[661,"LUIZ HOMERO DE MATOS BUBNA",{"$f":"IF(B691=0,C690,B691)","v":"LUIZ HOMERO DE MATOS BUBNA"},"JULHO",{"$f":"IF(D691=0,E690,D691)","v":"JULHO"},7,"Promoção Educação Adventista","Madri","Caminho Novo"]
[662,null,{"$f":"IF(B692=0,C691,B692)","v":"LUIZ HOMERO DE MATOS BUBNA"},null,"JULHO","14-28","Férias",null,{"$f":"IFERROR(VLOOKUP(H692,K549:L875,2,FALSE),\"\")","v":""}]
[663,null,"LUIZ HOMERO DE MATOS BUBNA",null,"JULHO",null,null,null,{"$f":"IFERROR(VLOOKUP(H693,K550:L875,2,FALSE),\"\")","v":""}]
[664,null,"LUIZ HOMERO DE MATOS BUBNA",null,"JULHO",null,null,null,{"$f":"IFERROR(VLOOKUP(H694,K551:L875,2,FALSE),\"\")","v":""}]
[665,null,"LUIZ HOMERO DE MATOS BUBNA",null,"JULHO",null,null,null,{"$f":"IFERROR(VLOOKUP(H695,K552:L875,2,FALSE),\"\")","v":""}]
[666,null,"LUIZ HOMERO DE MATOS BUBNA",null,"JULHO",null,null,null,{"$f":"IFERROR(VLOOKUP(H696,K553:L875,2,FALSE),\"\")","v":""}]
[667,null,"LUIZ HOMERO DE MATOS BUBNA",null,"JULHO",null,null,null,{"$f":"IFERROR(VLOOKUP(H697,K554:L875,2,FALSE),\"\")","v":""}]
[668,null,"LUIZ HOMERO DE MATOS BUBNA",null,"JULHO",null,null,null,{"$f":"IFERROR(VLOOKUP(H698,K555:L875,2,FALSE),\"\")","v":""}]
[669,null,"LUIZ HOMERO DE MATOS BUBNA",null,"JULHO",null,null,null,{"$f":"IFERROR(VLOOKUP(H699,K556:L875,2,FALSE),\"\")","v":""}]
[670,null,"LUIZ HOMERO DE MATOS BUBNA",null,"JULHO",null,null,null,{"$f":"IFERROR(VLOOKUP(H700,K557:L875,2,FALSE),\"\")","v":""}]
[671,null,"LUIZ HOMERO DE MATOS BUBNA","AGOSTO","AGOSTO",4,"Promoção Educação Adventista","Porto de Itajaí","Espaço Vida e Saúde"]
[672,null,"LUIZ HOMERO DE MATOS BUBNA",null,"AGOSTO",11,"Promoção Educação Adventista","Criciúma","Criciúma"]
[673,null,"LUIZ HOMERO DE MATOS BUBNA",null,"AGOSTO",18,"Promoção Educação Adventista","Joaçaba","Joaçaba"]
[674,null,"LUIZ HOMERO DE MATOS BUBNA",null,"AGOSTO",25,"Promoção Educação Adventista","Itapema","Itapema"]
[675,null,"LUIZ HOMERO DE MATOS BUBNA",null,"AGOSTO"]
[676,null,"LUIZ HOMERO DE MATOS BUBNA",null,"AGOSTO",null,null,null,{"$f":"IFERROR(VLOOKUP(H706,K573:L875,2,FALSE),\"\")","v":""}]
[677,null,"LUIZ HOMERO DE MATOS BUBNA",null,"AGOSTO",null,null,null,{"$f":"IFERROR(VLOOKUP(H707,K576:L875,2,FALSE),\"\")","v":""}]
[678,null,"LUIZ HOMERO DE MATOS BUBNA",null,"AGOSTO",null,null,null,{"$f":"IFERROR(VLOOKUP(H708,K577:L875,2,FALSE),\"\")","v":""}]
[679,null,"LUIZ HOMERO DE MATOS BUBNA",null,"AGOSTO",null,null,null,{"$f":"IFERROR(VLOOKUP(H709,K578:L875,2,FALSE),\"\")","v":""}]
[680,null,"LUIZ HOMERO DE MATOS BUBNA",null,"AGOSTO",null,null,null,{"$f":"IFERROR(VLOOKUP(H710,K579:L875,2,FALSE),\"\")","v":""}]
[681,null,"LUIZ HOMERO DE MATOS BUBNA","SETEMBRO","SETEMBRO",1,"Promoção Educação Adventista","Antonio Carlos","Biguaçu"]
[682,null,"LUIZ HOMERO DE MATOS BUBNA",null,"SETEMBRO",15,"Promoção Educação Adventista","Ratones","Universitário"]
[683,null,"LUIZ HOMERO DE MATOS BUBNA",null,"SETEMBRO",22,"Promoção Educação Adventista","Jardim Progresso","São Vicente"]
[684,null,"LUIZ HOMERO DE MATOS BUBNA",null,"SETEMBRO",29,"Promoção Educação Adventista","Bom Retiro","Bom Retiro"]
[685,null,"LUIZ HOMERO DE MATOS BUBNA",null,"SETEMBRO",null,null,null,{"$f":"IFERROR(VLOOKUP(H715,K584:L875,2,FALSE),\"\")","v":""}]
[686,null,"LUIZ HOMERO DE MATOS BUBNA",null,"SETEMBRO",null,null,null,{"$f":"IFERROR(VLOOKUP(H716,K585:L875,2,FALSE),\"\")","v":""}]
[687,null,"LUIZ HOMERO DE MATOS BUBNA",null,"SETEMBRO",null,null,null,{"$f":"IFERROR(VLOOKUP(H717,K586:L875,2,FALSE),\"\")","v":""}]
[688,null,"LUIZ HOMERO DE MATOS BUBNA",null,"SETEMBRO",null,null,null,{"$f":"IFERROR(VLOOKUP(H718,K587:L875,2,FALSE),\"\")","v":""}]
[689,null,"LUIZ HOMERO DE MATOS BUBNA",null,"SETEMBRO",null,null,null,{"$f":"IFERROR(VLOOKUP(H719,K588:L875,2,FALSE),\"\")","v":""}]
[690,null,"LUIZ HOMERO DE MATOS BUBNA",null,"SETEMBRO",null,null,null,{"$f":"IFERROR(VLOOKUP(H720,K589:L875,2,FALSE),\"\")","v":""}]
[691,null,"LUIZ HOMERO DE MATOS BUBNA","OUTUBRO","OUTUBRO",6,"Promoção Educação Adventista","Jardim Eldorado","Jardim Eldorado"]
[692,null,"LUIZ HOMERO DE MATOS BUBNA",null,"OUTUBRO",13,"Promoção Educação Adventista","Lageado Baixo","Lageado Baixo"]
[693,null,"LUIZ HOMERO DE MATOS BUBNA",null,"OUTUBRO",20,"Promoção Educação Adventista","Próspera","Próspera"]
[694,null,"LUIZ HOMERO DE MATOS BUBNA",null,"OUTUBRO",27,"Promoção Educação Adventista","Forquilhinhas","Parque Lisboa"]
[695,null,"LUIZ HOMERO DE MATOS BUBNA",null,"OUTUBRO"]
[696,null,"LUIZ HOMERO DE MATOS BUBNA",null,"OUTUBRO"]
[697,null,"LUIZ HOMERO DE MATOS BUBNA",null,"OUTUBRO"]
[698,null,"LUIZ HOMERO DE MATOS BUBNA",null,"OUTUBRO"]
[699,null,"LUIZ HOMERO DE MATOS BUBNA",null,"OUTUBRO"]
[700,null,"LUIZ HOMERO DE MATOS BUBNA",null,"OUTUBRO"]
[701,null,"LUIZ HOMERO DE MATOS BUBNA","NOVEMBRO","NOVEMBRO",3,"Promoção Educação Adventista","Sambaqui","Universitario"]
[702,null,"LUIZ HOMERO DE MATOS BUBNA",null,"NOVEMBRO",10,"Promoção Educação Adventista","Balneário Camboriú","Balneário Camboriú"]
[703,null,"LUIZ HOMERO DE MATOS BUBNA",null,"NOVEMBRO",24,"Promoção Educação Adventista","Andrino","Tubarão"]
[704,null,"LUIZ HOMERO DE MATOS BUBNA",null,"NOVEMBRO"]
[705,null,"LUIZ HOMERO DE MATOS BUBNA",null,"NOVEMBRO"]
[706,null,"LUIZ HOMERO DE MATOS BUBNA",null,"NOVEMBRO"]
[707,null,"LUIZ HOMERO DE MATOS BUBNA",null,"NOVEMBRO"]
[708,null,"LUIZ HOMERO DE MATOS BUBNA",null,"NOVEMBRO"]
[709,null,"LUIZ HOMERO DE MATOS BUBNA",null,"NOVEMBRO"]
[710,null,"LUIZ HOMERO DE MATOS BUBNA",null,"NOVEMBRO"]
[711,null,{"$f":"IF(B741=0,C720,B741)","v":"LUIZ HOMERO DE MATOS BUBNA"},"DEZEMBRO",{"$f":"IF(D741=0,E720,D741)","v":"DEZEMBRO"},1,"Promoção Educação Adventista","Lagoa da Conceição","Rio Tavares"]
[712,null,"LUIZ HOMERO DE MATOS BUBNA",null,"DEZEMBRO",8,"Promoção Educação Adventista","Aririú","Caminho Novo"]
[713,null,"LUIZ HOMERO DE MATOS BUBNA",null,"DEZEMBRO",15,"Promoção Educação Adventista","Paciência","Limoeiro"]
[714,null,"LUIZ HOMERO DE MATOS BUBNA",null,"DEZEMBRO","22-29","Férias"]
[715,null,"LUIZ HOMERO DE MATOS BUBNA",null,"DEZEMBRO",null,null,null,{"$f":"IFERROR(VLOOKUP(H745,K624:L875,2,FALSE),\"\")","v":""}]
[716,null,"LUIZ HOMERO DE MATOS BUBNA",null,"DEZEMBRO",null,null,null,{"$f":"IFERROR(VLOOKUP(H746,K625:L875,2,FALSE),\"\")","v":""}]
[717,null,"LUIZ HOMERO DE MATOS BUBNA",null,"DEZEMBRO",null,null,null,{"$f":"IFERROR(VLOOKUP(H747,K626:L875,2,FALSE),\"\")","v":""}]
[718,null,"LUIZ HOMERO DE MATOS BUBNA",null,"DEZEMBRO",null,null,null,{"$f":"IFERROR(VLOOKUP(H748,K627:L875,2,FALSE),\"\")","v":""}]
[719,null,"LUIZ HOMERO DE MATOS BUBNA",null,"DEZEMBRO",null,null,null,""]
[720,null,"LUIZ HOMERO DE MATOS BUBNA",null,"DEZEMBRO",null,null,null,""]
[721,"OTACÍLIO SILVESTRE PORFÍRIO",{"$f":"IF(B751=0,C750,B751)","v":"OTACÍLIO SILVESTRE PORFÍRIO"},"JULHO",{"$f":"IF(D751=0,E750,D751)","v":"JULHO"},"3 a 31","Férias",null,""]
[722,null,{"$f":"IF(B752=0,C751,B752)","v":"OTACÍLIO SILVESTRE PORFÍRIO"},null,"JULHO",null,null,null,""]
[723,null,"OTACÍLIO SILVESTRE PORFÍRIO",null,"JULHO",null,null,null,""]
[724,null,"OTACÍLIO SILVESTRE PORFÍRIO",null,"JULHO",null,null,null,""]
[725,null,"OTACÍLIO SILVESTRE PORFÍRIO",null,"JULHO",null,null,null,""]
[726,null,"OTACÍLIO SILVESTRE PORFÍRIO",null,"JULHO",null,null,null,""]
[727,null,"OTACÍLIO SILVESTRE PORFÍRIO",null,"JULHO",null,null,null,""]
[728,null,"OTACÍLIO SILVESTRE PORFÍRIO",null,"JULHO",null,null,null,""]
[729,null,"OTACÍLIO SILVESTRE PORFÍRIO",null,"JULHO",null,null,null,""]
[730,null,"OTACÍLIO SILVESTRE PORFÍRIO",null,"JULHO",null,null,null,""]
[731,null,"OTACÍLIO SILVESTRE PORFÍRIO","AGOSTO","AGOSTO","1 a 4","Impact Europe",null,"Alemanha"]
[732,null,"OTACÍLIO SILVESTRE PORFÍRIO",null,"AGOSTO",10,"Identidade Jovem","Garopaba","Garopaba"]
[733,null,"OTACÍLIO SILVESTRE PORFÍRIO",null,"AGOSTO",11,"Sábado Total","Garopaba","Garopaba"]
[734,null,"OTACÍLIO SILVESTRE PORFÍRIO",null,"AGOSTO",18,"Simpósio Universitário","CAIT","CAIT"]
[735,null,"OTACÍLIO SILVESTRE PORFÍRIO",null,"AGOSTO","19 a 22","Planejamento USB","USB","USB"]
[736,null,"OTACÍLIO SILVESTRE PORFÍRIO",null,"AGOSTO",25,"Içara ","Içara","Içara"]
[737,null,"OTACÍLIO SILVESTRE PORFÍRIO",null,"AGOSTO",25,"Vigília Jovem Distrital (Região Litoral Norte)","Itajaí","Itajaí"]
[738,null,"OTACÍLIO SILVESTRE PORFÍRIO",null,"AGOSTO",26,"Domingo Especial","Termas do Gravatal","São Martinho"]
[739,null,"OTACÍLIO SILVESTRE PORFÍRIO",null,"AGOSTO",29,"Planejamento AC","AC ","AC "]
[740,null,"OTACÍLIO SILVESTRE PORFÍRIO",null,"AGOSTO",null,null,null,{"$f":"IFERROR(VLOOKUP(H770,K649:L897,2,FALSE),\"\")","v":""}]
[741,null,"OTACÍLIO SILVESTRE PORFÍRIO","SETEMBRO","SETEMBRO",1,"Sábado Total","Nova Brasília","Nova Brasília"]
[742,null,"OTACÍLIO SILVESTRE PORFÍRIO",null,"SETEMBRO",1,"Vigília Jovem Distrital (Região Norte)","Brusque","Brusque"]
[743,null,"OTACÍLIO SILVESTRE PORFÍRIO",null,"SETEMBRO",2,"Diálogo Musical","Brusque","Brusque"]
[744,null,"OTACÍLIO SILVESTRE PORFÍRIO",null,"SETEMBRO",8,"Sábado Total","Camboriú","Camboriú"]
[745,null,"OTACÍLIO SILVESTRE PORFÍRIO",null,"SETEMBRO",8,"Diálogo Musical (tarde)","Campinas","Campinas"]
[746,null,"OTACÍLIO SILVESTRE PORFÍRIO",null,"SETEMBRO",14,"Celebração Jovem","Araranguá","Araranguá"]
[747,null,"OTACÍLIO SILVESTRE PORFÍRIO",null,"SETEMBRO",15,"Sábado Total","Araranguá","Araranguá"]
[748,null,"OTACÍLIO SILVESTRE PORFÍRIO",null,"SETEMBRO",16,"Domingo Especial","Campinas","Campinas"]
[749,null,"OTACÍLIO SILVESTRE PORFÍRIO",null,{"$f":"IF(D779=0,E778,D779)","v":"SETEMBRO"},21,"Celebração Jovem","Lageado Baixo","Lageado Baixo"]
[null,null,null,null,"SETEMBRO",22,"Sábado Total","Lageado Baixo","Lageado Baixo"]
[null,null,null,null,"SETEMBRO",22,"Celebração Jovem","Camboriú","Camboriú"]
[null,null,null,null,"SETEMBRO",23,"Domingo Especial","Praia Comprida","Campinas"]
[null,null,null,null,"SETEMBRO",22,"Celebração Jovem","Camboriú","Camboriú"]
[null,null,null,null,"SETEMBRO",29,"Sábado Total","Universitária","Universitário"]
[750,null,{"$f":"IF(B785=0,C779,B785)","v":"OTACÍLIO SILVESTRE PORFÍRIO"},null,{"$f":"IF(D785=0,E779,D785)","v":"SETEMBRO"}]
[751,null,"OTACÍLIO SILVESTRE PORFÍRIO","OUTUBRO","OUTUBRO","1 a 5","Novas Gerações - São Paulo","São Paulo","São Paulo"]
[752,null,"OTACÍLIO SILVESTRE PORFÍRIO",null,"OUTUBRO",6,"Sábado Total","Florianópolis","Florianópolis"]
[753,null,"OTACÍLIO SILVESTRE PORFÍRIO",null,"OUTUBRO",6,"FEMUSA (Região Capital)","Estreito","Estreito"]
[null,null,null,null,"OUTUBRO",12,"FEMUSA (Região Norte)","Lageado Baixo","Lageado Baixo"]
[null,null,null,null,"OUTUBRO",13,"FEMUSA - (Região Sul e Serra)","Tubarão","Tubarão"]
[null,null,null,null,"OUTUBRO","20 a 27","Semana de Oração"]
[null,null,null,null,"OUTUBRO"]
[754,null,{"$f":"IF(B793=0,C788,B793)","v":"OTACÍLIO SILVESTRE PORFÍRIO"},null,"OUTUBRO"]
[755,null,"OTACÍLIO SILVESTRE PORFÍRIO",null,"OUTUBRO"]
[756,null,"OTACÍLIO SILVESTRE PORFÍRIO",null,"OUTUBRO"]
[761,null,{"$f":"IF(B796=0,#REF!,B796)","v":{"$error":"#REF!"}},"NOVEMBRO","NOVEMBRO",3,"Impacto Criciúma","São Joaquim","São Joaquim"]
[762,null,{"$error":"#REF!"},null,"NOVEMBRO",4,"Impacto Criciúma","AC","AC"]
[763,null,{"$error":"#REF!"},null,"NOVEMBRO",7,"Impacto Criciúma","AC","AC"]
[764,null,{"$error":"#REF!"},null,"NOVEMBRO",10,"Impacto Criciúma","AC","AC"]
[765,null,{"$error":"#REF!"},null,"NOVEMBRO","15 a 18","IV Campori de Jovens USB","USB","USB"]
[766,null,{"$error":"#REF!"},null,"NOVEMBRO",24,"Sábado Total","Jardim Atlântico","Jardim Atlântico"]
[767,null,{"$error":"#REF!"},null,"NOVEMBRO"]
[768,null,{"$error":"#REF!"},null,"NOVEMBRO"]
[769,null,{"$error":"#REF!"},null,"NOVEMBRO"]
[770,null,{"$error":"#REF!"},null,"NOVEMBRO"]
[771,null,{"$f":"IF(B806=0,C785,B806)","v":"OTACÍLIO SILVESTRE PORFÍRIO"},"DEZEMBRO",{"$f":"IF(D806=0,E785,D806)","v":"DEZEMBRO"},1,"Treinamento Líderes Missão Calebe (CATRE)","CATRE","CATRE"]
[772,null,"OTACÍLIO SILVESTRE PORFÍRIO",null,"DEZEMBRO",2,"CelebrAC (CATRE)","CATRE","CATRE"]
[773,null,"OTACÍLIO SILVESTRE PORFÍRIO",null,"DEZEMBRO","3 a 23","Send-Me","AC","AC"]
[774,null,"OTACÍLIO SILVESTRE PORFÍRIO",null,"DEZEMBRO",29,"Sábado Total","São Vicente","São Vicente"]
[775,null,"OTACÍLIO SILVESTRE PORFÍRIO",null,"DEZEMBRO",null,null,null,{"$f":"IFERROR(VLOOKUP(H810,K684:L912,2,FALSE),\"\")","v":""}]
[776,null,"OTACÍLIO SILVESTRE PORFÍRIO",null,{"$f":"IF(D811=0,E810,D811)","v":"DEZEMBRO"},null,null,null,""]
[777,null,"OTACÍLIO SILVESTRE PORFÍRIO",null,"DEZEMBRO",null,null,null,""]
[778,null,{"$f":"IF(B813=0,C812,B813)","v":"OTACÍLIO SILVESTRE PORFÍRIO"},null,"DEZEMBRO",null,null,null,""]
[779,null,"OTACÍLIO SILVESTRE PORFÍRIO",null,"DEZEMBRO",null,null,null,""]
[780,null,{"$f":"IF(B815=0,C814,B815)","v":"OTACÍLIO SILVESTRE PORFÍRIO"},null,"DEZEMBRO",null,null,null,""]
[781,"SIMEI MELLO GUEDES PORFÍRIO",{"$f":"IF(B816=0,C815,B816)","v":"SIMEI MELLO GUEDES PORFÍRIO"},"JULHO",{"$f":"IF(D816=0,E815,D816)","v":"JULHO"},"3 a 31","Férias"]
[782,null,{"$f":"IF(B817=0,C816,B817)","v":"SIMEI MELLO GUEDES PORFÍRIO"},null,{"$f":"IF(D817=0,E816,D817)","v":"JULHO"}]
[783,null,"SIMEI MELLO GUEDES PORFÍRIO",null,"JULHO"]
[784,null,"SIMEI MELLO GUEDES PORFÍRIO",null,"JULHO"]
[785,null,"SIMEI MELLO GUEDES PORFÍRIO",null,"JULHO",null,null,null,{"$f":"IFERROR(VLOOKUP(H820,K694:L922,2,FALSE),\"\")","v":""}]
[786,null,"SIMEI MELLO GUEDES PORFÍRIO",null,"JULHO",null,null,null,""]
[787,null,"SIMEI MELLO GUEDES PORFÍRIO",null,"JULHO",null,null,null,""]
[788,null,"SIMEI MELLO GUEDES PORFÍRIO",null,"JULHO",null,null,null,""]
[789,null,"SIMEI MELLO GUEDES PORFÍRIO",null,"JULHO",null,null,null,""]
[790,null,"SIMEI MELLO GUEDES PORFÍRIO",null,"JULHO",null,null,null,""]
[791,null,"SIMEI MELLO GUEDES PORFÍRIO","AGOSTO","AGOSTO",11,"Pregação e Visitação","Forquilhinhas","Içara"]
[792,null,"SIMEI MELLO GUEDES PORFÍRIO",null,"AGOSTO",18,"Simposio Universitario","CAIT","CAIT"]
[793,null,"SIMEI MELLO GUEDES PORFÍRIO",null,"AGOSTO",25,"Pregação e Visitação","Laguna","Laguna"]
[794,null,"SIMEI MELLO GUEDES PORFÍRIO",null,"AGOSTO",null,null,null,{"$f":"IFERROR(VLOOKUP(H829,K703:L931,2,FALSE),\"\")","v":""}]
[795,null,"SIMEI MELLO GUEDES PORFÍRIO",null,"AGOSTO",null,null,null,""]
[796,null,"SIMEI MELLO GUEDES PORFÍRIO",null,"AGOSTO",null,null,null,""]
[797,null,"SIMEI MELLO GUEDES PORFÍRIO",null,"AGOSTO",null,null,null,""]
[798,null,"SIMEI MELLO GUEDES PORFÍRIO",null,"AGOSTO",null,null,null,""]
[799,null,"SIMEI MELLO GUEDES PORFÍRIO",null,"AGOSTO",null,null,null,""]
[800,null,"SIMEI MELLO GUEDES PORFÍRIO",null,"AGOSTO",null,null,null,""]
[801,null,"SIMEI MELLO GUEDES PORFÍRIO","SETEMBRO","SETEMBRO",1,"Pregação e Visitação","Lages","Lages"]
[802,null,"SIMEI MELLO GUEDES PORFÍRIO",null,"SETEMBRO",8,"Pregação e Visitação","Camboriú","Camboriú"]
[803,null,"SIMEI MELLO GUEDES PORFÍRIO",null,"SETEMBRO",22,"Pregação e Visitação","Limoeiro","Limoeiro"]
[804,null,"SIMEI MELLO GUEDES PORFÍRIO",null,"SETEMBRO",29,"Pregação e Visitação","Balneário Arroio Do Silva","Araranguá"]
[805,null,"SIMEI MELLO GUEDES PORFÍRIO",null,"SETEMBRO",null,null,null,{"$f":"IFERROR(VLOOKUP(H840,K714:L942,2,FALSE),\"\")","v":""}]
[806,null,{"$f":"IF(B841=0,C840,B841)","v":"SIMEI MELLO GUEDES PORFÍRIO"},null,"SETEMBRO",null,null,null,""]
[807,null,"SIMEI MELLO GUEDES PORFÍRIO",null,"SETEMBRO",null,null,null,""]
[808,null,"SIMEI MELLO GUEDES PORFÍRIO",null,"SETEMBRO",null,null,null,""]
[809,null,"SIMEI MELLO GUEDES PORFÍRIO",null,"SETEMBRO",null,null,null,""]
[810,null,"SIMEI MELLO GUEDES PORFÍRIO",null,"SETEMBRO",null,null,null,""]
[811,null,"SIMEI MELLO GUEDES PORFÍRIO","OUTUBRO","OUTUBRO"]
[812,null,"SIMEI MELLO GUEDES PORFÍRIO",null,"OUTUBRO",6,"Pregação e Visitação","Praia Comprida","Campinas"]
[813,null,"SIMEI MELLO GUEDES PORFÍRIO",null,"OUTUBRO",13,"Pregação e Visitação","Braço do Norte","São Martinho"]
[814,null,"SIMEI MELLO GUEDES PORFÍRIO",null,"OUTUBRO","20-27","Semana de oração"]
[815,null,"SIMEI MELLO GUEDES PORFÍRIO",null,"OUTUBRO"]
[816,null,"SIMEI MELLO GUEDES PORFÍRIO",null,"OUTUBRO"]
[817,null,"SIMEI MELLO GUEDES PORFÍRIO",null,"OUTUBRO"]
[818,null,"SIMEI MELLO GUEDES PORFÍRIO",null,"OUTUBRO"]
[819,null,"SIMEI MELLO GUEDES PORFÍRIO",null,"OUTUBRO"]
[820,null,"SIMEI MELLO GUEDES PORFÍRIO",null,"OUTUBRO"]
[821,null,"SIMEI MELLO GUEDES PORFÍRIO","NOVEMBRO","NOVEMBRO",3,"Projeto Grande Como Davi - Distrital","São Martinho ","São Martinho "]
[822,null,"SIMEI MELLO GUEDES PORFÍRIO",null,"NOVEMBRO",10,"Impacto Criciúma","AC","AC"]
[823,null,"SIMEI MELLO GUEDES PORFÍRIO",null,"NOVEMBRO",17,"Campori USB","USB","USB"]
[824,null,"SIMEI MELLO GUEDES PORFÍRIO",null,"NOVEMBRO",24,"Pregação e Visitação","Sambaqui","Universitário"]
[825,null,"SIMEI MELLO GUEDES PORFÍRIO",null,"NOVEMBRO"]
[826,null,"SIMEI MELLO GUEDES PORFÍRIO",null,"NOVEMBRO"]
[827,null,"SIMEI MELLO GUEDES PORFÍRIO",null,"NOVEMBRO"]
[828,null,"SIMEI MELLO GUEDES PORFÍRIO",null,"NOVEMBRO"]
[829,null,"SIMEI MELLO GUEDES PORFÍRIO",null,"NOVEMBRO"]
[830,null,"SIMEI MELLO GUEDES PORFÍRIO",null,"NOVEMBRO"]
[831,null,{"$f":"IF(B866=0,C845,B866)","v":"SIMEI MELLO GUEDES PORFÍRIO"},"DEZEMBRO",{"$f":"IF(D866=0,E845,D866)","v":"DEZEMBRO"},1,"Treinamento Missão Calebe","CATRE","CATRE"]
[832,null,"SIMEI MELLO GUEDES PORFÍRIO",null,"DEZEMBRO","03 a 23","Send-me","AC","AC"]
[833,null,"SIMEI MELLO GUEDES PORFÍRIO",null,"DEZEMBRO",null,null,null,{"$f":"IFERROR(VLOOKUP(H868,K742:L950,2,FALSE),\"\")","v":""}]
[834,null,"SIMEI MELLO GUEDES PORFÍRIO",null,"DEZEMBRO",null,null,null,""]
[835,null,"SIMEI MELLO GUEDES PORFÍRIO",null,"DEZEMBRO",null,null,null,""]
[836,null,"SIMEI MELLO GUEDES PORFÍRIO",null,"DEZEMBRO",null,null,null,""]
[837,null,{"$f":"IF(B872=0,C871,B872)","v":"SIMEI MELLO GUEDES PORFÍRIO"},null,"DEZEMBRO",null,null,null,""]
[838,null,"SIMEI MELLO GUEDES PORFÍRIO",null,"DEZEMBRO",null,null,null,""]
[839,null,{"$f":"IF(B874=0,C873,B874)","v":"SIMEI MELLO GUEDES PORFÍRIO"},null,"DEZEMBRO",null,null,null,""]
[840,null,{"$f":"IF(B875=0,C874,B875)","v":"SIMEI MELLO GUEDES PORFÍRIO"},null,"DEZEMBRO",null,null,null,""]

{"sheet":"Itinerário Envio","index":1,"n_rows":603,"n_cols":11,"rows_kept":603,"cut":false,"hidden":false,"merged":[[0,1,0,7],[1,1,1,7]]}
[null,"Associação Catarinense"]
[null,"Itinerário 2º Quadrimestre de 2018"]
["Colunas1","Depart.","Mês","Dia","Data","Atividade a Desempenhar","Igreja","Distrito"]
[1,{"$f":"VLOOKUP(A4,Itinerário!$A$3:$I$875,3,FALSE)","v":"APOLO STREICHER ABRÁSCIO"},{"$f":"VLOOKUP(A4,Itinerário!$A$3:$I$875,5,FALSE)","v":"JULHO"},{"$f":"IF(VLOOKUP(A4,Itinerário!$A$3:$I$875,6,FALSE)=0,\"\",VLOOKUP(A4,Itinerário!$A$3:$I$875,6,FALSE))","v":7},{"$f":"IFERROR(DATE(RIGHT($B$2,4),VLOOKUP(C4,$J$4:$K$15,2,FALSE),D4),0)","v":"2018-07-07"},{"$f":"IF(VLOOKUP(A4,Itinerário!$A$3:$I$875,7,FALSE)=0,\"\",VLOOKUP(A4,Itinerário!$A$3:$I$875,7,FALSE))","v":"Pregação e visitação professores"},{"$f":"IF(VLOOKUP(A4,Itinerário!$A$3:$I$875,8,FALSE)=0,\"\",VLOOKUP(A4,Itinerário!$A$3:$I$875,8,FALSE))","v":"Morro da Fumaça"},{"$f":"IF(VLOOKUP(A4,Itinerário!$A$3:$I$875,9,FALSE)=0,\"\",VLOOKUP(A4,Itinerário!$A$3:$I$875,9,FALSE))","v":"Próspera"},null,"JANEIRO",1]
[2,{"$f":"VLOOKUP(A5,Itinerário!$A$3:$I$875,3,FALSE)","v":"APOLO STREICHER ABRÁSCIO"},{"$f":"VLOOKUP(A5,Itinerário!$A$3:$I$875,5,FALSE)","v":"JULHO"},{"$f":"IF(VLOOKUP(A5,Itinerário!$A$3:$I$875,6,FALSE)=0,\"\",VLOOKUP(A5,Itinerário!$A$3:$I$875,6,FALSE))","v":8},{"$f":"IFERROR(DATE(RIGHT($B$2,4),VLOOKUP(C5,$J$4:$K$15,2,FALSE),D5),0)","v":"2018-07-08"},{"$f":"IF(VLOOKUP(A5,Itinerário!$A$3:$I$875,7,FALSE)=0,\"\",VLOOKUP(A5,Itinerário!$A$3:$I$875,7,FALSE))","v":"Pregação"},{"$f":"IF(VLOOKUP(A5,Itinerário!$A$3:$I$875,8,FALSE)=0,\"\",VLOOKUP(A5,Itinerário!$A$3:$I$875,8,FALSE))","v":"Canasvieiras"},{"$f":"IF(VLOOKUP(A5,Itinerário!$A$3:$I$875,9,FALSE)=0,\"\",VLOOKUP(A5,Itinerário!$A$3:$I$875,9,FALSE))","v":"Ingleses"},null,"FEVEREIRO",2]
[3,{"$f":"VLOOKUP(A6,Itinerário!$A$3:$I$875,3,FALSE)","v":"APOLO STREICHER ABRÁSCIO"},{"$f":"VLOOKUP(A6,Itinerário!$A$3:$I$875,5,FALSE)","v":"JULHO"},{"$f":"IF(VLOOKUP(A6,Itinerário!$A$3:$I$875,6,FALSE)=0,\"\",VLOOKUP(A6,Itinerário!$A$3:$I$875,6,FALSE))","v":14},"2018-07-14",{"$f":"IF(VLOOKUP(A6,Itinerário!$A$3:$I$875,7,FALSE)=0,\"\",VLOOKUP(A6,Itinerário!$A$3:$I$875,7,FALSE))","v":"Pregação"},{"$f":"IF(VLOOKUP(A6,Itinerário!$A$3:$I$875,8,FALSE)=0,\"\",VLOOKUP(A6,Itinerário!$A$3:$I$875,8,FALSE))","v":"Tubarão"},{"$f":"IF(VLOOKUP(A6,Itinerário!$A$3:$I$875,9,FALSE)=0,\"\",VLOOKUP(A6,Itinerário!$A$3:$I$875,9,FALSE))","v":"Tubarão"},null,"MARÇO",3]
[4,{"$f":"VLOOKUP(A7,Itinerário!$A$3:$I$875,3,FALSE)","v":"APOLO STREICHER ABRÁSCIO"},{"$f":"VLOOKUP(A7,Itinerário!$A$3:$I$875,5,FALSE)","v":"JULHO"},{"$f":"IF(VLOOKUP(A7,Itinerário!$A$3:$I$875,6,FALSE)=0,\"\",VLOOKUP(A7,Itinerário!$A$3:$I$875,6,FALSE))","v":14},"2018-07-14",{"$f":"IF(VLOOKUP(A7,Itinerário!$A$3:$I$875,7,FALSE)=0,\"\",VLOOKUP(A7,Itinerário!$A$3:$I$875,7,FALSE))","v":"Anciori"},{"$f":"IF(VLOOKUP(A7,Itinerário!$A$3:$I$875,8,FALSE)=0,\"\",VLOOKUP(A7,Itinerário!$A$3:$I$875,8,FALSE))","v":"AC"},{"$f":"IF(VLOOKUP(A7,Itinerário!$A$3:$I$875,9,FALSE)=0,\"\",VLOOKUP(A7,Itinerário!$A$3:$I$875,9,FALSE))","v":"AC"},null,"ABRIL",4]
[5,{"$f":"VLOOKUP(A8,Itinerário!$A$3:$I$875,3,FALSE)","v":"APOLO STREICHER ABRÁSCIO"},{"$f":"VLOOKUP(A8,Itinerário!$A$3:$I$875,5,FALSE)","v":"JULHO"},{"$f":"IF(VLOOKUP(A8,Itinerário!$A$3:$I$875,6,FALSE)=0,\"\",VLOOKUP(A8,Itinerário!$A$3:$I$875,6,FALSE))","v":22},"2018-07-22",{"$f":"IF(VLOOKUP(A8,Itinerário!$A$3:$I$875,7,FALSE)=0,\"\",VLOOKUP(A8,Itinerário!$A$3:$I$875,7,FALSE))","v":"Encontro Terceira Idade"},{"$f":"IF(VLOOKUP(A8,Itinerário!$A$3:$I$875,8,FALSE)=0,\"\",VLOOKUP(A8,Itinerário!$A$3:$I$875,8,FALSE))","v":"Termas do Gravatal"},{"$f":"IF(VLOOKUP(A8,Itinerário!$A$3:$I$875,9,FALSE)=0,\"\",VLOOKUP(A8,Itinerário!$A$3:$I$875,9,FALSE))","v":"São Martinho"},null,"MAIO",5]
[6,{"$f":"VLOOKUP(A9,Itinerário!$A$3:$I$875,3,FALSE)","v":"APOLO STREICHER ABRÁSCIO"},{"$f":"VLOOKUP(A9,Itinerário!$A$3:$I$875,5,FALSE)","v":"JULHO"},{"$f":"IF(VLOOKUP(A9,Itinerário!$A$3:$I$875,6,FALSE)=0,\"\",VLOOKUP(A9,Itinerário!$A$3:$I$875,6,FALSE))","v":28},"2018-07-28",{"$f":"IF(VLOOKUP(A9,Itinerário!$A$3:$I$875,7,FALSE)=0,\"\",VLOOKUP(A9,Itinerário!$A$3:$I$875,7,FALSE))","v":"Pregação e treinamento pela tarde"},{"$f":"IF(VLOOKUP(A9,Itinerário!$A$3:$I$875,8,FALSE)=0,\"\",VLOOKUP(A9,Itinerário!$A$3:$I$875,8,FALSE))","v":"Palhoça"},{"$f":"IF(VLOOKUP(A9,Itinerário!$A$3:$I$875,9,FALSE)=0,\"\",VLOOKUP(A9,Itinerário!$A$3:$I$875,9,FALSE))","v":"Palhoça"},null,"JUNHO",6]
[7,{"$f":"VLOOKUP(A10,Itinerário!$A$3:$I$875,3,FALSE)","v":"APOLO STREICHER ABRÁSCIO"},{"$f":"VLOOKUP(A10,Itinerário!$A$3:$I$875,5,FALSE)","v":"JULHO"},{"$f":"IF(VLOOKUP(A10,Itinerário!$A$3:$I$875,6,FALSE)=0,\"\",VLOOKUP(A10,Itinerário!$A$3:$I$875,6,FALSE))","v":""},"00:00:00",{"$f":"IF(VLOOKUP(A10,Itinerário!$A$3:$I$875,7,FALSE)=0,\"\",VLOOKUP(A10,Itinerário!$A$3:$I$875,7,FALSE))","v":""},{"$f":"IF(VLOOKUP(A10,Itinerário!$A$3:$I$875,8,FALSE)=0,\"\",VLOOKUP(A10,Itinerário!$A$3:$I$875,8,FALSE))","v":""},{"$f":"IF(VLOOKUP(A10,Itinerário!$A$3:$I$875,9,FALSE)=0,\"\",VLOOKUP(A10,Itinerário!$A$3:$I$875,9,FALSE))","v":""},null,"JULHO",7]
[8,{"$f":"VLOOKUP(A11,Itinerário!$A$3:$I$875,3,FALSE)","v":"APOLO STREICHER ABRÁSCIO"},{"$f":"VLOOKUP(A11,Itinerário!$A$3:$I$875,5,FALSE)","v":"JULHO"},{"$f":"IF(VLOOKUP(A11,Itinerário!$A$3:$I$875,6,FALSE)=0,\"\",VLOOKUP(A11,Itinerário!$A$3:$I$875,6,FALSE))","v":""},"00:00:00",{"$f":"IF(VLOOKUP(A11,Itinerário!$A$3:$I$875,7,FALSE)=0,\"\",VLOOKUP(A11,Itinerário!$A$3:$I$875,7,FALSE))","v":""},{"$f":"IF(VLOOKUP(A11,Itinerário!$A$3:$I$875,8,FALSE)=0,\"\",VLOOKUP(A11,Itinerário!$A$3:$I$875,8,FALSE))","v":""},{"$f":"IF(VLOOKUP(A11,Itinerário!$A$3:$I$875,9,FALSE)=0,\"\",VLOOKUP(A11,Itinerário!$A$3:$I$875,9,FALSE))","v":""},null,"AGOSTO",8]
[9,{"$f":"VLOOKUP(A12,Itinerário!$A$3:$I$875,3,FALSE)","v":"APOLO STREICHER ABRÁSCIO"},{"$f":"VLOOKUP(A12,Itinerário!$A$3:$I$875,5,FALSE)","v":"JULHO"},{"$f":"IF(VLOOKUP(A12,Itinerário!$A$3:$I$875,6,FALSE)=0,\"\",VLOOKUP(A12,Itinerário!$A$3:$I$875,6,FALSE))","v":""},"00:00:00",{"$f":"IF(VLOOKUP(A12,Itinerário!$A$3:$I$875,7,FALSE)=0,\"\",VLOOKUP(A12,Itinerário!$A$3:$I$875,7,FALSE))","v":""},{"$f":"IF(VLOOKUP(A12,Itinerário!$A$3:$I$875,8,FALSE)=0,\"\",VLOOKUP(A12,Itinerário!$A$3:$I$875,8,FALSE))","v":""},{"$f":"IF(VLOOKUP(A12,Itinerário!$A$3:$I$875,9,FALSE)=0,\"\",VLOOKUP(A12,Itinerário!$A$3:$I$875,9,FALSE))","v":""},null,"SETEMBRO",9]
[10,{"$f":"VLOOKUP(A13,Itinerário!$A$3:$I$875,3,FALSE)","v":"APOLO STREICHER ABRÁSCIO"},{"$f":"VLOOKUP(A13,Itinerário!$A$3:$I$875,5,FALSE)","v":"JULHO"},{"$f":"IF(VLOOKUP(A13,Itinerário!$A$3:$I$875,6,FALSE)=0,\"\",VLOOKUP(A13,Itinerário!$A$3:$I$875,6,FALSE))","v":""},"00:00:00",{"$f":"IF(VLOOKUP(A13,Itinerário!$A$3:$I$875,7,FALSE)=0,\"\",VLOOKUP(A13,Itinerário!$A$3:$I$875,7,FALSE))","v":""},{"$f":"IF(VLOOKUP(A13,Itinerário!$A$3:$I$875,8,FALSE)=0,\"\",VLOOKUP(A13,Itinerário!$A$3:$I$875,8,FALSE))","v":""},{"$f":"IF(VLOOKUP(A13,Itinerário!$A$3:$I$875,9,FALSE)=0,\"\",VLOOKUP(A13,Itinerário!$A$3:$I$875,9,FALSE))","v":""},null,"OUTUBRO",10]
[11,{"$f":"VLOOKUP(A14,Itinerário!$A$3:$I$875,3,FALSE)","v":"APOLO STREICHER ABRÁSCIO"},{"$f":"VLOOKUP(A14,Itinerário!$A$3:$I$875,5,FALSE)","v":"AGOSTO"},{"$f":"IF(VLOOKUP(A14,Itinerário!$A$3:$I$875,6,FALSE)=0,\"\",VLOOKUP(A14,Itinerário!$A$3:$I$875,6,FALSE))","v":"3 e 4"},"00:00:00",{"$f":"IF(VLOOKUP(A14,Itinerário!$A$3:$I$875,7,FALSE)=0,\"\",VLOOKUP(A14,Itinerário!$A$3:$I$875,7,FALSE))","v":"Final de semana da família"},{"$f":"IF(VLOOKUP(A14,Itinerário!$A$3:$I$875,8,FALSE)=0,\"\",VLOOKUP(A14,Itinerário!$A$3:$I$875,8,FALSE))","v":"Revoredo"},{"$f":"IF(VLOOKUP(A14,Itinerário!$A$3:$I$875,9,FALSE)=0,\"\",VLOOKUP(A14,Itinerário!$A$3:$I$875,9,FALSE))","v":"Revoredo"},null,"NOVEMBRO",11]
[12,{"$f":"VLOOKUP(A15,Itinerário!$A$3:$I$875,3,FALSE)","v":"APOLO STREICHER ABRÁSCIO"},{"$f":"VLOOKUP(A15,Itinerário!$A$3:$I$875,5,FALSE)","v":"AGOSTO"},{"$f":"IF(VLOOKUP(A15,Itinerário!$A$3:$I$875,6,FALSE)=0,\"\",VLOOKUP(A15,Itinerário!$A$3:$I$875,6,FALSE))","v":5},"2018-08-05",{"$f":"IF(VLOOKUP(A15,Itinerário!$A$3:$I$875,7,FALSE)=0,\"\",VLOOKUP(A15,Itinerário!$A$3:$I$875,7,FALSE))","v":"Pregação"},{"$f":"IF(VLOOKUP(A15,Itinerário!$A$3:$I$875,8,FALSE)=0,\"\",VLOOKUP(A15,Itinerário!$A$3:$I$875,8,FALSE))","v":"Sambaqui"},{"$f":"IF(VLOOKUP(A15,Itinerário!$A$3:$I$875,9,FALSE)=0,\"\",VLOOKUP(A15,Itinerário!$A$3:$I$875,9,FALSE))","v":"Universitario"},null,"DEZEMBRO",12]
[13,{"$f":"VLOOKUP(A16,Itinerário!$A$3:$I$875,3,FALSE)","v":"APOLO STREICHER ABRÁSCIO"},{"$f":"VLOOKUP(A16,Itinerário!$A$3:$I$875,5,FALSE)","v":"AGOSTO"},{"$f":"IF(VLOOKUP(A16,Itinerário!$A$3:$I$875,6,FALSE)=0,\"\",VLOOKUP(A16,Itinerário!$A$3:$I$875,6,FALSE))","v":10},"2018-08-10",{"$f":"IF(VLOOKUP(A16,Itinerário!$A$3:$I$875,7,FALSE)=0,\"\",VLOOKUP(A16,Itinerário!$A$3:$I$875,7,FALSE))","v":"Teorico Prático "},{"$f":"IF(VLOOKUP(A16,Itinerário!$A$3:$I$875,8,FALSE)=0,\"\",VLOOKUP(A16,Itinerário!$A$3:$I$875,8,FALSE))","v":"AC"},{"$f":"IF(VLOOKUP(A16,Itinerário!$A$3:$I$875,9,FALSE)=0,\"\",VLOOKUP(A16,Itinerário!$A$3:$I$875,9,FALSE))","v":"AC"}]
[14,{"$f":"VLOOKUP(A17,Itinerário!$A$3:$I$875,3,FALSE)","v":"APOLO STREICHER ABRÁSCIO"},{"$f":"VLOOKUP(A17,Itinerário!$A$3:$I$875,5,FALSE)","v":"AGOSTO"},{"$f":"IF(VLOOKUP(A17,Itinerário!$A$3:$I$875,6,FALSE)=0,\"\",VLOOKUP(A17,Itinerário!$A$3:$I$875,6,FALSE))","v":11},"2018-08-11",{"$f":"IF(VLOOKUP(A17,Itinerário!$A$3:$I$875,7,FALSE)=0,\"\",VLOOKUP(A17,Itinerário!$A$3:$I$875,7,FALSE))","v":"Pregação e visitação professores"},{"$f":"IF(VLOOKUP(A17,Itinerário!$A$3:$I$875,8,FALSE)=0,\"\",VLOOKUP(A17,Itinerário!$A$3:$I$875,8,FALSE))","v":"Cabeçuda"},{"$f":"IF(VLOOKUP(A17,Itinerário!$A$3:$I$875,9,FALSE)=0,\"\",VLOOKUP(A17,Itinerário!$A$3:$I$875,9,FALSE))","v":"Laguna"}]
[15,{"$f":"VLOOKUP(A18,Itinerário!$A$3:$I$875,3,FALSE)","v":"APOLO STREICHER ABRÁSCIO"},{"$f":"VLOOKUP(A18,Itinerário!$A$3:$I$875,5,FALSE)","v":"AGOSTO"},{"$f":"IF(VLOOKUP(A18,Itinerário!$A$3:$I$875,6,FALSE)=0,\"\",VLOOKUP(A18,Itinerário!$A$3:$I$875,6,FALSE))","v":14},"2018-08-14",{"$f":"IF(VLOOKUP(A18,Itinerário!$A$3:$I$875,7,FALSE)=0,\"\",VLOOKUP(A18,Itinerário!$A$3:$I$875,7,FALSE))","v":"PGL "},{"$f":"IF(VLOOKUP(A18,Itinerário!$A$3:$I$875,8,FALSE)=0,\"\",VLOOKUP(A18,Itinerário!$A$3:$I$875,8,FALSE))","v":"Balneário Camboriú"},{"$f":"IF(VLOOKUP(A18,Itinerário!$A$3:$I$875,9,FALSE)=0,\"\",VLOOKUP(A18,Itinerário!$A$3:$I$875,9,FALSE))","v":"Balneário Camboriú"}]
[16,{"$f":"VLOOKUP(A19,Itinerário!$A$3:$I$875,3,FALSE)","v":"APOLO STREICHER ABRÁSCIO"},{"$f":"VLOOKUP(A19,Itinerário!$A$3:$I$875,5,FALSE)","v":"AGOSTO"},{"$f":"IF(VLOOKUP(A19,Itinerário!$A$3:$I$875,6,FALSE)=0,\"\",VLOOKUP(A19,Itinerário!$A$3:$I$875,6,FALSE))","v":18},"2018-08-18",{"$f":"IF(VLOOKUP(A19,Itinerário!$A$3:$I$875,7,FALSE)=0,\"\",VLOOKUP(A19,Itinerário!$A$3:$I$875,7,FALSE))","v":"Aniversário Igreja"},{"$f":"IF(VLOOKUP(A19,Itinerário!$A$3:$I$875,8,FALSE)=0,\"\",VLOOKUP(A19,Itinerário!$A$3:$I$875,8,FALSE))","v":"Florianópolis"},{"$f":"IF(VLOOKUP(A19,Itinerário!$A$3:$I$875,9,FALSE)=0,\"\",VLOOKUP(A19,Itinerário!$A$3:$I$875,9,FALSE))","v":"Florianópolis"}]
[17,{"$f":"VLOOKUP(A20,Itinerário!$A$3:$I$875,3,FALSE)","v":"APOLO STREICHER ABRÁSCIO"},{"$f":"VLOOKUP(A20,Itinerário!$A$3:$I$875,5,FALSE)","v":"AGOSTO"},{"$f":"IF(VLOOKUP(A20,Itinerário!$A$3:$I$875,6,FALSE)=0,\"\",VLOOKUP(A20,Itinerário!$A$3:$I$875,6,FALSE))","v":18},"2018-08-18",{"$f":"IF(VLOOKUP(A20,Itinerário!$A$3:$I$875,7,FALSE)=0,\"\",VLOOKUP(A20,Itinerário!$A$3:$I$875,7,FALSE))","v":"Anciori"},{"$f":"IF(VLOOKUP(A20,Itinerário!$A$3:$I$875,8,FALSE)=0,\"\",VLOOKUP(A20,Itinerário!$A$3:$I$875,8,FALSE))","v":"AC"},{"$f":"IF(VLOOKUP(A20,Itinerário!$A$3:$I$875,9,FALSE)=0,\"\",VLOOKUP(A20,Itinerário!$A$3:$I$875,9,FALSE))","v":"AC"}]
[18,{"$f":"VLOOKUP(A21,Itinerário!$A$3:$I$875,3,FALSE)","v":"APOLO STREICHER ABRÁSCIO"},{"$f":"VLOOKUP(A21,Itinerário!$A$3:$I$875,5,FALSE)","v":"AGOSTO"},{"$f":"IF(VLOOKUP(A21,Itinerário!$A$3:$I$875,6,FALSE)=0,\"\",VLOOKUP(A21,Itinerário!$A$3:$I$875,6,FALSE))","v":25},"2018-08-25",{"$f":"IF(VLOOKUP(A21,Itinerário!$A$3:$I$875,7,FALSE)=0,\"\",VLOOKUP(A21,Itinerário!$A$3:$I$875,7,FALSE))","v":"Pregação e visitação professores"},{"$f":"IF(VLOOKUP(A21,Itinerário!$A$3:$I$875,8,FALSE)=0,\"\",VLOOKUP(A21,Itinerário!$A$3:$I$875,8,FALSE))","v":"Itajaí"},{"$f":"IF(VLOOKUP(A21,Itinerário!$A$3:$I$875,9,FALSE)=0,\"\",VLOOKUP(A21,Itinerário!$A$3:$I$875,9,FALSE))","v":"Itajaí"}]
[19,{"$f":"VLOOKUP(A22,Itinerário!$A$3:$I$875,3,FALSE)","v":"APOLO STREICHER ABRÁSCIO"},{"$f":"VLOOKUP(A22,Itinerário!$A$3:$I$875,5,FALSE)","v":"AGOSTO"},{"$f":"IF(VLOOKUP(A22,Itinerário!$A$3:$I$875,6,FALSE)=0,\"\",VLOOKUP(A22,Itinerário!$A$3:$I$875,6,FALSE))","v":31},"2018-08-31",{"$f":"IF(VLOOKUP(A22,Itinerário!$A$3:$I$875,7,FALSE)=0,\"\",VLOOKUP(A22,Itinerário!$A$3:$I$875,7,FALSE))","v":"Enduro"},{"$f":"IF(VLOOKUP(A22,Itinerário!$A$3:$I$875,8,FALSE)=0,\"\",VLOOKUP(A22,Itinerário!$A$3:$I$875,8,FALSE))","v":"Grão Pará"},{"$f":"IF(VLOOKUP(A22,Itinerário!$A$3:$I$875,9,FALSE)=0,\"\",VLOOKUP(A22,Itinerário!$A$3:$I$875,9,FALSE))","v":"São Martinho"}]
[20,{"$f":"VLOOKUP(A23,Itinerário!$A$3:$I$875,3,FALSE)","v":"APOLO STREICHER ABRÁSCIO"},{"$f":"VLOOKUP(A23,Itinerário!$A$3:$I$875,5,FALSE)","v":"AGOSTO"},{"$f":"IF(VLOOKUP(A23,Itinerário!$A$3:$I$875,6,FALSE)=0,\"\",VLOOKUP(A23,Itinerário!$A$3:$I$875,6,FALSE))","v":""},"00:00:00",{"$f":"IF(VLOOKUP(A23,Itinerário!$A$3:$I$875,7,FALSE)=0,\"\",VLOOKUP(A23,Itinerário!$A$3:$I$875,7,FALSE))","v":""},{"$f":"IF(VLOOKUP(A23,Itinerário!$A$3:$I$875,8,FALSE)=0,\"\",VLOOKUP(A23,Itinerário!$A$3:$I$875,8,FALSE))","v":""},{"$f":"IF(VLOOKUP(A23,Itinerário!$A$3:$I$875,9,FALSE)=0,\"\",VLOOKUP(A23,Itinerário!$A$3:$I$875,9,FALSE))","v":""}]
[21,{"$f":"VLOOKUP(A24,Itinerário!$A$3:$I$875,3,FALSE)","v":"APOLO STREICHER ABRÁSCIO"},{"$f":"VLOOKUP(A24,Itinerário!$A$3:$I$875,5,FALSE)","v":"SETEMBRO"},{"$f":"IF(VLOOKUP(A24,Itinerário!$A$3:$I$875,6,FALSE)=0,\"\",VLOOKUP(A24,Itinerário!$A$3:$I$875,6,FALSE))","v":1},"2018-09-01",{"$f":"IF(VLOOKUP(A24,Itinerário!$A$3:$I$875,7,FALSE)=0,\"\",VLOOKUP(A24,Itinerário!$A$3:$I$875,7,FALSE))","v":"Pregação e visitação professores"},{"$f":"IF(VLOOKUP(A24,Itinerário!$A$3:$I$875,8,FALSE)=0,\"\",VLOOKUP(A24,Itinerário!$A$3:$I$875,8,FALSE))","v":"Lageado Alto"},{"$f":"IF(VLOOKUP(A24,Itinerário!$A$3:$I$875,9,FALSE)=0,\"\",VLOOKUP(A24,Itinerário!$A$3:$I$875,9,FALSE))","v":"Lageado Baixo"}]
[22,{"$f":"VLOOKUP(A25,Itinerário!$A$3:$I$875,3,FALSE)","v":"APOLO STREICHER ABRÁSCIO"},{"$f":"VLOOKUP(A25,Itinerário!$A$3:$I$875,5,FALSE)","v":"SETEMBRO"},{"$f":"IF(VLOOKUP(A25,Itinerário!$A$3:$I$875,6,FALSE)=0,\"\",VLOOKUP(A25,Itinerário!$A$3:$I$875,6,FALSE))","v":8},"2018-09-08",{"$f":"IF(VLOOKUP(A25,Itinerário!$A$3:$I$875,7,FALSE)=0,\"\",VLOOKUP(A25,Itinerário!$A$3:$I$875,7,FALSE))","v":"Pregação e visitação professores"},{"$f":"IF(VLOOKUP(A25,Itinerário!$A$3:$I$875,8,FALSE)=0,\"\",VLOOKUP(A25,Itinerário!$A$3:$I$875,8,FALSE))","v":"Santo Amaro da Imperatriz"},{"$f":"IF(VLOOKUP(A25,Itinerário!$A$3:$I$875,9,FALSE)=0,\"\",VLOOKUP(A25,Itinerário!$A$3:$I$875,9,FALSE))","v":"Caminho Novo"}]
[23,{"$f":"VLOOKUP(A26,Itinerário!$A$3:$I$875,3,FALSE)","v":"APOLO STREICHER ABRÁSCIO"},{"$f":"VLOOKUP(A26,Itinerário!$A$3:$I$875,5,FALSE)","v":"SETEMBRO"},{"$f":"IF(VLOOKUP(A26,Itinerário!$A$3:$I$875,6,FALSE)=0,\"\",VLOOKUP(A26,Itinerário!$A$3:$I$875,6,FALSE))","v":15},"2018-09-15",{"$f":"IF(VLOOKUP(A26,Itinerário!$A$3:$I$875,7,FALSE)=0,\"\",VLOOKUP(A26,Itinerário!$A$3:$I$875,7,FALSE))","v":"Pregação e visitação professores"},{"$f":"IF(VLOOKUP(A26,Itinerário!$A$3:$I$875,8,FALSE)=0,\"\",VLOOKUP(A26,Itinerário!$A$3:$I$875,8,FALSE))","v":"Universitária"},{"$f":"IF(VLOOKUP(A26,Itinerário!$A$3:$I$875,9,FALSE)=0,\"\",VLOOKUP(A26,Itinerário!$A$3:$I$875,9,FALSE))","v":"Universitario"}]
[24,{"$f":"VLOOKUP(A27,Itinerário!$A$3:$I$875,3,FALSE)","v":"APOLO STREICHER ABRÁSCIO"},{"$f":"VLOOKUP(A27,Itinerário!$A$3:$I$875,5,FALSE)","v":"SETEMBRO"},{"$f":"IF(VLOOKUP(A27,Itinerário!$A$3:$I$875,6,FALSE)=0,\"\",VLOOKUP(A27,Itinerário!$A$3:$I$875,6,FALSE))","v":22},"2018-09-22",{"$f":"IF(VLOOKUP(A27,Itinerário!$A$3:$I$875,7,FALSE)=0,\"\",VLOOKUP(A27,Itinerário!$A$3:$I$875,7,FALSE))","v":"Pregação e Batismo da Primavera"},{"$f":"IF(VLOOKUP(A27,Itinerário!$A$3:$I$875,8,FALSE)=0,\"\",VLOOKUP(A27,Itinerário!$A$3:$I$875,8,FALSE))","v":"Brusque"},{"$f":"IF(VLOOKUP(A27,Itinerário!$A$3:$I$875,9,FALSE)=0,\"\",VLOOKUP(A27,Itinerário!$A$3:$I$875,9,FALSE))","v":"Brusque"}]
[25,{"$f":"VLOOKUP(A28,Itinerário!$A$3:$I$875,3,FALSE)","v":"APOLO STREICHER ABRÁSCIO"},{"$f":"VLOOKUP(A28,Itinerário!$A$3:$I$875,5,FALSE)","v":"SETEMBRO"},{"$f":"IF(VLOOKUP(A28,Itinerário!$A$3:$I$875,6,FALSE)=0,\"\",VLOOKUP(A28,Itinerário!$A$3:$I$875,6,FALSE))","v":29},"2018-09-29",{"$f":"IF(VLOOKUP(A28,Itinerário!$A$3:$I$875,7,FALSE)=0,\"\",VLOOKUP(A28,Itinerário!$A$3:$I$875,7,FALSE))","v":"Pregação e visitação professores"},{"$f":"IF(VLOOKUP(A28,Itinerário!$A$3:$I$875,8,FALSE)=0,\"\",VLOOKUP(A28,Itinerário!$A$3:$I$875,8,FALSE))","v":"Santa Luzia"},{"$f":"IF(VLOOKUP(A28,Itinerário!$A$3:$I$875,9,FALSE)=0,\"\",VLOOKUP(A28,Itinerário!$A$3:$I$875,9,FALSE))","v":"Criciúma"}]
[26,{"$f":"VLOOKUP(A29,Itinerário!$A$3:$I$875,3,FALSE)","v":"APOLO STREICHER ABRÁSCIO"},{"$f":"VLOOKUP(A29,Itinerário!$A$3:$I$875,5,FALSE)","v":"SETEMBRO"},{"$f":"IF(VLOOKUP(A29,Itinerário!$A$3:$I$875,6,FALSE)=0,\"\",VLOOKUP(A29,Itinerário!$A$3:$I$875,6,FALSE))","v":""},"00:00:00",{"$f":"IF(VLOOKUP(A29,Itinerário!$A$3:$I$875,7,FALSE)=0,\"\",VLOOKUP(A29,Itinerário!$A$3:$I$875,7,FALSE))","v":""},{"$f":"IF(VLOOKUP(A29,Itinerário!$A$3:$I$875,8,FALSE)=0,\"\",VLOOKUP(A29,Itinerário!$A$3:$I$875,8,FALSE))","v":""},{"$f":"IF(VLOOKUP(A29,Itinerário!$A$3:$I$875,9,FALSE)=0,\"\",VLOOKUP(A29,Itinerário!$A$3:$I$875,9,FALSE))","v":""}]
[27,{"$f":"VLOOKUP(A30,Itinerário!$A$3:$I$875,3,FALSE)","v":"APOLO STREICHER ABRÁSCIO"},{"$f":"VLOOKUP(A30,Itinerário!$A$3:$I$875,5,FALSE)","v":"SETEMBRO"},{"$f":"IF(VLOOKUP(A30,Itinerário!$A$3:$I$875,6,FALSE)=0,\"\",VLOOKUP(A30,Itinerário!$A$3:$I$875,6,FALSE))","v":""},"00:00:00",{"$f":"IF(VLOOKUP(A30,Itinerário!$A$3:$I$875,7,FALSE)=0,\"\",VLOOKUP(A30,Itinerário!$A$3:$I$875,7,FALSE))","v":""},{"$f":"IF(VLOOKUP(A30,Itinerário!$A$3:$I$875,8,FALSE)=0,\"\",VLOOKUP(A30,Itinerário!$A$3:$I$875,8,FALSE))","v":""},{"$f":"IF(VLOOKUP(A30,Itinerário!$A$3:$I$875,9,FALSE)=0,\"\",VLOOKUP(A30,Itinerário!$A$3:$I$875,9,FALSE))","v":""}]
[28,{"$f":"VLOOKUP(A31,Itinerário!$A$3:$I$875,3,FALSE)","v":"APOLO STREICHER ABRÁSCIO"},{"$f":"VLOOKUP(A31,Itinerário!$A$3:$I$875,5,FALSE)","v":"SETEMBRO"},{"$f":"IF(VLOOKUP(A31,Itinerário!$A$3:$I$875,6,FALSE)=0,\"\",VLOOKUP(A31,Itinerário!$A$3:$I$875,6,FALSE))","v":""},"00:00:00",{"$f":"IF(VLOOKUP(A31,Itinerário!$A$3:$I$875,7,FALSE)=0,\"\",VLOOKUP(A31,Itinerário!$A$3:$I$875,7,FALSE))","v":""},{"$f":"IF(VLOOKUP(A31,Itinerário!$A$3:$I$875,8,FALSE)=0,\"\",VLOOKUP(A31,Itinerário!$A$3:$I$875,8,FALSE))","v":""},{"$f":"IF(VLOOKUP(A31,Itinerário!$A$3:$I$875,9,FALSE)=0,\"\",VLOOKUP(A31,Itinerário!$A$3:$I$875,9,FALSE))","v":""}]
[29,{"$f":"VLOOKUP(A32,Itinerário!$A$3:$I$875,3,FALSE)","v":"APOLO STREICHER ABRÁSCIO"},{"$f":"VLOOKUP(A32,Itinerário!$A$3:$I$875,5,FALSE)","v":"SETEMBRO"},{"$f":"IF(VLOOKUP(A32,Itinerário!$A$3:$I$875,6,FALSE)=0,\"\",VLOOKUP(A32,Itinerário!$A$3:$I$875,6,FALSE))","v":""},"00:00:00",{"$f":"IF(VLOOKUP(A32,Itinerário!$A$3:$I$875,7,FALSE)=0,\"\",VLOOKUP(A32,Itinerário!$A$3:$I$875,7,FALSE))","v":""},{"$f":"IF(VLOOKUP(A32,Itinerário!$A$3:$I$875,8,FALSE)=0,\"\",VLOOKUP(A32,Itinerário!$A$3:$I$875,8,FALSE))","v":""},{"$f":"IF(VLOOKUP(A32,Itinerário!$A$3:$I$875,9,FALSE)=0,\"\",VLOOKUP(A32,Itinerário!$A$3:$I$875,9,FALSE))","v":""}]
[30,{"$f":"VLOOKUP(A33,Itinerário!$A$3:$I$875,3,FALSE)","v":"APOLO STREICHER ABRÁSCIO"},{"$f":"VLOOKUP(A33,Itinerário!$A$3:$I$875,5,FALSE)","v":"SETEMBRO"},{"$f":"IF(VLOOKUP(A33,Itinerário!$A$3:$I$875,6,FALSE)=0,\"\",VLOOKUP(A33,Itinerário!$A$3:$I$875,6,FALSE))","v":""},"00:00:00",{"$f":"IF(VLOOKUP(A33,Itinerário!$A$3:$I$875,7,FALSE)=0,\"\",VLOOKUP(A33,Itinerário!$A$3:$I$875,7,FALSE))","v":""},{"$f":"IF(VLOOKUP(A33,Itinerário!$A$3:$I$875,8,FALSE)=0,\"\",VLOOKUP(A33,Itinerário!$A$3:$I$875,8,FALSE))","v":""},{"$f":"IF(VLOOKUP(A33,Itinerário!$A$3:$I$875,9,FALSE)=0,\"\",VLOOKUP(A33,Itinerário!$A$3:$I$875,9,FALSE))","v":""}]
[31,{"$f":"VLOOKUP(A34,Itinerário!$A$3:$I$875,3,FALSE)","v":"APOLO STREICHER ABRÁSCIO"},{"$f":"VLOOKUP(A34,Itinerário!$A$3:$I$875,5,FALSE)","v":"OUTUBRO"},{"$f":"IF(VLOOKUP(A34,Itinerário!$A$3:$I$875,6,FALSE)=0,\"\",VLOOKUP(A34,Itinerário!$A$3:$I$875,6,FALSE))","v":13},"2018-10-13",{"$f":"IF(VLOOKUP(A34,Itinerário!$A$3:$I$875,7,FALSE)=0,\"\",VLOOKUP(A34,Itinerário!$A$3:$I$875,7,FALSE))","v":"Pregação e visitação professores"},{"$f":"IF(VLOOKUP(A34,Itinerário!$A$3:$I$875,8,FALSE)=0,\"\",VLOOKUP(A34,Itinerário!$A$3:$I$875,8,FALSE))","v":"Ingleses"},{"$f":"IF(VLOOKUP(A34,Itinerário!$A$3:$I$875,9,FALSE)=0,\"\",VLOOKUP(A34,Itinerário!$A$3:$I$875,9,FALSE))","v":"Ingleses"}]
[32,{"$f":"VLOOKUP(A35,Itinerário!$A$3:$I$875,3,FALSE)","v":"APOLO STREICHER ABRÁSCIO"},{"$f":"VLOOKUP(A35,Itinerário!$A$3:$I$875,5,FALSE)","v":"OUTUBRO"},{"$f":"IF(VLOOKUP(A35,Itinerário!$A$3:$I$875,6,FALSE)=0,\"\",VLOOKUP(A35,Itinerário!$A$3:$I$875,6,FALSE))","v":14},"2018-10-14",{"$f":"IF(VLOOKUP(A35,Itinerário!$A$3:$I$875,7,FALSE)=0,\"\",VLOOKUP(A35,Itinerário!$A$3:$I$875,7,FALSE))","v":"Pregação"},{"$f":"IF(VLOOKUP(A35,Itinerário!$A$3:$I$875,8,FALSE)=0,\"\",VLOOKUP(A35,Itinerário!$A$3:$I$875,8,FALSE))","v":"Bom Retiro"},{"$f":"IF(VLOOKUP(A35,Itinerário!$A$3:$I$875,9,FALSE)=0,\"\",VLOOKUP(A35,Itinerário!$A$3:$I$875,9,FALSE))","v":"Bom Retiro"}]
[33,{"$f":"VLOOKUP(A36,Itinerário!$A$3:$I$875,3,FALSE)","v":"APOLO STREICHER ABRÁSCIO"},{"$f":"VLOOKUP(A36,Itinerário!$A$3:$I$875,5,FALSE)","v":"OUTUBRO"},{"$f":"IF(VLOOKUP(A36,Itinerário!$A$3:$I$875,6,FALSE)=0,\"\",VLOOKUP(A36,Itinerário!$A$3:$I$875,6,FALSE))","v":27},"2018-10-27",{"$f":"IF(VLOOKUP(A36,Itinerário!$A$3:$I$875,7,FALSE)=0,\"\",VLOOKUP(A36,Itinerário!$A$3:$I$875,7,FALSE))","v":"Pregação e visitação professores"},{"$f":"IF(VLOOKUP(A36,Itinerário!$A$3:$I$875,8,FALSE)=0,\"\",VLOOKUP(A36,Itinerário!$A$3:$I$875,8,FALSE))","v":"Popular"},{"$f":"IF(VLOOKUP(A36,Itinerário!$A$3:$I$875,9,FALSE)=0,\"\",VLOOKUP(A36,Itinerário!$A$3:$I$875,9,FALSE))","v":"Um ano em missão"}]
[34,{"$f":"VLOOKUP(A37,Itinerário!$A$3:$I$875,3,FALSE)","v":"APOLO STREICHER ABRÁSCIO"},{"$f":"VLOOKUP(A37,Itinerário!$A$3:$I$875,5,FALSE)","v":"OUTUBRO"},{"$f":"IF(VLOOKUP(A37,Itinerário!$A$3:$I$875,6,FALSE)=0,\"\",VLOOKUP(A37,Itinerário!$A$3:$I$875,6,FALSE))","v":""},"00:00:00",{"$f":"IF(VLOOKUP(A37,Itinerário!$A$3:$I$875,7,FALSE)=0,\"\",VLOOKUP(A37,Itinerário!$A$3:$I$875,7,FALSE))","v":""},{"$f":"IF(VLOOKUP(A37,Itinerário!$A$3:$I$875,8,FALSE)=0,\"\",VLOOKUP(A37,Itinerário!$A$3:$I$875,8,FALSE))","v":""},{"$f":"IF(VLOOKUP(A37,Itinerário!$A$3:$I$875,9,FALSE)=0,\"\",VLOOKUP(A37,Itinerário!$A$3:$I$875,9,FALSE))","v":""}]
[35,{"$f":"VLOOKUP(A38,Itinerário!$A$3:$I$875,3,FALSE)","v":"APOLO STREICHER ABRÁSCIO"},{"$f":"VLOOKUP(A38,Itinerário!$A$3:$I$875,5,FALSE)","v":"OUTUBRO"},{"$f":"IF(VLOOKUP(A38,Itinerário!$A$3:$I$875,6,FALSE)=0,\"\",VLOOKUP(A38,Itinerário!$A$3:$I$875,6,FALSE))","v":""},"00:00:00",{"$f":"IF(VLOOKUP(A38,Itinerário!$A$3:$I$875,7,FALSE)=0,\"\",VLOOKUP(A38,Itinerário!$A$3:$I$875,7,FALSE))","v":""},{"$f":"IF(VLOOKUP(A38,Itinerário!$A$3:$I$875,8,FALSE)=0,\"\",VLOOKUP(A38,Itinerário!$A$3:$I$875,8,FALSE))","v":""},{"$f":"IF(VLOOKUP(A38,Itinerário!$A$3:$I$875,9,FALSE)=0,\"\",VLOOKUP(A38,Itinerário!$A$3:$I$875,9,FALSE))","v":""}]
[36,{"$f":"VLOOKUP(A39,Itinerário!$A$3:$I$875,3,FALSE)","v":"APOLO STREICHER ABRÁSCIO"},{"$f":"VLOOKUP(A39,Itinerário!$A$3:$I$875,5,FALSE)","v":"OUTUBRO"},{"$f":"IF(VLOOKUP(A39,Itinerário!$A$3:$I$875,6,FALSE)=0,\"\",VLOOKUP(A39,Itinerário!$A$3:$I$875,6,FALSE))","v":""},"00:00:00",{"$f":"IF(VLOOKUP(A39,Itinerário!$A$3:$I$875,7,FALSE)=0,\"\",VLOOKUP(A39,Itinerário!$A$3:$I$875,7,FALSE))","v":""},{"$f":"IF(VLOOKUP(A39,Itinerário!$A$3:$I$875,8,FALSE)=0,\"\",VLOOKUP(A39,Itinerário!$A$3:$I$875,8,FALSE))","v":""},{"$f":"IF(VLOOKUP(A39,Itinerário!$A$3:$I$875,9,FALSE)=0,\"\",VLOOKUP(A39,Itinerário!$A$3:$I$875,9,FALSE))","v":""}]
[37,{"$f":"VLOOKUP(A40,Itinerário!$A$3:$I$875,3,FALSE)","v":"APOLO STREICHER ABRÁSCIO"},{"$f":"VLOOKUP(A40,Itinerário!$A$3:$I$875,5,FALSE)","v":"OUTUBRO"},{"$f":"IF(VLOOKUP(A40,Itinerário!$A$3:$I$875,6,FALSE)=0,\"\",VLOOKUP(A40,Itinerário!$A$3:$I$875,6,FALSE))","v":""},"00:00:00",{"$f":"IF(VLOOKUP(A40,Itinerário!$A$3:$I$875,7,FALSE)=0,\"\",VLOOKUP(A40,Itinerário!$A$3:$I$875,7,FALSE))","v":""},{"$f":"IF(VLOOKUP(A40,Itinerário!$A$3:$I$875,8,FALSE)=0,\"\",VLOOKUP(A40,Itinerário!$A$3:$I$875,8,FALSE))","v":""},{"$f":"IF(VLOOKUP(A40,Itinerário!$A$3:$I$875,9,FALSE)=0,\"\",VLOOKUP(A40,Itinerário!$A$3:$I$875,9,FALSE))","v":""}]
[38,{"$f":"VLOOKUP(A41,Itinerário!$A$3:$I$875,3,FALSE)","v":"APOLO STREICHER ABRÁSCIO"},{"$f":"VLOOKUP(A41,Itinerário!$A$3:$I$875,5,FALSE)","v":"OUTUBRO"},{"$f":"IF(VLOOKUP(A41,Itinerário!$A$3:$I$875,6,FALSE)=0,\"\",VLOOKUP(A41,Itinerário!$A$3:$I$875,6,FALSE))","v":""},"00:00:00",{"$f":"IF(VLOOKUP(A41,Itinerário!$A$3:$I$875,7,FALSE)=0,\"\",VLOOKUP(A41,Itinerário!$A$3:$I$875,7,FALSE))","v":""},{"$f":"IF(VLOOKUP(A41,Itinerário!$A$3:$I$875,8,FALSE)=0,\"\",VLOOKUP(A41,Itinerário!$A$3:$I$875,8,FALSE))","v":""},{"$f":"IF(VLOOKUP(A41,Itinerário!$A$3:$I$875,9,FALSE)=0,\"\",VLOOKUP(A41,Itinerário!$A$3:$I$875,9,FALSE))","v":""}]
[39,{"$f":"VLOOKUP(A42,Itinerário!$A$3:$I$875,3,FALSE)","v":"APOLO STREICHER ABRÁSCIO"},{"$f":"VLOOKUP(A42,Itinerário!$A$3:$I$875,5,FALSE)","v":"OUTUBRO"},{"$f":"IF(VLOOKUP(A42,Itinerário!$A$3:$I$875,6,FALSE)=0,\"\",VLOOKUP(A42,Itinerário!$A$3:$I$875,6,FALSE))","v":""},"00:00:00",{"$f":"IF(VLOOKUP(A42,Itinerário!$A$3:$I$875,7,FALSE)=0,\"\",VLOOKUP(A42,Itinerário!$A$3:$I$875,7,FALSE))","v":""},{"$f":"IF(VLOOKUP(A42,Itinerário!$A$3:$I$875,8,FALSE)=0,\"\",VLOOKUP(A42,Itinerário!$A$3:$I$875,8,FALSE))","v":""},{"$f":"IF(VLOOKUP(A42,Itinerário!$A$3:$I$875,9,FALSE)=0,\"\",VLOOKUP(A42,Itinerário!$A$3:$I$875,9,FALSE))","v":""}]
[40,{"$f":"VLOOKUP(A43,Itinerário!$A$3:$I$875,3,FALSE)","v":"APOLO STREICHER ABRÁSCIO"},{"$f":"VLOOKUP(A43,Itinerário!$A$3:$I$875,5,FALSE)","v":"OUTUBRO"},{"$f":"IF(VLOOKUP(A43,Itinerário!$A$3:$I$875,6,FALSE)=0,\"\",VLOOKUP(A43,Itinerário!$A$3:$I$875,6,FALSE))","v":""},"00:00:00",{"$f":"IF(VLOOKUP(A43,Itinerário!$A$3:$I$875,7,FALSE)=0,\"\",VLOOKUP(A43,Itinerário!$A$3:$I$875,7,FALSE))","v":""},{"$f":"IF(VLOOKUP(A43,Itinerário!$A$3:$I$875,8,FALSE)=0,\"\",VLOOKUP(A43,Itinerário!$A$3:$I$875,8,FALSE))","v":""},{"$f":"IF(VLOOKUP(A43,Itinerário!$A$3:$I$875,9,FALSE)=0,\"\",VLOOKUP(A43,Itinerário!$A$3:$I$875,9,FALSE))","v":""}]
[41,{"$f":"VLOOKUP(A44,Itinerário!$A$3:$I$875,3,FALSE)","v":"APOLO STREICHER ABRÁSCIO"},{"$f":"VLOOKUP(A44,Itinerário!$A$3:$I$875,5,FALSE)","v":"NOVEMBRO"},{"$f":"IF(VLOOKUP(A44,Itinerário!$A$3:$I$875,6,FALSE)=0,\"\",VLOOKUP(A44,Itinerário!$A$3:$I$875,6,FALSE))","v":3},"2018-11-03",{"$f":"IF(VLOOKUP(A44,Itinerário!$A$3:$I$875,7,FALSE)=0,\"\",VLOOKUP(A44,Itinerário!$A$3:$I$875,7,FALSE))","v":"Pregação e visitação professores"},{"$f":"IF(VLOOKUP(A44,Itinerário!$A$3:$I$875,8,FALSE)=0,\"\",VLOOKUP(A44,Itinerário!$A$3:$I$875,8,FALSE))","v":"Estância Do Meio"},{"$f":"IF(VLOOKUP(A44,Itinerário!$A$3:$I$875,9,FALSE)=0,\"\",VLOOKUP(A44,Itinerário!$A$3:$I$875,9,FALSE))","v":"São Joaquim"}]
[42,{"$f":"VLOOKUP(A45,Itinerário!$A$3:$I$875,3,FALSE)","v":"APOLO STREICHER ABRÁSCIO"},{"$f":"VLOOKUP(A45,Itinerário!$A$3:$I$875,5,FALSE)","v":"NOVEMBRO"},{"$f":"IF(VLOOKUP(A45,Itinerário!$A$3:$I$875,6,FALSE)=0,\"\",VLOOKUP(A45,Itinerário!$A$3:$I$875,6,FALSE))","v":"4 a 10"},"00:00:00",{"$f":"IF(VLOOKUP(A45,Itinerário!$A$3:$I$875,7,FALSE)=0,\"\",VLOOKUP(A45,Itinerário!$A$3:$I$875,7,FALSE))","v":"Evangelismo Criciuma"},{"$f":"IF(VLOOKUP(A45,Itinerário!$A$3:$I$875,8,FALSE)=0,\"\",VLOOKUP(A45,Itinerário!$A$3:$I$875,8,FALSE))","v":"AC"},{"$f":"IF(VLOOKUP(A45,Itinerário!$A$3:$I$875,9,FALSE)=0,\"\",VLOOKUP(A45,Itinerário!$A$3:$I$875,9,FALSE))","v":"AC"}]
[43,{"$f":"VLOOKUP(A46,Itinerário!$A$3:$I$875,3,FALSE)","v":"APOLO STREICHER ABRÁSCIO"},{"$f":"VLOOKUP(A46,Itinerário!$A$3:$I$875,5,FALSE)","v":"NOVEMBRO"},{"$f":"IF(VLOOKUP(A46,Itinerário!$A$3:$I$875,6,FALSE)=0,\"\",VLOOKUP(A46,Itinerário!$A$3:$I$875,6,FALSE))","v":17},"2018-11-17",{"$f":"IF(VLOOKUP(A46,Itinerário!$A$3:$I$875,7,FALSE)=0,\"\",VLOOKUP(A46,Itinerário!$A$3:$I$875,7,FALSE))","v":"Campori de Jovens"},{"$f":"IF(VLOOKUP(A46,Itinerário!$A$3:$I$875,8,FALSE)=0,\"\",VLOOKUP(A46,Itinerário!$A$3:$I$875,8,FALSE))","v":"USB"},{"$f":"IF(VLOOKUP(A46,Itinerário!$A$3:$I$875,9,FALSE)=0,\"\",VLOOKUP(A46,Itinerário!$A$3:$I$875,9,FALSE))","v":"USB"}]
[44,{"$f":"VLOOKUP(A47,Itinerário!$A$3:$I$875,3,FALSE)","v":"APOLO STREICHER ABRÁSCIO"},{"$f":"VLOOKUP(A47,Itinerário!$A$3:$I$875,5,FALSE)","v":"NOVEMBRO"},{"$f":"IF(VLOOKUP(A47,Itinerário!$A$3:$I$875,6,FALSE)=0,\"\",VLOOKUP(A47,Itinerário!$A$3:$I$875,6,FALSE))","v":24},"2018-11-24",{"$f":"IF(VLOOKUP(A47,Itinerário!$A$3:$I$875,7,FALSE)=0,\"\",VLOOKUP(A47,Itinerário!$A$3:$I$875,7,FALSE))","v":"Aventuri"},{"$f":"IF(VLOOKUP(A47,Itinerário!$A$3:$I$875,8,FALSE)=0,\"\",VLOOKUP(A47,Itinerário!$A$3:$I$875,8,FALSE))","v":""},{"$f":"IF(VLOOKUP(A47,Itinerário!$A$3:$I$875,9,FALSE)=0,\"\",VLOOKUP(A47,Itinerário!$A$3:$I$875,9,FALSE))","v":""}]
[45,{"$f":"VLOOKUP(A48,Itinerário!$A$3:$I$875,3,FALSE)","v":"APOLO STREICHER ABRÁSCIO"},{"$f":"VLOOKUP(A48,Itinerário!$A$3:$I$875,5,FALSE)","v":"NOVEMBRO"},{"$f":"IF(VLOOKUP(A48,Itinerário!$A$3:$I$875,6,FALSE)=0,\"\",VLOOKUP(A48,Itinerário!$A$3:$I$875,6,FALSE))","v":""},"00:00:00",{"$f":"IF(VLOOKUP(A48,Itinerário!$A$3:$I$875,7,FALSE)=0,\"\",VLOOKUP(A48,Itinerário!$A$3:$I$875,7,FALSE))","v":""},{"$f":"IF(VLOOKUP(A48,Itinerário!$A$3:$I$875,8,FALSE)=0,\"\",VLOOKUP(A48,Itinerário!$A$3:$I$875,8,FALSE))","v":""},{"$f":"IF(VLOOKUP(A48,Itinerário!$A$3:$I$875,9,FALSE)=0,\"\",VLOOKUP(A48,Itinerário!$A$3:$I$875,9,FALSE))","v":""}]
[46,{"$f":"VLOOKUP(A49,Itinerário!$A$3:$I$875,3,FALSE)","v":"APOLO STREICHER ABRÁSCIO"},{"$f":"VLOOKUP(A49,Itinerário!$A$3:$I$875,5,FALSE)","v":"NOVEMBRO"},{"$f":"IF(VLOOKUP(A49,Itinerário!$A$3:$I$875,6,FALSE)=0,\"\",VLOOKUP(A49,Itinerário!$A$3:$I$875,6,FALSE))","v":""},"00:00:00",{"$f":"IF(VLOOKUP(A49,Itinerário!$A$3:$I$875,7,FALSE)=0,\"\",VLOOKUP(A49,Itinerário!$A$3:$I$875,7,FALSE))","v":""},{"$f":"IF(VLOOKUP(A49,Itinerário!$A$3:$I$875,8,FALSE)=0,\"\",VLOOKUP(A49,Itinerário!$A$3:$I$875,8,FALSE))","v":""},{"$f":"IF(VLOOKUP(A49,Itinerário!$A$3:$I$875,9,FALSE)=0,\"\",VLOOKUP(A49,Itinerário!$A$3:$I$875,9,FALSE))","v":""}]
[47,{"$f":"VLOOKUP(A50,Itinerário!$A$3:$I$875,3,FALSE)","v":"APOLO STREICHER ABRÁSCIO"},{"$f":"VLOOKUP(A50,Itinerário!$A$3:$I$875,5,FALSE)","v":"NOVEMBRO"},{"$f":"IF(VLOOKUP(A50,Itinerário!$A$3:$I$875,6,FALSE)=0,\"\",VLOOKUP(A50,Itinerário!$A$3:$I$875,6,FALSE))","v":""},"00:00:00",{"$f":"IF(VLOOKUP(A50,Itinerário!$A$3:$I$875,7,FALSE)=0,\"\",VLOOKUP(A50,Itinerário!$A$3:$I$875,7,FALSE))","v":""},{"$f":"IF(VLOOKUP(A50,Itinerário!$A$3:$I$875,8,FALSE)=0,\"\",VLOOKUP(A50,Itinerário!$A$3:$I$875,8,FALSE))","v":""},{"$f":"IF(VLOOKUP(A50,Itinerário!$A$3:$I$875,9,FALSE)=0,\"\",VLOOKUP(A50,Itinerário!$A$3:$I$875,9,FALSE))","v":""}]
[48,{"$f":"VLOOKUP(A51,Itinerário!$A$3:$I$875,3,FALSE)","v":"APOLO STREICHER ABRÁSCIO"},{"$f":"VLOOKUP(A51,Itinerário!$A$3:$I$875,5,FALSE)","v":"NOVEMBRO"},{"$f":"IF(VLOOKUP(A51,Itinerário!$A$3:$I$875,6,FALSE)=0,\"\",VLOOKUP(A51,Itinerário!$A$3:$I$875,6,FALSE))","v":""},"00:00:00",{"$f":"IF(VLOOKUP(A51,Itinerário!$A$3:$I$875,7,FALSE)=0,\"\",VLOOKUP(A51,Itinerário!$A$3:$I$875,7,FALSE))","v":""},{"$f":"IF(VLOOKUP(A51,Itinerário!$A$3:$I$875,8,FALSE)=0,\"\",VLOOKUP(A51,Itinerário!$A$3:$I$875,8,FALSE))","v":""},{"$f":"IF(VLOOKUP(A51,Itinerário!$A$3:$I$875,9,FALSE)=0,\"\",VLOOKUP(A51,Itinerário!$A$3:$I$875,9,FALSE))","v":""}]
[49,{"$f":"VLOOKUP(A52,Itinerário!$A$3:$I$875,3,FALSE)","v":"APOLO STREICHER ABRÁSCIO"},{"$f":"VLOOKUP(A52,Itinerário!$A$3:$I$875,5,FALSE)","v":"NOVEMBRO"},{"$f":"IF(VLOOKUP(A52,Itinerário!$A$3:$I$875,6,FALSE)=0,\"\",VLOOKUP(A52,Itinerário!$A$3:$I$875,6,FALSE))","v":""},"00:00:00",{"$f":"IF(VLOOKUP(A52,Itinerário!$A$3:$I$875,7,FALSE)=0,\"\",VLOOKUP(A52,Itinerário!$A$3:$I$875,7,FALSE))","v":""},{"$f":"IF(VLOOKUP(A52,Itinerário!$A$3:$I$875,8,FALSE)=0,\"\",VLOOKUP(A52,Itinerário!$A$3:$I$875,8,FALSE))","v":""},{"$f":"IF(VLOOKUP(A52,Itinerário!$A$3:$I$875,9,FALSE)=0,\"\",VLOOKUP(A52,Itinerário!$A$3:$I$875,9,FALSE))","v":""}]
[50,{"$f":"VLOOKUP(A53,Itinerário!$A$3:$I$875,3,FALSE)","v":"APOLO STREICHER ABRÁSCIO"},{"$f":"VLOOKUP(A53,Itinerário!$A$3:$I$875,5,FALSE)","v":"NOVEMBRO"},{"$f":"IF(VLOOKUP(A53,Itinerário!$A$3:$I$875,6,FALSE)=0,\"\",VLOOKUP(A53,Itinerário!$A$3:$I$875,6,FALSE))","v":""},"00:00:00",{"$f":"IF(VLOOKUP(A53,Itinerário!$A$3:$I$875,7,FALSE)=0,\"\",VLOOKUP(A53,Itinerário!$A$3:$I$875,7,FALSE))","v":""},{"$f":"IF(VLOOKUP(A53,Itinerário!$A$3:$I$875,8,FALSE)=0,\"\",VLOOKUP(A53,Itinerário!$A$3:$I$875,8,FALSE))","v":""},{"$f":"IF(VLOOKUP(A53,Itinerário!$A$3:$I$875,9,FALSE)=0,\"\",VLOOKUP(A53,Itinerário!$A$3:$I$875,9,FALSE))","v":""}]
[51,{"$f":"VLOOKUP(A54,Itinerário!$A$3:$I$875,3,FALSE)","v":"APOLO STREICHER ABRÁSCIO"},{"$f":"VLOOKUP(A54,Itinerário!$A$3:$I$875,5,FALSE)","v":"DEZEMBRO"},{"$f":"IF(VLOOKUP(A54,Itinerário!$A$3:$I$875,6,FALSE)=0,\"\",VLOOKUP(A54,Itinerário!$A$3:$I$875,6,FALSE))","v":1},"2018-12-01",{"$f":"IF(VLOOKUP(A54,Itinerário!$A$3:$I$875,7,FALSE)=0,\"\",VLOOKUP(A54,Itinerário!$A$3:$I$875,7,FALSE))","v":"Pregação e visitação professores"},{"$f":"IF(VLOOKUP(A54,Itinerário!$A$3:$I$875,8,FALSE)=0,\"\",VLOOKUP(A54,Itinerário!$A$3:$I$875,8,FALSE))","v":"Nova Brasília"},{"$f":"IF(VLOOKUP(A54,Itinerário!$A$3:$I$875,9,FALSE)=0,\"\",VLOOKUP(A54,Itinerário!$A$3:$I$875,9,FALSE))","v":"Nova Brasília"}]
[52,{"$f":"VLOOKUP(A55,Itinerário!$A$3:$I$875,3,FALSE)","v":"APOLO STREICHER ABRÁSCIO"},{"$f":"VLOOKUP(A55,Itinerário!$A$3:$I$875,5,FALSE)","v":"DEZEMBRO"},{"$f":"IF(VLOOKUP(A55,Itinerário!$A$3:$I$875,6,FALSE)=0,\"\",VLOOKUP(A55,Itinerário!$A$3:$I$875,6,FALSE))","v":2},"2018-12-02",{"$f":"IF(VLOOKUP(A55,Itinerário!$A$3:$I$875,7,FALSE)=0,\"\",VLOOKUP(A55,Itinerário!$A$3:$I$875,7,FALSE))","v":"Culto de ações de graças"},{"$f":"IF(VLOOKUP(A55,Itinerário!$A$3:$I$875,8,FALSE)=0,\"\",VLOOKUP(A55,Itinerário!$A$3:$I$875,8,FALSE))","v":"AC"},{"$f":"IF(VLOOKUP(A55,Itinerário!$A$3:$I$875,9,FALSE)=0,\"\",VLOOKUP(A55,Itinerário!$A$3:$I$875,9,FALSE))","v":"AC"}]
[53,{"$f":"VLOOKUP(A56,Itinerário!$A$3:$I$875,3,FALSE)","v":"APOLO STREICHER ABRÁSCIO"},{"$f":"VLOOKUP(A56,Itinerário!$A$3:$I$875,5,FALSE)","v":"DEZEMBRO"},{"$f":"IF(VLOOKUP(A56,Itinerário!$A$3:$I$875,6,FALSE)=0,\"\",VLOOKUP(A56,Itinerário!$A$3:$I$875,6,FALSE))","v":8},"2018-12-08",{"$f":"IF(VLOOKUP(A56,Itinerário!$A$3:$I$875,7,FALSE)=0,\"\",VLOOKUP(A56,Itinerário!$A$3:$I$875,7,FALSE))","v":"CelebrAC (CATRE)"},{"$f":"IF(VLOOKUP(A56,Itinerário!$A$3:$I$875,8,FALSE)=0,\"\",VLOOKUP(A56,Itinerário!$A$3:$I$875,8,FALSE))","v":"CATRE"},{"$f":"IF(VLOOKUP(A56,Itinerário!$A$3:$I$875,9,FALSE)=0,\"\",VLOOKUP(A56,Itinerário!$A$3:$I$875,9,FALSE))","v":"CATRE"}]
[54,{"$f":"VLOOKUP(A57,Itinerário!$A$3:$I$875,3,FALSE)","v":"APOLO STREICHER ABRÁSCIO"},{"$f":"VLOOKUP(A57,Itinerário!$A$3:$I$875,5,FALSE)","v":"DEZEMBRO"},{"$f":"IF(VLOOKUP(A57,Itinerário!$A$3:$I$875,6,FALSE)=0,\"\",VLOOKUP(A57,Itinerário!$A$3:$I$875,6,FALSE))","v":15},"2018-12-15",{"$f":"IF(VLOOKUP(A57,Itinerário!$A$3:$I$875,7,FALSE)=0,\"\",VLOOKUP(A57,Itinerário!$A$3:$I$875,7,FALSE))","v":"Pregação"},{"$f":"IF(VLOOKUP(A57,Itinerário!$A$3:$I$875,8,FALSE)=0,\"\",VLOOKUP(A57,Itinerário!$A$3:$I$875,8,FALSE))","v":"Limoeiro"},{"$f":"IF(VLOOKUP(A57,Itinerário!$A$3:$I$875,9,FALSE)=0,\"\",VLOOKUP(A57,Itinerário!$A$3:$I$875,9,FALSE))","v":"Limoeiro"}]
[55,{"$f":"VLOOKUP(A58,Itinerário!$A$3:$I$875,3,FALSE)","v":"APOLO STREICHER ABRÁSCIO"},{"$f":"VLOOKUP(A58,Itinerário!$A$3:$I$875,5,FALSE)","v":"DEZEMBRO"},{"$f":"IF(VLOOKUP(A58,Itinerário!$A$3:$I$875,6,FALSE)=0,\"\",VLOOKUP(A58,Itinerário!$A$3:$I$875,6,FALSE))","v":""},"00:00:00",{"$f":"IF(VLOOKUP(A58,Itinerário!$A$3:$I$875,7,FALSE)=0,\"\",VLOOKUP(A58,Itinerário!$A$3:$I$875,7,FALSE))","v":""},{"$f":"IF(VLOOKUP(A58,Itinerário!$A$3:$I$875,8,FALSE)=0,\"\",VLOOKUP(A58,Itinerário!$A$3:$I$875,8,FALSE))","v":""},{"$f":"IF(VLOOKUP(A58,Itinerário!$A$3:$I$875,9,FALSE)=0,\"\",VLOOKUP(A58,Itinerário!$A$3:$I$875,9,FALSE))","v":""}]
[56,{"$f":"VLOOKUP(A59,Itinerário!$A$3:$I$875,3,FALSE)","v":"APOLO STREICHER ABRÁSCIO"},{"$f":"VLOOKUP(A59,Itinerário!$A$3:$I$875,5,FALSE)","v":"DEZEMBRO"},{"$f":"IF(VLOOKUP(A59,Itinerário!$A$3:$I$875,6,FALSE)=0,\"\",VLOOKUP(A59,Itinerário!$A$3:$I$875,6,FALSE))","v":""},"00:00:00",{"$f":"IF(VLOOKUP(A59,Itinerário!$A$3:$I$875,7,FALSE)=0,\"\",VLOOKUP(A59,Itinerário!$A$3:$I$875,7,FALSE))","v":""},{"$f":"IF(VLOOKUP(A59,Itinerário!$A$3:$I$875,8,FALSE)=0,\"\",VLOOKUP(A59,Itinerário!$A$3:$I$875,8,FALSE))","v":""},{"$f":"IF(VLOOKUP(A59,Itinerário!$A$3:$I$875,9,FALSE)=0,\"\",VLOOKUP(A59,Itinerário!$A$3:$I$875,9,FALSE))","v":""}]
[57,{"$f":"VLOOKUP(A60,Itinerário!$A$3:$I$875,3,FALSE)","v":"APOLO STREICHER ABRÁSCIO"},{"$f":"VLOOKUP(A60,Itinerário!$A$3:$I$875,5,FALSE)","v":"DEZEMBRO"},{"$f":"IF(VLOOKUP(A60,Itinerário!$A$3:$I$875,6,FALSE)=0,\"\",VLOOKUP(A60,Itinerário!$A$3:$I$875,6,FALSE))","v":""},"00:00:00",{"$f":"IF(VLOOKUP(A60,Itinerário!$A$3:$I$875,7,FALSE)=0,\"\",VLOOKUP(A60,Itinerário!$A$3:$I$875,7,FALSE))","v":""},{"$f":"IF(VLOOKUP(A60,Itinerário!$A$3:$I$875,8,FALSE)=0,\"\",VLOOKUP(A60,Itinerário!$A$3:$I$875,8,FALSE))","v":""},{"$f":"IF(VLOOKUP(A60,Itinerário!$A$3:$I$875,9,FALSE)=0,\"\",VLOOKUP(A60,Itinerário!$A$3:$I$875,9,FALSE))","v":""}]
[58,{"$f":"VLOOKUP(A61,Itinerário!$A$3:$I$875,3,FALSE)","v":"APOLO STREICHER ABRÁSCIO"},{"$f":"VLOOKUP(A61,Itinerário!$A$3:$I$875,5,FALSE)","v":"DEZEMBRO"},{"$f":"IF(VLOOKUP(A61,Itinerário!$A$3:$I$875,6,FALSE)=0,\"\",VLOOKUP(A61,Itinerário!$A$3:$I$875,6,FALSE))","v":""},"00:00:00",{"$f":"IF(VLOOKUP(A61,Itinerário!$A$3:$I$875,7,FALSE)=0,\"\",VLOOKUP(A61,Itinerário!$A$3:$I$875,7,FALSE))","v":""},{"$f":"IF(VLOOKUP(A61,Itinerário!$A$3:$I$875,8,FALSE)=0,\"\",VLOOKUP(A61,Itinerário!$A$3:$I$875,8,FALSE))","v":""},{"$f":"IF(VLOOKUP(A61,Itinerário!$A$3:$I$875,9,FALSE)=0,\"\",VLOOKUP(A61,Itinerário!$A$3:$I$875,9,FALSE))","v":""}]
[59,{"$f":"VLOOKUP(A62,Itinerário!$A$3:$I$875,3,FALSE)","v":"APOLO STREICHER ABRÁSCIO"},{"$f":"VLOOKUP(A62,Itinerário!$A$3:$I$875,5,FALSE)","v":"DEZEMBRO"},{"$f":"IF(VLOOKUP(A62,Itinerário!$A$3:$I$875,6,FALSE)=0,\"\",VLOOKUP(A62,Itinerário!$A$3:$I$875,6,FALSE))","v":""},"00:00:00",{"$f":"IF(VLOOKUP(A62,Itinerário!$A$3:$I$875,7,FALSE)=0,\"\",VLOOKUP(A62,Itinerário!$A$3:$I$875,7,FALSE))","v":""},{"$f":"IF(VLOOKUP(A62,Itinerário!$A$3:$I$875,8,FALSE)=0,\"\",VLOOKUP(A62,Itinerário!$A$3:$I$875,8,FALSE))","v":""},{"$f":"IF(VLOOKUP(A62,Itinerário!$A$3:$I$875,9,FALSE)=0,\"\",VLOOKUP(A62,Itinerário!$A$3:$I$875,9,FALSE))","v":""}]
[60,{"$f":"VLOOKUP(A63,Itinerário!$A$3:$I$875,3,FALSE)","v":"APOLO STREICHER ABRÁSCIO"},{"$f":"VLOOKUP(A63,Itinerário!$A$3:$I$875,5,FALSE)","v":"DEZEMBRO"},{"$f":"IF(VLOOKUP(A63,Itinerário!$A$3:$I$875,6,FALSE)=0,\"\",VLOOKUP(A63,Itinerário!$A$3:$I$875,6,FALSE))","v":""},"00:00:00",{"$f":"IF(VLOOKUP(A63,Itinerário!$A$3:$I$875,7,FALSE)=0,\"\",VLOOKUP(A63,Itinerário!$A$3:$I$875,7,FALSE))","v":""},{"$f":"IF(VLOOKUP(A63,Itinerário!$A$3:$I$875,8,FALSE)=0,\"\",VLOOKUP(A63,Itinerário!$A$3:$I$875,8,FALSE))","v":""},{"$f":"IF(VLOOKUP(A63,Itinerário!$A$3:$I$875,9,FALSE)=0,\"\",VLOOKUP(A63,Itinerário!$A$3:$I$875,9,FALSE))","v":""}]
[61,{"$f":"VLOOKUP(A64,Itinerário!$A$3:$I$875,3,FALSE)","v":"PAULO ROBERTO BARBOSA LOPES"},{"$f":"VLOOKUP(A64,Itinerário!$A$3:$I$875,5,FALSE)","v":"JULHO"},{"$f":"IF(VLOOKUP(A64,Itinerário!$A$3:$I$875,6,FALSE)=0,\"\",VLOOKUP(A64,Itinerário!$A$3:$I$875,6,FALSE))","v":7},"2018-07-07",{"$f":"IF(VLOOKUP(A64,Itinerário!$A$3:$I$875,7,FALSE)=0,\"\",VLOOKUP(A64,Itinerário!$A$3:$I$875,7,FALSE))","v":"Pregação"},{"$f":"IF(VLOOKUP(A64,Itinerário!$A$3:$I$875,8,FALSE)=0,\"\",VLOOKUP(A64,Itinerário!$A$3:$I$875,8,FALSE))","v":"Barreiros"},{"$f":"IF(VLOOKUP(A64,Itinerário!$A$3:$I$875,9,FALSE)=0,\"\",VLOOKUP(A64,Itinerário!$A$3:$I$875,9,FALSE))","v":"Barreiros"}]
[62,{"$f":"VLOOKUP(A65,Itinerário!$A$3:$I$875,3,FALSE)","v":"PAULO ROBERTO BARBOSA LOPES"},{"$f":"VLOOKUP(A65,Itinerário!$A$3:$I$875,5,FALSE)","v":"JULHO"},{"$f":"IF(VLOOKUP(A65,Itinerário!$A$3:$I$875,6,FALSE)=0,\"\",VLOOKUP(A65,Itinerário!$A$3:$I$875,6,FALSE))","v":21},"2018-07-21",{"$f":"IF(VLOOKUP(A65,Itinerário!$A$3:$I$875,7,FALSE)=0,\"\",VLOOKUP(A65,Itinerário!$A$3:$I$875,7,FALSE))","v":"Pregação"},{"$f":"IF(VLOOKUP(A65,Itinerário!$A$3:$I$875,8,FALSE)=0,\"\",VLOOKUP(A65,Itinerário!$A$3:$I$875,8,FALSE))","v":"Estreito"},{"$f":"IF(VLOOKUP(A65,Itinerário!$A$3:$I$875,9,FALSE)=0,\"\",VLOOKUP(A65,Itinerário!$A$3:$I$875,9,FALSE))","v":"Estreito"}]
[63,{"$f":"VLOOKUP(A66,Itinerário!$A$3:$I$875,3,FALSE)","v":"PAULO ROBERTO BARBOSA LOPES"},{"$f":"VLOOKUP(A66,Itinerário!$A$3:$I$875,5,FALSE)","v":"JULHO"},{"$f":"IF(VLOOKUP(A66,Itinerário!$A$3:$I$875,6,FALSE)=0,\"\",VLOOKUP(A66,Itinerário!$A$3:$I$875,6,FALSE))","v":28},"2018-07-28",{"$f":"IF(VLOOKUP(A66,Itinerário!$A$3:$I$875,7,FALSE)=0,\"\",VLOOKUP(A66,Itinerário!$A$3:$I$875,7,FALSE))","v":"Pregação"},{"$f":"IF(VLOOKUP(A66,Itinerário!$A$3:$I$875,8,FALSE)=0,\"\",VLOOKUP(A66,Itinerário!$A$3:$I$875,8,FALSE))","v":"Sambaqui"},{"$f":"IF(VLOOKUP(A66,Itinerário!$A$3:$I$875,9,FALSE)=0,\"\",VLOOKUP(A66,Itinerário!$A$3:$I$875,9,FALSE))","v":"Universitario"}]
[64,{"$f":"VLOOKUP(A67,Itinerário!$A$3:$I$875,3,FALSE)","v":"PAULO ROBERTO BARBOSA LOPES"},{"$f":"VLOOKUP(A67,Itinerário!$A$3:$I$875,5,FALSE)","v":"JULHO"},{"$f":"IF(VLOOKUP(A67,Itinerário!$A$3:$I$875,6,FALSE)=0,\"\",VLOOKUP(A67,Itinerário!$A$3:$I$875,6,FALSE))","v":""},"00:00:00",{"$f":"IF(VLOOKUP(A67,Itinerário!$A$3:$I$875,7,FALSE)=0,\"\",VLOOKUP(A67,Itinerário!$A$3:$I$875,7,FALSE))","v":""},{"$f":"IF(VLOOKUP(A67,Itinerário!$A$3:$I$875,8,FALSE)=0,\"\",VLOOKUP(A67,Itinerário!$A$3:$I$875,8,FALSE))","v":""},{"$f":"IF(VLOOKUP(A67,Itinerário!$A$3:$I$875,9,FALSE)=0,\"\",VLOOKUP(A67,Itinerário!$A$3:$I$875,9,FALSE))","v":""}]
[65,{"$f":"VLOOKUP(A68,Itinerário!$A$3:$I$875,3,FALSE)","v":"PAULO ROBERTO BARBOSA LOPES"},{"$f":"VLOOKUP(A68,Itinerário!$A$3:$I$875,5,FALSE)","v":"JULHO"},{"$f":"IF(VLOOKUP(A68,Itinerário!$A$3:$I$875,6,FALSE)=0,\"\",VLOOKUP(A68,Itinerário!$A$3:$I$875,6,FALSE))","v":""},{"$f":"IFERROR(DATE(RIGHT($B$2,4),VLOOKUP(C68,$J$4:$K$15,2,FALSE),D68),0)","v":"00:00:00"},{"$f":"IF(VLOOKUP(A68,Itinerário!$A$3:$I$875,7,FALSE)=0,\"\",VLOOKUP(A68,Itinerário!$A$3:$I$875,7,FALSE))","v":""},{"$f":"IF(VLOOKUP(A68,Itinerário!$A$3:$I$875,8,FALSE)=0,\"\",VLOOKUP(A68,Itinerário!$A$3:$I$875,8,FALSE))","v":""},{"$f":"IF(VLOOKUP(A68,Itinerário!$A$3:$I$875,9,FALSE)=0,\"\",VLOOKUP(A68,Itinerário!$A$3:$I$875,9,FALSE))","v":""}]
[66,{"$f":"VLOOKUP(A69,Itinerário!$A$3:$I$875,3,FALSE)","v":"PAULO ROBERTO BARBOSA LOPES"},{"$f":"VLOOKUP(A69,Itinerário!$A$3:$I$875,5,FALSE)","v":"JULHO"},{"$f":"IF(VLOOKUP(A69,Itinerário!$A$3:$I$875,6,FALSE)=0,\"\",VLOOKUP(A69,Itinerário!$A$3:$I$875,6,FALSE))","v":""},"00:00:00",{"$f":"IF(VLOOKUP(A69,Itinerário!$A$3:$I$875,7,FALSE)=0,\"\",VLOOKUP(A69,Itinerário!$A$3:$I$875,7,FALSE))","v":""},{"$f":"IF(VLOOKUP(A69,Itinerário!$A$3:$I$875,8,FALSE)=0,\"\",VLOOKUP(A69,Itinerário!$A$3:$I$875,8,FALSE))","v":""},{"$f":"IF(VLOOKUP(A69,Itinerário!$A$3:$I$875,9,FALSE)=0,\"\",VLOOKUP(A69,Itinerário!$A$3:$I$875,9,FALSE))","v":""}]
[67,{"$f":"VLOOKUP(A70,Itinerário!$A$3:$I$875,3,FALSE)","v":"PAULO ROBERTO BARBOSA LOPES"},{"$f":"VLOOKUP(A70,Itinerário!$A$3:$I$875,5,FALSE)","v":"JULHO"},{"$f":"IF(VLOOKUP(A70,Itinerário!$A$3:$I$875,6,FALSE)=0,\"\",VLOOKUP(A70,Itinerário!$A$3:$I$875,6,FALSE))","v":""},"00:00:00",{"$f":"IF(VLOOKUP(A70,Itinerário!$A$3:$I$875,7,FALSE)=0,\"\",VLOOKUP(A70,Itinerário!$A$3:$I$875,7,FALSE))","v":""},{"$f":"IF(VLOOKUP(A70,Itinerário!$A$3:$I$875,8,FALSE)=0,\"\",VLOOKUP(A70,Itinerário!$A$3:$I$875,8,FALSE))","v":""},{"$f":"IF(VLOOKUP(A70,Itinerário!$A$3:$I$875,9,FALSE)=0,\"\",VLOOKUP(A70,Itinerário!$A$3:$I$875,9,FALSE))","v":""}]
[68,{"$f":"VLOOKUP(A71,Itinerário!$A$3:$I$875,3,FALSE)","v":"PAULO ROBERTO BARBOSA LOPES"},{"$f":"VLOOKUP(A71,Itinerário!$A$3:$I$875,5,FALSE)","v":"JULHO"},{"$f":"IF(VLOOKUP(A71,Itinerário!$A$3:$I$875,6,FALSE)=0,\"\",VLOOKUP(A71,Itinerário!$A$3:$I$875,6,FALSE))","v":""},"00:00:00",{"$f":"IF(VLOOKUP(A71,Itinerário!$A$3:$I$875,7,FALSE)=0,\"\",VLOOKUP(A71,Itinerário!$A$3:$I$875,7,FALSE))","v":""},{"$f":"IF(VLOOKUP(A71,Itinerário!$A$3:$I$875,8,FALSE)=0,\"\",VLOOKUP(A71,Itinerário!$A$3:$I$875,8,FALSE))","v":""},{"$f":"IF(VLOOKUP(A71,Itinerário!$A$3:$I$875,9,FALSE)=0,\"\",VLOOKUP(A71,Itinerário!$A$3:$I$875,9,FALSE))","v":""}]
[69,{"$f":"VLOOKUP(A72,Itinerário!$A$3:$I$875,3,FALSE)","v":"PAULO ROBERTO BARBOSA LOPES"},{"$f":"VLOOKUP(A72,Itinerário!$A$3:$I$875,5,FALSE)","v":"JULHO"},{"$f":"IF(VLOOKUP(A72,Itinerário!$A$3:$I$875,6,FALSE)=0,\"\",VLOOKUP(A72,Itinerário!$A$3:$I$875,6,FALSE))","v":""},"00:00:00",{"$f":"IF(VLOOKUP(A72,Itinerário!$A$3:$I$875,7,FALSE)=0,\"\",VLOOKUP(A72,Itinerário!$A$3:$I$875,7,FALSE))","v":""},{"$f":"IF(VLOOKUP(A72,Itinerário!$A$3:$I$875,8,FALSE)=0,\"\",VLOOKUP(A72,Itinerário!$A$3:$I$875,8,FALSE))","v":""},{"$f":"IF(VLOOKUP(A72,Itinerário!$A$3:$I$875,9,FALSE)=0,\"\",VLOOKUP(A72,Itinerário!$A$3:$I$875,9,FALSE))","v":""}]
[70,{"$f":"VLOOKUP(A73,Itinerário!$A$3:$I$875,3,FALSE)","v":"PAULO ROBERTO BARBOSA LOPES"},{"$f":"VLOOKUP(A73,Itinerário!$A$3:$I$875,5,FALSE)","v":"JULHO"},{"$f":"IF(VLOOKUP(A73,Itinerário!$A$3:$I$875,6,FALSE)=0,\"\",VLOOKUP(A73,Itinerário!$A$3:$I$875,6,FALSE))","v":""},"00:00:00",{"$f":"IF(VLOOKUP(A73,Itinerário!$A$3:$I$875,7,FALSE)=0,\"\",VLOOKUP(A73,Itinerário!$A$3:$I$875,7,FALSE))","v":""},{"$f":"IF(VLOOKUP(A73,Itinerário!$A$3:$I$875,8,FALSE)=0,\"\",VLOOKUP(A73,Itinerário!$A$3:$I$875,8,FALSE))","v":""},{"$f":"IF(VLOOKUP(A73,Itinerário!$A$3:$I$875,9,FALSE)=0,\"\",VLOOKUP(A73,Itinerário!$A$3:$I$875,9,FALSE))","v":""}]
[71,{"$f":"VLOOKUP(A74,Itinerário!$A$3:$I$875,3,FALSE)","v":"PAULO ROBERTO BARBOSA LOPES"},{"$f":"VLOOKUP(A74,Itinerário!$A$3:$I$875,5,FALSE)","v":"AGOSTO"},{"$f":"IF(VLOOKUP(A74,Itinerário!$A$3:$I$875,6,FALSE)=0,\"\",VLOOKUP(A74,Itinerário!$A$3:$I$875,6,FALSE))","v":4},"2018-08-04",{"$f":"IF(VLOOKUP(A74,Itinerário!$A$3:$I$875,7,FALSE)=0,\"\",VLOOKUP(A74,Itinerário!$A$3:$I$875,7,FALSE))","v":"Pregação e Treinamento"},{"$f":"IF(VLOOKUP(A74,Itinerário!$A$3:$I$875,8,FALSE)=0,\"\",VLOOKUP(A74,Itinerário!$A$3:$I$875,8,FALSE))","v":"Araranguá"},{"$f":"IF(VLOOKUP(A74,Itinerário!$A$3:$I$875,9,FALSE)=0,\"\",VLOOKUP(A74,Itinerário!$A$3:$I$875,9,FALSE))","v":"Araranguá"}]
[72,{"$f":"VLOOKUP(A75,Itinerário!$A$3:$I$875,3,FALSE)","v":"PAULO ROBERTO BARBOSA LOPES"},{"$f":"VLOOKUP(A75,Itinerário!$A$3:$I$875,5,FALSE)","v":"AGOSTO"},{"$f":"IF(VLOOKUP(A75,Itinerário!$A$3:$I$875,6,FALSE)=0,\"\",VLOOKUP(A75,Itinerário!$A$3:$I$875,6,FALSE))","v":11},"2018-08-11",{"$f":"IF(VLOOKUP(A75,Itinerário!$A$3:$I$875,7,FALSE)=0,\"\",VLOOKUP(A75,Itinerário!$A$3:$I$875,7,FALSE))","v":"Pregação e Reencontro"},{"$f":"IF(VLOOKUP(A75,Itinerário!$A$3:$I$875,8,FALSE)=0,\"\",VLOOKUP(A75,Itinerário!$A$3:$I$875,8,FALSE))","v":"Universitária"},{"$f":"IF(VLOOKUP(A75,Itinerário!$A$3:$I$875,9,FALSE)=0,\"\",VLOOKUP(A75,Itinerário!$A$3:$I$875,9,FALSE))","v":"Universitario"}]
[73,{"$f":"VLOOKUP(A76,Itinerário!$A$3:$I$875,3,FALSE)","v":"PAULO ROBERTO BARBOSA LOPES"},{"$f":"VLOOKUP(A76,Itinerário!$A$3:$I$875,5,FALSE)","v":"AGOSTO"},{"$f":"IF(VLOOKUP(A76,Itinerário!$A$3:$I$875,6,FALSE)=0,\"\",VLOOKUP(A76,Itinerário!$A$3:$I$875,6,FALSE))","v":18},"2018-08-18",{"$f":"IF(VLOOKUP(A76,Itinerário!$A$3:$I$875,7,FALSE)=0,\"\",VLOOKUP(A76,Itinerário!$A$3:$I$875,7,FALSE))","v":"Pregação"},{"$f":"IF(VLOOKUP(A76,Itinerário!$A$3:$I$875,8,FALSE)=0,\"\",VLOOKUP(A76,Itinerário!$A$3:$I$875,8,FALSE))","v":"Ingleses"},{"$f":"IF(VLOOKUP(A76,Itinerário!$A$3:$I$875,9,FALSE)=0,\"\",VLOOKUP(A76,Itinerário!$A$3:$I$875,9,FALSE))","v":"Ingleses"}]
[74,{"$f":"VLOOKUP(A77,Itinerário!$A$3:$I$875,3,FALSE)","v":"PAULO ROBERTO BARBOSA LOPES"},{"$f":"VLOOKUP(A77,Itinerário!$A$3:$I$875,5,FALSE)","v":"AGOSTO"},{"$f":"IF(VLOOKUP(A77,Itinerário!$A$3:$I$875,6,FALSE)=0,\"\",VLOOKUP(A77,Itinerário!$A$3:$I$875,6,FALSE))","v":25},"2018-08-25",{"$f":"IF(VLOOKUP(A77,Itinerário!$A$3:$I$875,7,FALSE)=0,\"\",VLOOKUP(A77,Itinerário!$A$3:$I$875,7,FALSE))","v":"Pregação"},{"$f":"IF(VLOOKUP(A77,Itinerário!$A$3:$I$875,8,FALSE)=0,\"\",VLOOKUP(A77,Itinerário!$A$3:$I$875,8,FALSE))","v":"Jardim Eldorado"},{"$f":"IF(VLOOKUP(A77,Itinerário!$A$3:$I$875,9,FALSE)=0,\"\",VLOOKUP(A77,Itinerário!$A$3:$I$875,9,FALSE))","v":"Jardim Eldorado"}]
[75,{"$f":"VLOOKUP(A78,Itinerário!$A$3:$I$875,3,FALSE)","v":"PAULO ROBERTO BARBOSA LOPES"},{"$f":"VLOOKUP(A78,Itinerário!$A$3:$I$875,5,FALSE)","v":"AGOSTO"},{"$f":"IF(VLOOKUP(A78,Itinerário!$A$3:$I$875,6,FALSE)=0,\"\",VLOOKUP(A78,Itinerário!$A$3:$I$875,6,FALSE))","v":""},"00:00:00",{"$f":"IF(VLOOKUP(A78,Itinerário!$A$3:$I$875,7,FALSE)=0,\"\",VLOOKUP(A78,Itinerário!$A$3:$I$875,7,FALSE))","v":""},{"$f":"IF(VLOOKUP(A78,Itinerário!$A$3:$I$875,8,FALSE)=0,\"\",VLOOKUP(A78,Itinerário!$A$3:$I$875,8,FALSE))","v":""},{"$f":"IF(VLOOKUP(A78,Itinerário!$A$3:$I$875,9,FALSE)=0,\"\",VLOOKUP(A78,Itinerário!$A$3:$I$875,9,FALSE))","v":""}]
[76,{"$f":"VLOOKUP(A79,Itinerário!$A$3:$I$875,3,FALSE)","v":"PAULO ROBERTO BARBOSA LOPES"},{"$f":"VLOOKUP(A79,Itinerário!$A$3:$I$875,5,FALSE)","v":"AGOSTO"},{"$f":"IF(VLOOKUP(A79,Itinerário!$A$3:$I$875,6,FALSE)=0,\"\",VLOOKUP(A79,Itinerário!$A$3:$I$875,6,FALSE))","v":""},"00:00:00",{"$f":"IF(VLOOKUP(A79,Itinerário!$A$3:$I$875,7,FALSE)=0,\"\",VLOOKUP(A79,Itinerário!$A$3:$I$875,7,FALSE))","v":""},{"$f":"IF(VLOOKUP(A79,Itinerário!$A$3:$I$875,8,FALSE)=0,\"\",VLOOKUP(A79,Itinerário!$A$3:$I$875,8,FALSE))","v":""},{"$f":"IF(VLOOKUP(A79,Itinerário!$A$3:$I$875,9,FALSE)=0,\"\",VLOOKUP(A79,Itinerário!$A$3:$I$875,9,FALSE))","v":""}]
[77,{"$f":"VLOOKUP(A80,Itinerário!$A$3:$I$875,3,FALSE)","v":"PAULO ROBERTO BARBOSA LOPES"},{"$f":"VLOOKUP(A80,Itinerário!$A$3:$I$875,5,FALSE)","v":"AGOSTO"},{"$f":"IF(VLOOKUP(A80,Itinerário!$A$3:$I$875,6,FALSE)=0,\"\",VLOOKUP(A80,Itinerário!$A$3:$I$875,6,FALSE))","v":""},"00:00:00",{"$f":"IF(VLOOKUP(A80,Itinerário!$A$3:$I$875,7,FALSE)=0,\"\",VLOOKUP(A80,Itinerário!$A$3:$I$875,7,FALSE))","v":""},{"$f":"IF(VLOOKUP(A80,Itinerário!$A$3:$I$875,8,FALSE)=0,\"\",VLOOKUP(A80,Itinerário!$A$3:$I$875,8,FALSE))","v":""},{"$f":"IF(VLOOKUP(A80,Itinerário!$A$3:$I$875,9,FALSE)=0,\"\",VLOOKUP(A80,Itinerário!$A$3:$I$875,9,FALSE))","v":""}]
[78,{"$f":"VLOOKUP(A81,Itinerário!$A$3:$I$875,3,FALSE)","v":"PAULO ROBERTO BARBOSA LOPES"},{"$f":"VLOOKUP(A81,Itinerário!$A$3:$I$875,5,FALSE)","v":"AGOSTO"},{"$f":"IF(VLOOKUP(A81,Itinerário!$A$3:$I$875,6,FALSE)=0,\"\",VLOOKUP(A81,Itinerário!$A$3:$I$875,6,FALSE))","v":""},"00:00:00",{"$f":"IF(VLOOKUP(A81,Itinerário!$A$3:$I$875,7,FALSE)=0,\"\",VLOOKUP(A81,Itinerário!$A$3:$I$875,7,FALSE))","v":""},{"$f":"IF(VLOOKUP(A81,Itinerário!$A$3:$I$875,8,FALSE)=0,\"\",VLOOKUP(A81,Itinerário!$A$3:$I$875,8,FALSE))","v":""},{"$f":"IF(VLOOKUP(A81,Itinerário!$A$3:$I$875,9,FALSE)=0,\"\",VLOOKUP(A81,Itinerário!$A$3:$I$875,9,FALSE))","v":""}]
[79,{"$f":"VLOOKUP(A82,Itinerário!$A$3:$I$875,3,FALSE)","v":"PAULO ROBERTO BARBOSA LOPES"},{"$f":"VLOOKUP(A82,Itinerário!$A$3:$I$875,5,FALSE)","v":"AGOSTO"},{"$f":"IF(VLOOKUP(A82,Itinerário!$A$3:$I$875,6,FALSE)=0,\"\",VLOOKUP(A82,Itinerário!$A$3:$I$875,6,FALSE))","v":""},"00:00:00",{"$f":"IF(VLOOKUP(A82,Itinerário!$A$3:$I$875,7,FALSE)=0,\"\",VLOOKUP(A82,Itinerário!$A$3:$I$875,7,FALSE))","v":""},{"$f":"IF(VLOOKUP(A82,Itinerário!$A$3:$I$875,8,FALSE)=0,\"\",VLOOKUP(A82,Itinerário!$A$3:$I$875,8,FALSE))","v":""},{"$f":"IF(VLOOKUP(A82,Itinerário!$A$3:$I$875,9,FALSE)=0,\"\",VLOOKUP(A82,Itinerário!$A$3:$I$875,9,FALSE))","v":""}]
[80,{"$f":"VLOOKUP(A83,Itinerário!$A$3:$I$875,3,FALSE)","v":"PAULO ROBERTO BARBOSA LOPES"},{"$f":"VLOOKUP(A83,Itinerário!$A$3:$I$875,5,FALSE)","v":"AGOSTO"},{"$f":"IF(VLOOKUP(A83,Itinerário!$A$3:$I$875,6,FALSE)=0,\"\",VLOOKUP(A83,Itinerário!$A$3:$I$875,6,FALSE))","v":""},"00:00:00",{"$f":"IF(VLOOKUP(A83,Itinerário!$A$3:$I$875,7,FALSE)=0,\"\",VLOOKUP(A83,Itinerário!$A$3:$I$875,7,FALSE))","v":""},{"$f":"IF(VLOOKUP(A83,Itinerário!$A$3:$I$875,8,FALSE)=0,\"\",VLOOKUP(A83,Itinerário!$A$3:$I$875,8,FALSE))","v":""},{"$f":"IF(VLOOKUP(A83,Itinerário!$A$3:$I$875,9,FALSE)=0,\"\",VLOOKUP(A83,Itinerário!$A$3:$I$875,9,FALSE))","v":""}]
[81,{"$f":"VLOOKUP(A84,Itinerário!$A$3:$I$875,3,FALSE)","v":"PAULO ROBERTO BARBOSA LOPES"},{"$f":"VLOOKUP(A84,Itinerário!$A$3:$I$875,5,FALSE)","v":"SETEMBRO"},{"$f":"IF(VLOOKUP(A84,Itinerário!$A$3:$I$875,6,FALSE)=0,\"\",VLOOKUP(A84,Itinerário!$A$3:$I$875,6,FALSE))","v":1},"2018-09-01",{"$f":"IF(VLOOKUP(A84,Itinerário!$A$3:$I$875,7,FALSE)=0,\"\",VLOOKUP(A84,Itinerário!$A$3:$I$875,7,FALSE))","v":"Pregação"},{"$f":"IF(VLOOKUP(A84,Itinerário!$A$3:$I$875,8,FALSE)=0,\"\",VLOOKUP(A84,Itinerário!$A$3:$I$875,8,FALSE))","v":"Escalvado"},{"$f":"IF(VLOOKUP(A84,Itinerário!$A$3:$I$875,9,FALSE)=0,\"\",VLOOKUP(A84,Itinerário!$A$3:$I$875,9,FALSE))","v":"Navegantes"}]
[82,{"$f":"VLOOKUP(A85,Itinerário!$A$3:$I$875,3,FALSE)","v":"PAULO ROBERTO BARBOSA LOPES"},{"$f":"VLOOKUP(A85,Itinerário!$A$3:$I$875,5,FALSE)","v":"SETEMBRO"},{"$f":"IF(VLOOKUP(A85,Itinerário!$A$3:$I$875,6,FALSE)=0,\"\",VLOOKUP(A85,Itinerário!$A$3:$I$875,6,FALSE))","v":8},"2018-09-08",{"$f":"IF(VLOOKUP(A85,Itinerário!$A$3:$I$875,7,FALSE)=0,\"\",VLOOKUP(A85,Itinerário!$A$3:$I$875,7,FALSE))","v":"Pregação"},{"$f":"IF(VLOOKUP(A85,Itinerário!$A$3:$I$875,8,FALSE)=0,\"\",VLOOKUP(A85,Itinerário!$A$3:$I$875,8,FALSE))","v":"Florianópolis"},{"$f":"IF(VLOOKUP(A85,Itinerário!$A$3:$I$875,9,FALSE)=0,\"\",VLOOKUP(A85,Itinerário!$A$3:$I$875,9,FALSE))","v":"Florianópolis"}]
[83,{"$f":"VLOOKUP(A86,Itinerário!$A$3:$I$875,3,FALSE)","v":"PAULO ROBERTO BARBOSA LOPES"},{"$f":"VLOOKUP(A86,Itinerário!$A$3:$I$875,5,FALSE)","v":"SETEMBRO"},{"$f":"IF(VLOOKUP(A86,Itinerário!$A$3:$I$875,6,FALSE)=0,\"\",VLOOKUP(A86,Itinerário!$A$3:$I$875,6,FALSE))","v":22},"2018-09-22",{"$f":"IF(VLOOKUP(A86,Itinerário!$A$3:$I$875,7,FALSE)=0,\"\",VLOOKUP(A86,Itinerário!$A$3:$I$875,7,FALSE))","v":"Pregação"},{"$f":"IF(VLOOKUP(A86,Itinerário!$A$3:$I$875,8,FALSE)=0,\"\",VLOOKUP(A86,Itinerário!$A$3:$I$875,8,FALSE))","v":"Bom Jardim da Serra"},{"$f":"IF(VLOOKUP(A86,Itinerário!$A$3:$I$875,9,FALSE)=0,\"\",VLOOKUP(A86,Itinerário!$A$3:$I$875,9,FALSE))","v":"São Joaquim"}]
[84,{"$f":"VLOOKUP(A87,Itinerário!$A$3:$I$875,3,FALSE)","v":"PAULO ROBERTO BARBOSA LOPES"},{"$f":"VLOOKUP(A87,Itinerário!$A$3:$I$875,5,FALSE)","v":"SETEMBRO"},{"$f":"IF(VLOOKUP(A87,Itinerário!$A$3:$I$875,6,FALSE)=0,\"\",VLOOKUP(A87,Itinerário!$A$3:$I$875,6,FALSE))","v":29},"2018-09-29",{"$f":"IF(VLOOKUP(A87,Itinerário!$A$3:$I$875,7,FALSE)=0,\"\",VLOOKUP(A87,Itinerário!$A$3:$I$875,7,FALSE))","v":"Encontro de Novos Membros"},{"$f":"IF(VLOOKUP(A87,Itinerário!$A$3:$I$875,8,FALSE)=0,\"\",VLOOKUP(A87,Itinerário!$A$3:$I$875,8,FALSE))","v":""},{"$f":"IF(VLOOKUP(A87,Itinerário!$A$3:$I$875,9,FALSE)=0,\"\",VLOOKUP(A87,Itinerário!$A$3:$I$875,9,FALSE))","v":""}]
[85,{"$f":"VLOOKUP(A88,Itinerário!$A$3:$I$875,3,FALSE)","v":"PAULO ROBERTO BARBOSA LOPES"},{"$f":"VLOOKUP(A88,Itinerário!$A$3:$I$875,5,FALSE)","v":"SETEMBRO"},{"$f":"IF(VLOOKUP(A88,Itinerário!$A$3:$I$875,6,FALSE)=0,\"\",VLOOKUP(A88,Itinerário!$A$3:$I$875,6,FALSE))","v":""},"00:00:00",{"$f":"IF(VLOOKUP(A88,Itinerário!$A$3:$I$875,7,FALSE)=0,\"\",VLOOKUP(A88,Itinerário!$A$3:$I$875,7,FALSE))","v":""},{"$f":"IF(VLOOKUP(A88,Itinerário!$A$3:$I$875,8,FALSE)=0,\"\",VLOOKUP(A88,Itinerário!$A$3:$I$875,8,FALSE))","v":""},{"$f":"IF(VLOOKUP(A88,Itinerário!$A$3:$I$875,9,FALSE)=0,\"\",VLOOKUP(A88,Itinerário!$A$3:$I$875,9,FALSE))","v":""}]
[86,{"$f":"VLOOKUP(A89,Itinerário!$A$3:$I$875,3,FALSE)","v":"PAULO ROBERTO BARBOSA LOPES"},{"$f":"VLOOKUP(A89,Itinerário!$A$3:$I$875,5,FALSE)","v":"SETEMBRO"},{"$f":"IF(VLOOKUP(A89,Itinerário!$A$3:$I$875,6,FALSE)=0,\"\",VLOOKUP(A89,Itinerário!$A$3:$I$875,6,FALSE))","v":""},"00:00:00",{"$f":"IF(VLOOKUP(A89,Itinerário!$A$3:$I$875,7,FALSE)=0,\"\",VLOOKUP(A89,Itinerário!$A$3:$I$875,7,FALSE))","v":""},{"$f":"IF(VLOOKUP(A89,Itinerário!$A$3:$I$875,8,FALSE)=0,\"\",VLOOKUP(A89,Itinerário!$A$3:$I$875,8,FALSE))","v":""},{"$f":"IF(VLOOKUP(A89,Itinerário!$A$3:$I$875,9,FALSE)=0,\"\",VLOOKUP(A89,Itinerário!$A$3:$I$875,9,FALSE))","v":""}]
[87,{"$f":"VLOOKUP(A90,Itinerário!$A$3:$I$875,3,FALSE)","v":"PAULO ROBERTO BARBOSA LOPES"},{"$f":"VLOOKUP(A90,Itinerário!$A$3:$I$875,5,FALSE)","v":"SETEMBRO"},{"$f":"IF(VLOOKUP(A90,Itinerário!$A$3:$I$875,6,FALSE)=0,\"\",VLOOKUP(A90,Itinerário!$A$3:$I$875,6,FALSE))","v":""},"00:00:00",{"$f":"IF(VLOOKUP(A90,Itinerário!$A$3:$I$875,7,FALSE)=0,\"\",VLOOKUP(A90,Itinerário!$A$3:$I$875,7,FALSE))","v":""},{"$f":"IF(VLOOKUP(A90,Itinerário!$A$3:$I$875,8,FALSE)=0,\"\",VLOOKUP(A90,Itinerário!$A$3:$I$875,8,FALSE))","v":""},{"$f":"IF(VLOOKUP(A90,Itinerário!$A$3:$I$875,9,FALSE)=0,\"\",VLOOKUP(A90,Itinerário!$A$3:$I$875,9,FALSE))","v":""}]
[88,{"$f":"VLOOKUP(A91,Itinerário!$A$3:$I$875,3,FALSE)","v":"PAULO ROBERTO BARBOSA LOPES"},{"$f":"VLOOKUP(A91,Itinerário!$A$3:$I$875,5,FALSE)","v":"SETEMBRO"},{"$f":"IF(VLOOKUP(A91,Itinerário!$A$3:$I$875,6,FALSE)=0,\"\",VLOOKUP(A91,Itinerário!$A$3:$I$875,6,FALSE))","v":""},"00:00:00",{"$f":"IF(VLOOKUP(A91,Itinerário!$A$3:$I$875,7,FALSE)=0,\"\",VLOOKUP(A91,Itinerário!$A$3:$I$875,7,FALSE))","v":""},{"$f":"IF(VLOOKUP(A91,Itinerário!$A$3:$I$875,8,FALSE)=0,\"\",VLOOKUP(A91,Itinerário!$A$3:$I$875,8,FALSE))","v":""},{"$f":"IF(VLOOKUP(A91,Itinerário!$A$3:$I$875,9,FALSE)=0,\"\",VLOOKUP(A91,Itinerário!$A$3:$I$875,9,FALSE))","v":""}]
[89,{"$f":"VLOOKUP(A92,Itinerário!$A$3:$I$875,3,FALSE)","v":"PAULO ROBERTO BARBOSA LOPES"},{"$f":"VLOOKUP(A92,Itinerário!$A$3:$I$875,5,FALSE)","v":"SETEMBRO"},{"$f":"IF(VLOOKUP(A92,Itinerário!$A$3:$I$875,6,FALSE)=0,\"\",VLOOKUP(A92,Itinerário!$A$3:$I$875,6,FALSE))","v":""},"00:00:00",{"$f":"IF(VLOOKUP(A92,Itinerário!$A$3:$I$875,7,FALSE)=0,\"\",VLOOKUP(A92,Itinerário!$A$3:$I$875,7,FALSE))","v":""},{"$f":"IF(VLOOKUP(A92,Itinerário!$A$3:$I$875,8,FALSE)=0,\"\",VLOOKUP(A92,Itinerário!$A$3:$I$875,8,FALSE))","v":""},{"$f":"IF(VLOOKUP(A92,Itinerário!$A$3:$I$875,9,FALSE)=0,\"\",VLOOKUP(A92,Itinerário!$A$3:$I$875,9,FALSE))","v":""}]
[90,{"$f":"VLOOKUP(A93,Itinerário!$A$3:$I$875,3,FALSE)","v":"PAULO ROBERTO BARBOSA LOPES"},{"$f":"VLOOKUP(A93,Itinerário!$A$3:$I$875,5,FALSE)","v":"SETEMBRO"},{"$f":"IF(VLOOKUP(A93,Itinerário!$A$3:$I$875,6,FALSE)=0,\"\",VLOOKUP(A93,Itinerário!$A$3:$I$875,6,FALSE))","v":""},"00:00:00",{"$f":"IF(VLOOKUP(A93,Itinerário!$A$3:$I$875,7,FALSE)=0,\"\",VLOOKUP(A93,Itinerário!$A$3:$I$875,7,FALSE))","v":""},{"$f":"IF(VLOOKUP(A93,Itinerário!$A$3:$I$875,8,FALSE)=0,\"\",VLOOKUP(A93,Itinerário!$A$3:$I$875,8,FALSE))","v":""},{"$f":"IF(VLOOKUP(A93,Itinerário!$A$3:$I$875,9,FALSE)=0,\"\",VLOOKUP(A93,Itinerário!$A$3:$I$875,9,FALSE))","v":""}]
[91,{"$f":"VLOOKUP(A94,Itinerário!$A$3:$I$875,3,FALSE)","v":"PAULO ROBERTO BARBOSA LOPES"},{"$f":"VLOOKUP(A94,Itinerário!$A$3:$I$875,5,FALSE)","v":"OUTUBRO"},{"$f":"IF(VLOOKUP(A94,Itinerário!$A$3:$I$875,6,FALSE)=0,\"\",VLOOKUP(A94,Itinerário!$A$3:$I$875,6,FALSE))","v":13},"2018-10-13",{"$f":"IF(VLOOKUP(A94,Itinerário!$A$3:$I$875,7,FALSE)=0,\"\",VLOOKUP(A94,Itinerário!$A$3:$I$875,7,FALSE))","v":"Encontro de Novos Membros"},{"$f":"IF(VLOOKUP(A94,Itinerário!$A$3:$I$875,8,FALSE)=0,\"\",VLOOKUP(A94,Itinerário!$A$3:$I$875,8,FALSE))","v":""},{"$f":"IF(VLOOKUP(A94,Itinerário!$A$3:$I$875,9,FALSE)=0,\"\",VLOOKUP(A94,Itinerário!$A$3:$I$875,9,FALSE))","v":""}]
[92,{"$f":"VLOOKUP(A95,Itinerário!$A$3:$I$875,3,FALSE)","v":"PAULO ROBERTO BARBOSA LOPES"},{"$f":"VLOOKUP(A95,Itinerário!$A$3:$I$875,5,FALSE)","v":"OUTUBRO"},{"$f":"IF(VLOOKUP(A95,Itinerário!$A$3:$I$875,6,FALSE)=0,\"\",VLOOKUP(A95,Itinerário!$A$3:$I$875,6,FALSE))","v":20},"2018-10-20",{"$f":"IF(VLOOKUP(A95,Itinerário!$A$3:$I$875,7,FALSE)=0,\"\",VLOOKUP(A95,Itinerário!$A$3:$I$875,7,FALSE))","v":"Pregação"},{"$f":"IF(VLOOKUP(A95,Itinerário!$A$3:$I$875,8,FALSE)=0,\"\",VLOOKUP(A95,Itinerário!$A$3:$I$875,8,FALSE))","v":"Santo Amaro da Imperatriz"},{"$f":"IF(VLOOKUP(A95,Itinerário!$A$3:$I$875,9,FALSE)=0,\"\",VLOOKUP(A95,Itinerário!$A$3:$I$875,9,FALSE))","v":"Caminho Novo"}]
[93,{"$f":"VLOOKUP(A96,Itinerário!$A$3:$I$875,3,FALSE)","v":"PAULO ROBERTO BARBOSA LOPES"},{"$f":"VLOOKUP(A96,Itinerário!$A$3:$I$875,5,FALSE)","v":"OUTUBRO"},{"$f":"IF(VLOOKUP(A96,Itinerário!$A$3:$I$875,6,FALSE)=0,\"\",VLOOKUP(A96,Itinerário!$A$3:$I$875,6,FALSE))","v":27},"2018-10-27",{"$f":"IF(VLOOKUP(A96,Itinerário!$A$3:$I$875,7,FALSE)=0,\"\",VLOOKUP(A96,Itinerário!$A$3:$I$875,7,FALSE))","v":"Pregação"},{"$f":"IF(VLOOKUP(A96,Itinerário!$A$3:$I$875,8,FALSE)=0,\"\",VLOOKUP(A96,Itinerário!$A$3:$I$875,8,FALSE))","v":"Itajaí"},{"$f":"IF(VLOOKUP(A96,Itinerário!$A$3:$I$875,9,FALSE)=0,\"\",VLOOKUP(A96,Itinerário!$A$3:$I$875,9,FALSE))","v":"Itajaí"}]
[94,{"$f":"VLOOKUP(A97,Itinerário!$A$3:$I$875,3,FALSE)","v":"PAULO ROBERTO BARBOSA LOPES"},{"$f":"VLOOKUP(A97,Itinerário!$A$3:$I$875,5,FALSE)","v":"OUTUBRO"},{"$f":"IF(VLOOKUP(A97,Itinerário!$A$3:$I$875,6,FALSE)=0,\"\",VLOOKUP(A97,Itinerário!$A$3:$I$875,6,FALSE))","v":""},"00:00:00",{"$f":"IF(VLOOKUP(A97,Itinerário!$A$3:$I$875,7,FALSE)=0,\"\",VLOOKUP(A97,Itinerário!$A$3:$I$875,7,FALSE))","v":""},{"$f":"IF(VLOOKUP(A97,Itinerário!$A$3:$I$875,8,FALSE)=0,\"\",VLOOKUP(A97,Itinerário!$A$3:$I$875,8,FALSE))","v":""},{"$f":"IF(VLOOKUP(A97,Itinerário!$A$3:$I$875,9,FALSE)=0,\"\",VLOOKUP(A97,Itinerário!$A$3:$I$875,9,FALSE))","v":""}]
[95,{"$f":"VLOOKUP(A98,Itinerário!$A$3:$I$875,3,FALSE)","v":"PAULO ROBERTO BARBOSA LOPES"},{"$f":"VLOOKUP(A98,Itinerário!$A$3:$I$875,5,FALSE)","v":"OUTUBRO"},{"$f":"IF(VLOOKUP(A98,Itinerário!$A$3:$I$875,6,FALSE)=0,\"\",VLOOKUP(A98,Itinerário!$A$3:$I$875,6,FALSE))","v":""},"00:00:00",{"$f":"IF(VLOOKUP(A98,Itinerário!$A$3:$I$875,7,FALSE)=0,\"\",VLOOKUP(A98,Itinerário!$A$3:$I$875,7,FALSE))","v":""},{"$f":"IF(VLOOKUP(A98,Itinerário!$A$3:$I$875,8,FALSE)=0,\"\",VLOOKUP(A98,Itinerário!$A$3:$I$875,8,FALSE))","v":""},{"$f":"IF(VLOOKUP(A98,Itinerário!$A$3:$I$875,9,FALSE)=0,\"\",VLOOKUP(A98,Itinerário!$A$3:$I$875,9,FALSE))","v":""}]
[96,{"$f":"VLOOKUP(A99,Itinerário!$A$3:$I$875,3,FALSE)","v":"PAULO ROBERTO BARBOSA LOPES"},{"$f":"VLOOKUP(A99,Itinerário!$A$3:$I$875,5,FALSE)","v":"OUTUBRO"},{"$f":"IF(VLOOKUP(A99,Itinerário!$A$3:$I$875,6,FALSE)=0,\"\",VLOOKUP(A99,Itinerário!$A$3:$I$875,6,FALSE))","v":""},"00:00:00",{"$f":"IF(VLOOKUP(A99,Itinerário!$A$3:$I$875,7,FALSE)=0,\"\",VLOOKUP(A99,Itinerário!$A$3:$I$875,7,FALSE))","v":""},{"$f":"IF(VLOOKUP(A99,Itinerário!$A$3:$I$875,8,FALSE)=0,\"\",VLOOKUP(A99,Itinerário!$A$3:$I$875,8,FALSE))","v":""},{"$f":"IF(VLOOKUP(A99,Itinerário!$A$3:$I$875,9,FALSE)=0,\"\",VLOOKUP(A99,Itinerário!$A$3:$I$875,9,FALSE))","v":""}]
[97,{"$f":"VLOOKUP(A100,Itinerário!$A$3:$I$875,3,FALSE)","v":"PAULO ROBERTO BARBOSA LOPES"},{"$f":"VLOOKUP(A100,Itinerário!$A$3:$I$875,5,FALSE)","v":"OUTUBRO"},{"$f":"IF(VLOOKUP(A100,Itinerário!$A$3:$I$875,6,FALSE)=0,\"\",VLOOKUP(A100,Itinerário!$A$3:$I$875,6,FALSE))","v":""},"00:00:00",{"$f":"IF(VLOOKUP(A100,Itinerário!$A$3:$I$875,7,FALSE)=0,\"\",VLOOKUP(A100,Itinerário!$A$3:$I$875,7,FALSE))","v":""},{"$f":"IF(VLOOKUP(A100,Itinerário!$A$3:$I$875,8,FALSE)=0,\"\",VLOOKUP(A100,Itinerário!$A$3:$I$875,8,FALSE))","v":""},{"$f":"IF(VLOOKUP(A100,Itinerário!$A$3:$I$875,9,FALSE)=0,\"\",VLOOKUP(A100,Itinerário!$A$3:$I$875,9,FALSE))","v":""}]
[98,{"$f":"VLOOKUP(A101,Itinerário!$A$3:$I$875,3,FALSE)","v":"PAULO ROBERTO BARBOSA LOPES"},{"$f":"VLOOKUP(A101,Itinerário!$A$3:$I$875,5,FALSE)","v":"OUTUBRO"},{"$f":"IF(VLOOKUP(A101,Itinerário!$A$3:$I$875,6,FALSE)=0,\"\",VLOOKUP(A101,Itinerário!$A$3:$I$875,6,FALSE))","v":""},"00:00:00",{"$f":"IF(VLOOKUP(A101,Itinerário!$A$3:$I$875,7,FALSE)=0,\"\",VLOOKUP(A101,Itinerário!$A$3:$I$875,7,FALSE))","v":""},{"$f":"IF(VLOOKUP(A101,Itinerário!$A$3:$I$875,8,FALSE)=0,\"\",VLOOKUP(A101,Itinerário!$A$3:$I$875,8,FALSE))","v":""},{"$f":"IF(VLOOKUP(A101,Itinerário!$A$3:$I$875,9,FALSE)=0,\"\",VLOOKUP(A101,Itinerário!$A$3:$I$875,9,FALSE))","v":""}]
[99,{"$f":"VLOOKUP(A102,Itinerário!$A$3:$I$875,3,FALSE)","v":"PAULO ROBERTO BARBOSA LOPES"},{"$f":"VLOOKUP(A102,Itinerário!$A$3:$I$875,5,FALSE)","v":"OUTUBRO"},{"$f":"IF(VLOOKUP(A102,Itinerário!$A$3:$I$875,6,FALSE)=0,\"\",VLOOKUP(A102,Itinerário!$A$3:$I$875,6,FALSE))","v":""},"00:00:00",{"$f":"IF(VLOOKUP(A102,Itinerário!$A$3:$I$875,7,FALSE)=0,\"\",VLOOKUP(A102,Itinerário!$A$3:$I$875,7,FALSE))","v":""},{"$f":"IF(VLOOKUP(A102,Itinerário!$A$3:$I$875,8,FALSE)=0,\"\",VLOOKUP(A102,Itinerário!$A$3:$I$875,8,FALSE))","v":""},{"$f":"IF(VLOOKUP(A102,Itinerário!$A$3:$I$875,9,FALSE)=0,\"\",VLOOKUP(A102,Itinerário!$A$3:$I$875,9,FALSE))","v":""}]
[100,{"$f":"VLOOKUP(A103,Itinerário!$A$3:$I$875,3,FALSE)","v":"PAULO ROBERTO BARBOSA LOPES"},{"$f":"VLOOKUP(A103,Itinerário!$A$3:$I$875,5,FALSE)","v":"OUTUBRO"},{"$f":"IF(VLOOKUP(A103,Itinerário!$A$3:$I$875,6,FALSE)=0,\"\",VLOOKUP(A103,Itinerário!$A$3:$I$875,6,FALSE))","v":""},"00:00:00",{"$f":"IF(VLOOKUP(A103,Itinerário!$A$3:$I$875,7,FALSE)=0,\"\",VLOOKUP(A103,Itinerário!$A$3:$I$875,7,FALSE))","v":""},{"$f":"IF(VLOOKUP(A103,Itinerário!$A$3:$I$875,8,FALSE)=0,\"\",VLOOKUP(A103,Itinerário!$A$3:$I$875,8,FALSE))","v":""},{"$f":"IF(VLOOKUP(A103,Itinerário!$A$3:$I$875,9,FALSE)=0,\"\",VLOOKUP(A103,Itinerário!$A$3:$I$875,9,FALSE))","v":""}]
[101,{"$f":"VLOOKUP(A104,Itinerário!$A$3:$I$875,3,FALSE)","v":"PAULO ROBERTO BARBOSA LOPES"},{"$f":"VLOOKUP(A104,Itinerário!$A$3:$I$875,5,FALSE)","v":"NOVEMBRO"},{"$f":"IF(VLOOKUP(A104,Itinerário!$A$3:$I$875,6,FALSE)=0,\"\",VLOOKUP(A104,Itinerário!$A$3:$I$875,6,FALSE))","v":3},"2018-11-03",{"$f":"IF(VLOOKUP(A104,Itinerário!$A$3:$I$875,7,FALSE)=0,\"\",VLOOKUP(A104,Itinerário!$A$3:$I$875,7,FALSE))","v":"Encontro de Novos Membros"},{"$f":"IF(VLOOKUP(A104,Itinerário!$A$3:$I$875,8,FALSE)=0,\"\",VLOOKUP(A104,Itinerário!$A$3:$I$875,8,FALSE))","v":""},{"$f":"IF(VLOOKUP(A104,Itinerário!$A$3:$I$875,9,FALSE)=0,\"\",VLOOKUP(A104,Itinerário!$A$3:$I$875,9,FALSE))","v":""}]
[102,{"$f":"VLOOKUP(A105,Itinerário!$A$3:$I$875,3,FALSE)","v":"PAULO ROBERTO BARBOSA LOPES"},{"$f":"VLOOKUP(A105,Itinerário!$A$3:$I$875,5,FALSE)","v":"NOVEMBRO"},{"$f":"IF(VLOOKUP(A105,Itinerário!$A$3:$I$875,6,FALSE)=0,\"\",VLOOKUP(A105,Itinerário!$A$3:$I$875,6,FALSE))","v":10},"2018-11-10",{"$f":"IF(VLOOKUP(A105,Itinerário!$A$3:$I$875,7,FALSE)=0,\"\",VLOOKUP(A105,Itinerário!$A$3:$I$875,7,FALSE))","v":"Impacto Evangelístico Criciúma"},{"$f":"IF(VLOOKUP(A105,Itinerário!$A$3:$I$875,8,FALSE)=0,\"\",VLOOKUP(A105,Itinerário!$A$3:$I$875,8,FALSE))","v":"AC"},{"$f":"IF(VLOOKUP(A105,Itinerário!$A$3:$I$875,9,FALSE)=0,\"\",VLOOKUP(A105,Itinerário!$A$3:$I$875,9,FALSE))","v":"AC"}]
[103,{"$f":"VLOOKUP(A106,Itinerário!$A$3:$I$875,3,FALSE)","v":"PAULO ROBERTO BARBOSA LOPES"},{"$f":"VLOOKUP(A106,Itinerário!$A$3:$I$875,5,FALSE)","v":"NOVEMBRO"},{"$f":"IF(VLOOKUP(A106,Itinerário!$A$3:$I$875,6,FALSE)=0,\"\",VLOOKUP(A106,Itinerário!$A$3:$I$875,6,FALSE))","v":24},"2018-11-24",{"$f":"IF(VLOOKUP(A106,Itinerário!$A$3:$I$875,7,FALSE)=0,\"\",VLOOKUP(A106,Itinerário!$A$3:$I$875,7,FALSE))","v":"Pregação e Treinamento"},{"$f":"IF(VLOOKUP(A106,Itinerário!$A$3:$I$875,8,FALSE)=0,\"\",VLOOKUP(A106,Itinerário!$A$3:$I$875,8,FALSE))","v":"Lageado Baixo"},{"$f":"IF(VLOOKUP(A106,Itinerário!$A$3:$I$875,9,FALSE)=0,\"\",VLOOKUP(A106,Itinerário!$A$3:$I$875,9,FALSE))","v":"Lageado Baixo"}]
[104,{"$f":"VLOOKUP(A107,Itinerário!$A$3:$I$875,3,FALSE)","v":"PAULO ROBERTO BARBOSA LOPES"},{"$f":"VLOOKUP(A107,Itinerário!$A$3:$I$875,5,FALSE)","v":"NOVEMBRO"},{"$f":"IF(VLOOKUP(A107,Itinerário!$A$3:$I$875,6,FALSE)=0,\"\",VLOOKUP(A107,Itinerário!$A$3:$I$875,6,FALSE))","v":17},"2018-11-17",{"$f":"IF(VLOOKUP(A107,Itinerário!$A$3:$I$875,7,FALSE)=0,\"\",VLOOKUP(A107,Itinerário!$A$3:$I$875,7,FALSE))","v":"Campori de Jovens USB"},{"$f":"IF(VLOOKUP(A107,Itinerário!$A$3:$I$875,8,FALSE)=0,\"\",VLOOKUP(A107,Itinerário!$A$3:$I$875,8,FALSE))","v":"USB"},{"$f":"IF(VLOOKUP(A107,Itinerário!$A$3:$I$875,9,FALSE)=0,\"\",VLOOKUP(A107,Itinerário!$A$3:$I$875,9,FALSE))","v":"USB"}]
[105,{"$f":"VLOOKUP(A108,Itinerário!$A$3:$I$875,3,FALSE)","v":"PAULO ROBERTO BARBOSA LOPES"},{"$f":"VLOOKUP(A108,Itinerário!$A$3:$I$875,5,FALSE)","v":"NOVEMBRO"},{"$f":"IF(VLOOKUP(A108,Itinerário!$A$3:$I$875,6,FALSE)=0,\"\",VLOOKUP(A108,Itinerário!$A$3:$I$875,6,FALSE))","v":24},"2018-11-24",{"$f":"IF(VLOOKUP(A108,Itinerário!$A$3:$I$875,7,FALSE)=0,\"\",VLOOKUP(A108,Itinerário!$A$3:$I$875,7,FALSE))","v":"Aventuri"},{"$f":"IF(VLOOKUP(A108,Itinerário!$A$3:$I$875,8,FALSE)=0,\"\",VLOOKUP(A108,Itinerário!$A$3:$I$875,8,FALSE))","v":"AC"},{"$f":"IF(VLOOKUP(A108,Itinerário!$A$3:$I$875,9,FALSE)=0,\"\",VLOOKUP(A108,Itinerário!$A$3:$I$875,9,FALSE))","v":"AC"}]
[106,{"$f":"VLOOKUP(A109,Itinerário!$A$3:$I$875,3,FALSE)","v":"PAULO ROBERTO BARBOSA LOPES"},{"$f":"VLOOKUP(A109,Itinerário!$A$3:$I$875,5,FALSE)","v":"NOVEMBRO"},{"$f":"IF(VLOOKUP(A109,Itinerário!$A$3:$I$875,6,FALSE)=0,\"\",VLOOKUP(A109,Itinerário!$A$3:$I$875,6,FALSE))","v":""},"00:00:00",{"$f":"IF(VLOOKUP(A109,Itinerário!$A$3:$I$875,7,FALSE)=0,\"\",VLOOKUP(A109,Itinerário!$A$3:$I$875,7,FALSE))","v":""},{"$f":"IF(VLOOKUP(A109,Itinerário!$A$3:$I$875,8,FALSE)=0,\"\",VLOOKUP(A109,Itinerário!$A$3:$I$875,8,FALSE))","v":""},{"$f":"IF(VLOOKUP(A109,Itinerário!$A$3:$I$875,9,FALSE)=0,\"\",VLOOKUP(A109,Itinerário!$A$3:$I$875,9,FALSE))","v":""}]
[107,{"$f":"VLOOKUP(A110,Itinerário!$A$3:$I$875,3,FALSE)","v":"PAULO ROBERTO BARBOSA LOPES"},{"$f":"VLOOKUP(A110,Itinerário!$A$3:$I$875,5,FALSE)","v":"NOVEMBRO"},{"$f":"IF(VLOOKUP(A110,Itinerário!$A$3:$I$875,6,FALSE)=0,\"\",VLOOKUP(A110,Itinerário!$A$3:$I$875,6,FALSE))","v":""},"00:00:00",{"$f":"IF(VLOOKUP(A110,Itinerário!$A$3:$I$875,7,FALSE)=0,\"\",VLOOKUP(A110,Itinerário!$A$3:$I$875,7,FALSE))","v":""},{"$f":"IF(VLOOKUP(A110,Itinerário!$A$3:$I$875,8,FALSE)=0,\"\",VLOOKUP(A110,Itinerário!$A$3:$I$875,8,FALSE))","v":""},{"$f":"IF(VLOOKUP(A110,Itinerário!$A$3:$I$875,9,FALSE)=0,\"\",VLOOKUP(A110,Itinerário!$A$3:$I$875,9,FALSE))","v":""}]
[108,{"$f":"VLOOKUP(A111,Itinerário!$A$3:$I$875,3,FALSE)","v":"PAULO ROBERTO BARBOSA LOPES"},{"$f":"VLOOKUP(A111,Itinerário!$A$3:$I$875,5,FALSE)","v":"NOVEMBRO"},{"$f":"IF(VLOOKUP(A111,Itinerário!$A$3:$I$875,6,FALSE)=0,\"\",VLOOKUP(A111,Itinerário!$A$3:$I$875,6,FALSE))","v":""},"00:00:00",{"$f":"IF(VLOOKUP(A111,Itinerário!$A$3:$I$875,7,FALSE)=0,\"\",VLOOKUP(A111,Itinerário!$A$3:$I$875,7,FALSE))","v":""},{"$f":"IF(VLOOKUP(A111,Itinerário!$A$3:$I$875,8,FALSE)=0,\"\",VLOOKUP(A111,Itinerário!$A$3:$I$875,8,FALSE))","v":""},{"$f":"IF(VLOOKUP(A111,Itinerário!$A$3:$I$875,9,FALSE)=0,\"\",VLOOKUP(A111,Itinerário!$A$3:$I$875,9,FALSE))","v":""}]
[109,{"$f":"VLOOKUP(A112,Itinerário!$A$3:$I$875,3,FALSE)","v":"PAULO ROBERTO BARBOSA LOPES"},{"$f":"VLOOKUP(A112,Itinerário!$A$3:$I$875,5,FALSE)","v":"NOVEMBRO"},{"$f":"IF(VLOOKUP(A112,Itinerário!$A$3:$I$875,6,FALSE)=0,\"\",VLOOKUP(A112,Itinerário!$A$3:$I$875,6,FALSE))","v":""},"00:00:00",{"$f":"IF(VLOOKUP(A112,Itinerário!$A$3:$I$875,7,FALSE)=0,\"\",VLOOKUP(A112,Itinerário!$A$3:$I$875,7,FALSE))","v":""},{"$f":"IF(VLOOKUP(A112,Itinerário!$A$3:$I$875,8,FALSE)=0,\"\",VLOOKUP(A112,Itinerário!$A$3:$I$875,8,FALSE))","v":""},{"$f":"IF(VLOOKUP(A112,Itinerário!$A$3:$I$875,9,FALSE)=0,\"\",VLOOKUP(A112,Itinerário!$A$3:$I$875,9,FALSE))","v":""}]
[110,{"$f":"VLOOKUP(A113,Itinerário!$A$3:$I$875,3,FALSE)","v":"PAULO ROBERTO BARBOSA LOPES"},{"$f":"VLOOKUP(A113,Itinerário!$A$3:$I$875,5,FALSE)","v":"NOVEMBRO"},{"$f":"IF(VLOOKUP(A113,Itinerário!$A$3:$I$875,6,FALSE)=0,\"\",VLOOKUP(A113,Itinerário!$A$3:$I$875,6,FALSE))","v":""},"00:00:00",{"$f":"IF(VLOOKUP(A113,Itinerário!$A$3:$I$875,7,FALSE)=0,\"\",VLOOKUP(A113,Itinerário!$A$3:$I$875,7,FALSE))","v":""},{"$f":"IF(VLOOKUP(A113,Itinerário!$A$3:$I$875,8,FALSE)=0,\"\",VLOOKUP(A113,Itinerário!$A$3:$I$875,8,FALSE))","v":""},{"$f":"IF(VLOOKUP(A113,Itinerário!$A$3:$I$875,9,FALSE)=0,\"\",VLOOKUP(A113,Itinerário!$A$3:$I$875,9,FALSE))","v":""}]
[111,{"$f":"VLOOKUP(A114,Itinerário!$A$3:$I$875,3,FALSE)","v":"PAULO ROBERTO BARBOSA LOPES"},{"$f":"VLOOKUP(A114,Itinerário!$A$3:$I$875,5,FALSE)","v":"DEZEMBRO"},{"$f":"IF(VLOOKUP(A114,Itinerário!$A$3:$I$875,6,FALSE)=0,\"\",VLOOKUP(A114,Itinerário!$A$3:$I$875,6,FALSE))","v":1},"2018-12-01",{"$f":"IF(VLOOKUP(A114,Itinerário!$A$3:$I$875,7,FALSE)=0,\"\",VLOOKUP(A114,Itinerário!$A$3:$I$875,7,FALSE))","v":"Encontro de Novos Membros"},{"$f":"IF(VLOOKUP(A114,Itinerário!$A$3:$I$875,8,FALSE)=0,\"\",VLOOKUP(A114,Itinerário!$A$3:$I$875,8,FALSE))","v":""},{"$f":"IF(VLOOKUP(A114,Itinerário!$A$3:$I$875,9,FALSE)=0,\"\",VLOOKUP(A114,Itinerário!$A$3:$I$875,9,FALSE))","v":""}]
[112,{"$f":"VLOOKUP(A115,Itinerário!$A$3:$I$875,3,FALSE)","v":"PAULO ROBERTO BARBOSA LOPES"},{"$f":"VLOOKUP(A115,Itinerário!$A$3:$I$875,5,FALSE)","v":"DEZEMBRO"},{"$f":"IF(VLOOKUP(A115,Itinerário!$A$3:$I$875,6,FALSE)=0,\"\",VLOOKUP(A115,Itinerário!$A$3:$I$875,6,FALSE))","v":8},"2018-12-08",{"$f":"IF(VLOOKUP(A115,Itinerário!$A$3:$I$875,7,FALSE)=0,\"\",VLOOKUP(A115,Itinerário!$A$3:$I$875,7,FALSE))","v":"Pregação"},{"$f":"IF(VLOOKUP(A115,Itinerário!$A$3:$I$875,8,FALSE)=0,\"\",VLOOKUP(A115,Itinerário!$A$3:$I$875,8,FALSE))","v":"Canasvieiras"},{"$f":"IF(VLOOKUP(A115,Itinerário!$A$3:$I$875,9,FALSE)=0,\"\",VLOOKUP(A115,Itinerário!$A$3:$I$875,9,FALSE))","v":"Ingleses"}]
[113,{"$f":"VLOOKUP(A116,Itinerário!$A$3:$I$875,3,FALSE)","v":"PAULO ROBERTO BARBOSA LOPES"},{"$f":"VLOOKUP(A116,Itinerário!$A$3:$I$875,5,FALSE)","v":"DEZEMBRO"},{"$f":"IF(VLOOKUP(A116,Itinerário!$A$3:$I$875,6,FALSE)=0,\"\",VLOOKUP(A116,Itinerário!$A$3:$I$875,6,FALSE))","v":15},"2018-12-15",{"$f":"IF(VLOOKUP(A116,Itinerário!$A$3:$I$875,7,FALSE)=0,\"\",VLOOKUP(A116,Itinerário!$A$3:$I$875,7,FALSE))","v":"Encontro de Novos Membros"},{"$f":"IF(VLOOKUP(A116,Itinerário!$A$3:$I$875,8,FALSE)=0,\"\",VLOOKUP(A116,Itinerário!$A$3:$I$875,8,FALSE))","v":""},{"$f":"IF(VLOOKUP(A116,Itinerário!$A$3:$I$875,9,FALSE)=0,\"\",VLOOKUP(A116,Itinerário!$A$3:$I$875,9,FALSE))","v":""}]
[114,{"$f":"VLOOKUP(A117,Itinerário!$A$3:$I$875,3,FALSE)","v":"PAULO ROBERTO BARBOSA LOPES"},{"$f":"VLOOKUP(A117,Itinerário!$A$3:$I$875,5,FALSE)","v":"DEZEMBRO"},{"$f":"IF(VLOOKUP(A117,Itinerário!$A$3:$I$875,6,FALSE)=0,\"\",VLOOKUP(A117,Itinerário!$A$3:$I$875,6,FALSE))","v":""},"00:00:00",{"$f":"IF(VLOOKUP(A117,Itinerário!$A$3:$I$875,7,FALSE)=0,\"\",VLOOKUP(A117,Itinerário!$A$3:$I$875,7,FALSE))","v":""},{"$f":"IF(VLOOKUP(A117,Itinerário!$A$3:$I$875,8,FALSE)=0,\"\",VLOOKUP(A117,Itinerário!$A$3:$I$875,8,FALSE))","v":""},{"$f":"IF(VLOOKUP(A117,Itinerário!$A$3:$I$875,9,FALSE)=0,\"\",VLOOKUP(A117,Itinerário!$A$3:$I$875,9,FALSE))","v":""}]
[115,{"$f":"VLOOKUP(A118,Itinerário!$A$3:$I$875,3,FALSE)","v":"PAULO ROBERTO BARBOSA LOPES"},{"$f":"VLOOKUP(A118,Itinerário!$A$3:$I$875,5,FALSE)","v":"DEZEMBRO"},{"$f":"IF(VLOOKUP(A118,Itinerário!$A$3:$I$875,6,FALSE)=0,\"\",VLOOKUP(A118,Itinerário!$A$3:$I$875,6,FALSE))","v":""},"00:00:00",{"$f":"IF(VLOOKUP(A118,Itinerário!$A$3:$I$875,7,FALSE)=0,\"\",VLOOKUP(A118,Itinerário!$A$3:$I$875,7,FALSE))","v":""},{"$f":"IF(VLOOKUP(A118,Itinerário!$A$3:$I$875,8,FALSE)=0,\"\",VLOOKUP(A118,Itinerário!$A$3:$I$875,8,FALSE))","v":""},{"$f":"IF(VLOOKUP(A118,Itinerário!$A$3:$I$875,9,FALSE)=0,\"\",VLOOKUP(A118,Itinerário!$A$3:$I$875,9,FALSE))","v":""}]
[116,{"$f":"VLOOKUP(A119,Itinerário!$A$3:$I$875,3,FALSE)","v":"PAULO ROBERTO BARBOSA LOPES"},{"$f":"VLOOKUP(A119,Itinerário!$A$3:$I$875,5,FALSE)","v":"DEZEMBRO"},{"$f":"IF(VLOOKUP(A119,Itinerário!$A$3:$I$875,6,FALSE)=0,\"\",VLOOKUP(A119,Itinerário!$A$3:$I$875,6,FALSE))","v":""},"00:00:00",{"$f":"IF(VLOOKUP(A119,Itinerário!$A$3:$I$875,7,FALSE)=0,\"\",VLOOKUP(A119,Itinerário!$A$3:$I$875,7,FALSE))","v":""},{"$f":"IF(VLOOKUP(A119,Itinerário!$A$3:$I$875,8,FALSE)=0,\"\",VLOOKUP(A119,Itinerário!$A$3:$I$875,8,FALSE))","v":""},{"$f":"IF(VLOOKUP(A119,Itinerário!$A$3:$I$875,9,FALSE)=0,\"\",VLOOKUP(A119,Itinerário!$A$3:$I$875,9,FALSE))","v":""}]
[117,{"$f":"VLOOKUP(A120,Itinerário!$A$3:$I$875,3,FALSE)","v":"PAULO ROBERTO BARBOSA LOPES"},{"$f":"VLOOKUP(A120,Itinerário!$A$3:$I$875,5,FALSE)","v":"DEZEMBRO"},{"$f":"IF(VLOOKUP(A120,Itinerário!$A$3:$I$875,6,FALSE)=0,\"\",VLOOKUP(A120,Itinerário!$A$3:$I$875,6,FALSE))","v":""},"00:00:00",{"$f":"IF(VLOOKUP(A120,Itinerário!$A$3:$I$875,7,FALSE)=0,\"\",VLOOKUP(A120,Itinerário!$A$3:$I$875,7,FALSE))","v":""},{"$f":"IF(VLOOKUP(A120,Itinerário!$A$3:$I$875,8,FALSE)=0,\"\",VLOOKUP(A120,Itinerário!$A$3:$I$875,8,FALSE))","v":""},{"$f":"IF(VLOOKUP(A120,Itinerário!$A$3:$I$875,9,FALSE)=0,\"\",VLOOKUP(A120,Itinerário!$A$3:$I$875,9,FALSE))","v":""}]
[118,{"$f":"VLOOKUP(A121,Itinerário!$A$3:$I$875,3,FALSE)","v":"PAULO ROBERTO BARBOSA LOPES"},{"$f":"VLOOKUP(A121,Itinerário!$A$3:$I$875,5,FALSE)","v":"DEZEMBRO"},{"$f":"IF(VLOOKUP(A121,Itinerário!$A$3:$I$875,6,FALSE)=0,\"\",VLOOKUP(A121,Itinerário!$A$3:$I$875,6,FALSE))","v":""},"00:00:00",{"$f":"IF(VLOOKUP(A121,Itinerário!$A$3:$I$875,7,FALSE)=0,\"\",VLOOKUP(A121,Itinerário!$A$3:$I$875,7,FALSE))","v":""},{"$f":"IF(VLOOKUP(A121,Itinerário!$A$3:$I$875,8,FALSE)=0,\"\",VLOOKUP(A121,Itinerário!$A$3:$I$875,8,FALSE))","v":""},{"$f":"IF(VLOOKUP(A121,Itinerário!$A$3:$I$875,9,FALSE)=0,\"\",VLOOKUP(A121,Itinerário!$A$3:$I$875,9,FALSE))","v":""}]
[119,{"$f":"VLOOKUP(A122,Itinerário!$A$3:$I$875,3,FALSE)","v":"PAULO ROBERTO BARBOSA LOPES"},{"$f":"VLOOKUP(A122,Itinerário!$A$3:$I$875,5,FALSE)","v":"DEZEMBRO"},{"$f":"IF(VLOOKUP(A122,Itinerário!$A$3:$I$875,6,FALSE)=0,\"\",VLOOKUP(A122,Itinerário!$A$3:$I$875,6,FALSE))","v":""},"00:00:00",{"$f":"IF(VLOOKUP(A122,Itinerário!$A$3:$I$875,7,FALSE)=0,\"\",VLOOKUP(A122,Itinerário!$A$3:$I$875,7,FALSE))","v":""},{"$f":"IF(VLOOKUP(A122,Itinerário!$A$3:$I$875,8,FALSE)=0,\"\",VLOOKUP(A122,Itinerário!$A$3:$I$875,8,FALSE))","v":""},{"$f":"IF(VLOOKUP(A122,Itinerário!$A$3:$I$875,9,FALSE)=0,\"\",VLOOKUP(A122,Itinerário!$A$3:$I$875,9,FALSE))","v":""}]
[120,{"$f":"VLOOKUP(A123,Itinerário!$A$3:$I$875,3,FALSE)","v":"PAULO ROBERTO BARBOSA LOPES"},{"$f":"VLOOKUP(A123,Itinerário!$A$3:$I$875,5,FALSE)","v":"DEZEMBRO"},{"$f":"IF(VLOOKUP(A123,Itinerário!$A$3:$I$875,6,FALSE)=0,\"\",VLOOKUP(A123,Itinerário!$A$3:$I$875,6,FALSE))","v":""},"00:00:00",{"$f":"IF(VLOOKUP(A123,Itinerário!$A$3:$I$875,7,FALSE)=0,\"\",VLOOKUP(A123,Itinerário!$A$3:$I$875,7,FALSE))","v":""},{"$f":"IF(VLOOKUP(A123,Itinerário!$A$3:$I$875,8,FALSE)=0,\"\",VLOOKUP(A123,Itinerário!$A$3:$I$875,8,FALSE))","v":""},{"$f":"IF(VLOOKUP(A123,Itinerário!$A$3:$I$875,9,FALSE)=0,\"\",VLOOKUP(A123,Itinerário!$A$3:$I$875,9,FALSE))","v":""}]
[121,{"$f":"VLOOKUP(A124,Itinerário!$A$3:$I$875,3,FALSE)","v":"LUCIANO RODRIGO BARBOSA SANCHES"},{"$f":"VLOOKUP(A124,Itinerário!$A$3:$I$875,5,FALSE)","v":"JULHO"},{"$f":"IF(VLOOKUP(A124,Itinerário!$A$3:$I$875,6,FALSE)=0,\"\",VLOOKUP(A124,Itinerário!$A$3:$I$875,6,FALSE))","v":7},"2018-07-07",{"$f":"IF(VLOOKUP(A124,Itinerário!$A$3:$I$875,7,FALSE)=0,\"\",VLOOKUP(A124,Itinerário!$A$3:$I$875,7,FALSE))","v":"Pregação e Visita Tesoureiro"},{"$f":"IF(VLOOKUP(A124,Itinerário!$A$3:$I$875,8,FALSE)=0,\"\",VLOOKUP(A124,Itinerário!$A$3:$I$875,8,FALSE))","v":"São Vicente"},{"$f":"IF(VLOOKUP(A124,Itinerário!$A$3:$I$875,9,FALSE)=0,\"\",VLOOKUP(A124,Itinerário!$A$3:$I$875,9,FALSE))","v":"São Vicente"}]
[122,{"$f":"VLOOKUP(A125,Itinerário!$A$3:$I$875,3,FALSE)","v":"LUCIANO RODRIGO BARBOSA SANCHES"},{"$f":"VLOOKUP(A125,Itinerário!$A$3:$I$875,5,FALSE)","v":"JULHO"},{"$f":"IF(VLOOKUP(A125,Itinerário!$A$3:$I$875,6,FALSE)=0,\"\",VLOOKUP(A125,Itinerário!$A$3:$I$875,6,FALSE))","v":28},"2018-07-28",{"$f":"IF(VLOOKUP(A125,Itinerário!$A$3:$I$875,7,FALSE)=0,\"\",VLOOKUP(A125,Itinerário!$A$3:$I$875,7,FALSE))","v":"Pregação e Visita Tesoureiro"},{"$f":"IF(VLOOKUP(A125,Itinerário!$A$3:$I$875,8,FALSE)=0,\"\",VLOOKUP(A125,Itinerário!$A$3:$I$875,8,FALSE))","v":"Areias"},{"$f":"IF(VLOOKUP(A125,Itinerário!$A$3:$I$875,9,FALSE)=0,\"\",VLOOKUP(A125,Itinerário!$A$3:$I$875,9,FALSE))","v":"Barreiros"}]
[123,{"$f":"VLOOKUP(A126,Itinerário!$A$3:$I$875,3,FALSE)","v":"LUCIANO RODRIGO BARBOSA SANCHES"},{"$f":"VLOOKUP(A126,Itinerário!$A$3:$I$875,5,FALSE)","v":"JULHO"},{"$f":"IF(VLOOKUP(A126,Itinerário!$A$3:$I$875,6,FALSE)=0,\"\",VLOOKUP(A126,Itinerário!$A$3:$I$875,6,FALSE))","v":""},"00:00:00",{"$f":"IF(VLOOKUP(A126,Itinerário!$A$3:$I$875,7,FALSE)=0,\"\",VLOOKUP(A126,Itinerário!$A$3:$I$875,7,FALSE))","v":""},{"$f":"IF(VLOOKUP(A126,Itinerário!$A$3:$I$875,8,FALSE)=0,\"\",VLOOKUP(A126,Itinerário!$A$3:$I$875,8,FALSE))","v":""},{"$f":"IF(VLOOKUP(A126,Itinerário!$A$3:$I$875,9,FALSE)=0,\"\",VLOOKUP(A126,Itinerário!$A$3:$I$875,9,FALSE))","v":""}]
[124,{"$f":"VLOOKUP(A127,Itinerário!$A$3:$I$875,3,FALSE)","v":"LUCIANO RODRIGO BARBOSA SANCHES"},{"$f":"VLOOKUP(A127,Itinerário!$A$3:$I$875,5,FALSE)","v":"JULHO"},{"$f":"IF(VLOOKUP(A127,Itinerário!$A$3:$I$875,6,FALSE)=0,\"\",VLOOKUP(A127,Itinerário!$A$3:$I$875,6,FALSE))","v":""},"00:00:00",{"$f":"IF(VLOOKUP(A127,Itinerário!$A$3:$I$875,7,FALSE)=0,\"\",VLOOKUP(A127,Itinerário!$A$3:$I$875,7,FALSE))","v":""},{"$f":"IF(VLOOKUP(A127,Itinerário!$A$3:$I$875,8,FALSE)=0,\"\",VLOOKUP(A127,Itinerário!$A$3:$I$875,8,FALSE))","v":""},{"$f":"IF(VLOOKUP(A127,Itinerário!$A$3:$I$875,9,FALSE)=0,\"\",VLOOKUP(A127,Itinerário!$A$3:$I$875,9,FALSE))","v":""}]
[125,{"$f":"VLOOKUP(A128,Itinerário!$A$3:$I$875,3,FALSE)","v":"LUCIANO RODRIGO BARBOSA SANCHES"},{"$f":"VLOOKUP(A128,Itinerário!$A$3:$I$875,5,FALSE)","v":"JULHO"},{"$f":"IF(VLOOKUP(A128,Itinerário!$A$3:$I$875,6,FALSE)=0,\"\",VLOOKUP(A128,Itinerário!$A$3:$I$875,6,FALSE))","v":""},"00:00:00",{"$f":"IF(VLOOKUP(A128,Itinerário!$A$3:$I$875,7,FALSE)=0,\"\",VLOOKUP(A128,Itinerário!$A$3:$I$875,7,FALSE))","v":""},{"$f":"IF(VLOOKUP(A128,Itinerário!$A$3:$I$875,8,FALSE)=0,\"\",VLOOKUP(A128,Itinerário!$A$3:$I$875,8,FALSE))","v":""},{"$f":"IF(VLOOKUP(A128,Itinerário!$A$3:$I$875,9,FALSE)=0,\"\",VLOOKUP(A128,Itinerário!$A$3:$I$875,9,FALSE))","v":""}]
[126,{"$f":"VLOOKUP(A129,Itinerário!$A$3:$I$875,3,FALSE)","v":"LUCIANO RODRIGO BARBOSA SANCHES"},{"$f":"VLOOKUP(A129,Itinerário!$A$3:$I$875,5,FALSE)","v":"JULHO"},{"$f":"IF(VLOOKUP(A129,Itinerário!$A$3:$I$875,6,FALSE)=0,\"\",VLOOKUP(A129,Itinerário!$A$3:$I$875,6,FALSE))","v":""},"00:00:00",{"$f":"IF(VLOOKUP(A129,Itinerário!$A$3:$I$875,7,FALSE)=0,\"\",VLOOKUP(A129,Itinerário!$A$3:$I$875,7,FALSE))","v":""},{"$f":"IF(VLOOKUP(A129,Itinerário!$A$3:$I$875,8,FALSE)=0,\"\",VLOOKUP(A129,Itinerário!$A$3:$I$875,8,FALSE))","v":""},{"$f":"IF(VLOOKUP(A129,Itinerário!$A$3:$I$875,9,FALSE)=0,\"\",VLOOKUP(A129,Itinerário!$A$3:$I$875,9,FALSE))","v":""}]
[127,{"$f":"VLOOKUP(A130,Itinerário!$A$3:$I$875,3,FALSE)","v":"LUCIANO RODRIGO BARBOSA SANCHES"},{"$f":"VLOOKUP(A130,Itinerário!$A$3:$I$875,5,FALSE)","v":"JULHO"},{"$f":"IF(VLOOKUP(A130,Itinerário!$A$3:$I$875,6,FALSE)=0,\"\",VLOOKUP(A130,Itinerário!$A$3:$I$875,6,FALSE))","v":""},"00:00:00",{"$f":"IF(VLOOKUP(A130,Itinerário!$A$3:$I$875,7,FALSE)=0,\"\",VLOOKUP(A130,Itinerário!$A$3:$I$875,7,FALSE))","v":""},{"$f":"IF(VLOOKUP(A130,Itinerário!$A$3:$I$875,8,FALSE)=0,\"\",VLOOKUP(A130,Itinerário!$A$3:$I$875,8,FALSE))","v":""},{"$f":"IF(VLOOKUP(A130,Itinerário!$A$3:$I$875,9,FALSE)=0,\"\",VLOOKUP(A130,Itinerário!$A$3:$I$875,9,FALSE))","v":""}]
[128,{"$f":"VLOOKUP(A131,Itinerário!$A$3:$I$875,3,FALSE)","v":"LUCIANO RODRIGO BARBOSA SANCHES"},{"$f":"VLOOKUP(A131,Itinerário!$A$3:$I$875,5,FALSE)","v":"JULHO"},{"$f":"IF(VLOOKUP(A131,Itinerário!$A$3:$I$875,6,FALSE)=0,\"\",VLOOKUP(A131,Itinerário!$A$3:$I$875,6,FALSE))","v":""},"00:00:00",{"$f":"IF(VLOOKUP(A131,Itinerário!$A$3:$I$875,7,FALSE)=0,\"\",VLOOKUP(A131,Itinerário!$A$3:$I$875,7,FALSE))","v":""},{"$f":"IF(VLOOKUP(A131,Itinerário!$A$3:$I$875,8,FALSE)=0,\"\",VLOOKUP(A131,Itinerário!$A$3:$I$875,8,FALSE))","v":""},{"$f":"IF(VLOOKUP(A131,Itinerário!$A$3:$I$875,9,FALSE)=0,\"\",VLOOKUP(A131,Itinerário!$A$3:$I$875,9,FALSE))","v":""}]
[129,{"$f":"VLOOKUP(A132,Itinerário!$A$3:$I$875,3,FALSE)","v":"LUCIANO RODRIGO BARBOSA SANCHES"},{"$f":"VLOOKUP(A132,Itinerário!$A$3:$I$875,5,FALSE)","v":"JULHO"},{"$f":"IF(VLOOKUP(A132,Itinerário!$A$3:$I$875,6,FALSE)=0,\"\",VLOOKUP(A132,Itinerário!$A$3:$I$875,6,FALSE))","v":""},{"$f":"IFERROR(DATE(RIGHT($B$2,4),VLOOKUP(C132,$J$4:$K$15,2,FALSE),D132),0)","v":"00:00:00"},{"$f":"IF(VLOOKUP(A132,Itinerário!$A$3:$I$875,7,FALSE)=0,\"\",VLOOKUP(A132,Itinerário!$A$3:$I$875,7,FALSE))","v":""},{"$f":"IF(VLOOKUP(A132,Itinerário!$A$3:$I$875,8,FALSE)=0,\"\",VLOOKUP(A132,Itinerário!$A$3:$I$875,8,FALSE))","v":""},{"$f":"IF(VLOOKUP(A132,Itinerário!$A$3:$I$875,9,FALSE)=0,\"\",VLOOKUP(A132,Itinerário!$A$3:$I$875,9,FALSE))","v":""}]
[130,{"$f":"VLOOKUP(A133,Itinerário!$A$3:$I$875,3,FALSE)","v":"LUCIANO RODRIGO BARBOSA SANCHES"},{"$f":"VLOOKUP(A133,Itinerário!$A$3:$I$875,5,FALSE)","v":"JULHO"},{"$f":"IF(VLOOKUP(A133,Itinerário!$A$3:$I$875,6,FALSE)=0,\"\",VLOOKUP(A133,Itinerário!$A$3:$I$875,6,FALSE))","v":""},"00:00:00",{"$f":"IF(VLOOKUP(A133,Itinerário!$A$3:$I$875,7,FALSE)=0,\"\",VLOOKUP(A133,Itinerário!$A$3:$I$875,7,FALSE))","v":""},{"$f":"IF(VLOOKUP(A133,Itinerário!$A$3:$I$875,8,FALSE)=0,\"\",VLOOKUP(A133,Itinerário!$A$3:$I$875,8,FALSE))","v":""},{"$f":"IF(VLOOKUP(A133,Itinerário!$A$3:$I$875,9,FALSE)=0,\"\",VLOOKUP(A133,Itinerário!$A$3:$I$875,9,FALSE))","v":""}]
[131,{"$f":"VLOOKUP(A134,Itinerário!$A$3:$I$875,3,FALSE)","v":"LUCIANO RODRIGO BARBOSA SANCHES"},{"$f":"VLOOKUP(A134,Itinerário!$A$3:$I$875,5,FALSE)","v":"AGOSTO"},{"$f":"IF(VLOOKUP(A134,Itinerário!$A$3:$I$875,6,FALSE)=0,\"\",VLOOKUP(A134,Itinerário!$A$3:$I$875,6,FALSE))","v":4},"2018-08-04",{"$f":"IF(VLOOKUP(A134,Itinerário!$A$3:$I$875,7,FALSE)=0,\"\",VLOOKUP(A134,Itinerário!$A$3:$I$875,7,FALSE))","v":"Pregação"},{"$f":"IF(VLOOKUP(A134,Itinerário!$A$3:$I$875,8,FALSE)=0,\"\",VLOOKUP(A134,Itinerário!$A$3:$I$875,8,FALSE))","v":"Bom Retiro"},{"$f":"IF(VLOOKUP(A134,Itinerário!$A$3:$I$875,9,FALSE)=0,\"\",VLOOKUP(A134,Itinerário!$A$3:$I$875,9,FALSE))","v":"Bom Retiro"}]
[132,{"$f":"VLOOKUP(A135,Itinerário!$A$3:$I$875,3,FALSE)","v":"LUCIANO RODRIGO BARBOSA SANCHES"},{"$f":"VLOOKUP(A135,Itinerário!$A$3:$I$875,5,FALSE)","v":"AGOSTO"},{"$f":"IF(VLOOKUP(A135,Itinerário!$A$3:$I$875,6,FALSE)=0,\"\",VLOOKUP(A135,Itinerário!$A$3:$I$875,6,FALSE))","v":11},"2018-08-11",{"$f":"IF(VLOOKUP(A135,Itinerário!$A$3:$I$875,7,FALSE)=0,\"\",VLOOKUP(A135,Itinerário!$A$3:$I$875,7,FALSE))","v":"Pregação"},{"$f":"IF(VLOOKUP(A135,Itinerário!$A$3:$I$875,8,FALSE)=0,\"\",VLOOKUP(A135,Itinerário!$A$3:$I$875,8,FALSE))","v":"Brusque"},{"$f":"IF(VLOOKUP(A135,Itinerário!$A$3:$I$875,9,FALSE)=0,\"\",VLOOKUP(A135,Itinerário!$A$3:$I$875,9,FALSE))","v":"Brusque"}]
[133,{"$f":"VLOOKUP(A136,Itinerário!$A$3:$I$875,3,FALSE)","v":"LUCIANO RODRIGO BARBOSA SANCHES"},{"$f":"VLOOKUP(A136,Itinerário!$A$3:$I$875,5,FALSE)","v":"AGOSTO"},{"$f":"IF(VLOOKUP(A136,Itinerário!$A$3:$I$875,6,FALSE)=0,\"\",VLOOKUP(A136,Itinerário!$A$3:$I$875,6,FALSE))","v":18},"2018-08-18",{"$f":"IF(VLOOKUP(A136,Itinerário!$A$3:$I$875,7,FALSE)=0,\"\",VLOOKUP(A136,Itinerário!$A$3:$I$875,7,FALSE))","v":"ECC Tubarão"},{"$f":"IF(VLOOKUP(A136,Itinerário!$A$3:$I$875,8,FALSE)=0,\"\",VLOOKUP(A136,Itinerário!$A$3:$I$875,8,FALSE))","v":"Tubarão"},{"$f":"IF(VLOOKUP(A136,Itinerário!$A$3:$I$875,9,FALSE)=0,\"\",VLOOKUP(A136,Itinerário!$A$3:$I$875,9,FALSE))","v":"Tubarão"}]
[134,{"$f":"VLOOKUP(A137,Itinerário!$A$3:$I$875,3,FALSE)","v":"LUCIANO RODRIGO BARBOSA SANCHES"},{"$f":"VLOOKUP(A137,Itinerário!$A$3:$I$875,5,FALSE)","v":"AGOSTO"},{"$f":"IF(VLOOKUP(A137,Itinerário!$A$3:$I$875,6,FALSE)=0,\"\",VLOOKUP(A137,Itinerário!$A$3:$I$875,6,FALSE))","v":""},"00:00:00",{"$f":"IF(VLOOKUP(A137,Itinerário!$A$3:$I$875,7,FALSE)=0,\"\",VLOOKUP(A137,Itinerário!$A$3:$I$875,7,FALSE))","v":""},{"$f":"IF(VLOOKUP(A137,Itinerário!$A$3:$I$875,8,FALSE)=0,\"\",VLOOKUP(A137,Itinerário!$A$3:$I$875,8,FALSE))","v":""},{"$f":"IF(VLOOKUP(A137,Itinerário!$A$3:$I$875,9,FALSE)=0,\"\",VLOOKUP(A137,Itinerário!$A$3:$I$875,9,FALSE))","v":""}]
[135,{"$f":"VLOOKUP(A138,Itinerário!$A$3:$I$875,3,FALSE)","v":"LUCIANO RODRIGO BARBOSA SANCHES"},{"$f":"VLOOKUP(A138,Itinerário!$A$3:$I$875,5,FALSE)","v":"AGOSTO"},{"$f":"IF(VLOOKUP(A138,Itinerário!$A$3:$I$875,6,FALSE)=0,\"\",VLOOKUP(A138,Itinerário!$A$3:$I$875,6,FALSE))","v":""},"00:00:00",{"$f":"IF(VLOOKUP(A138,Itinerário!$A$3:$I$875,7,FALSE)=0,\"\",VLOOKUP(A138,Itinerário!$A$3:$I$875,7,FALSE))","v":""},{"$f":"IF(VLOOKUP(A138,Itinerário!$A$3:$I$875,8,FALSE)=0,\"\",VLOOKUP(A138,Itinerário!$A$3:$I$875,8,FALSE))","v":""},{"$f":"IF(VLOOKUP(A138,Itinerário!$A$3:$I$875,9,FALSE)=0,\"\",VLOOKUP(A138,Itinerário!$A$3:$I$875,9,FALSE))","v":""}]
[136,{"$f":"VLOOKUP(A139,Itinerário!$A$3:$I$875,3,FALSE)","v":"LUCIANO RODRIGO BARBOSA SANCHES"},{"$f":"VLOOKUP(A139,Itinerário!$A$3:$I$875,5,FALSE)","v":"AGOSTO"},{"$f":"IF(VLOOKUP(A139,Itinerário!$A$3:$I$875,6,FALSE)=0,\"\",VLOOKUP(A139,Itinerário!$A$3:$I$875,6,FALSE))","v":""},"00:00:00",{"$f":"IF(VLOOKUP(A139,Itinerário!$A$3:$I$875,7,FALSE)=0,\"\",VLOOKUP(A139,Itinerário!$A$3:$I$875,7,FALSE))","v":""},{"$f":"IF(VLOOKUP(A139,Itinerário!$A$3:$I$875,8,FALSE)=0,\"\",VLOOKUP(A139,Itinerário!$A$3:$I$875,8,FALSE))","v":""},{"$f":"IF(VLOOKUP(A139,Itinerário!$A$3:$I$875,9,FALSE)=0,\"\",VLOOKUP(A139,Itinerário!$A$3:$I$875,9,FALSE))","v":""}]
[137,{"$f":"VLOOKUP(A140,Itinerário!$A$3:$I$875,3,FALSE)","v":"LUCIANO RODRIGO BARBOSA SANCHES"},{"$f":"VLOOKUP(A140,Itinerário!$A$3:$I$875,5,FALSE)","v":"AGOSTO"},{"$f":"IF(VLOOKUP(A140,Itinerário!$A$3:$I$875,6,FALSE)=0,\"\",VLOOKUP(A140,Itinerário!$A$3:$I$875,6,FALSE))","v":""},"00:00:00",{"$f":"IF(VLOOKUP(A140,Itinerário!$A$3:$I$875,7,FALSE)=0,\"\",VLOOKUP(A140,Itinerário!$A$3:$I$875,7,FALSE))","v":""},{"$f":"IF(VLOOKUP(A140,Itinerário!$A$3:$I$875,8,FALSE)=0,\"\",VLOOKUP(A140,Itinerário!$A$3:$I$875,8,FALSE))","v":""},{"$f":"IF(VLOOKUP(A140,Itinerário!$A$3:$I$875,9,FALSE)=0,\"\",VLOOKUP(A140,Itinerário!$A$3:$I$875,9,FALSE))","v":""}]
[138,{"$f":"VLOOKUP(A141,Itinerário!$A$3:$I$875,3,FALSE)","v":"LUCIANO RODRIGO BARBOSA SANCHES"},{"$f":"VLOOKUP(A141,Itinerário!$A$3:$I$875,5,FALSE)","v":"AGOSTO"},{"$f":"IF(VLOOKUP(A141,Itinerário!$A$3:$I$875,6,FALSE)=0,\"\",VLOOKUP(A141,Itinerário!$A$3:$I$875,6,FALSE))","v":""},"00:00:00",{"$f":"IF(VLOOKUP(A141,Itinerário!$A$3:$I$875,7,FALSE)=0,\"\",VLOOKUP(A141,Itinerário!$A$3:$I$875,7,FALSE))","v":""},{"$f":"IF(VLOOKUP(A141,Itinerário!$A$3:$I$875,8,FALSE)=0,\"\",VLOOKUP(A141,Itinerário!$A$3:$I$875,8,FALSE))","v":""},{"$f":"IF(VLOOKUP(A141,Itinerário!$A$3:$I$875,9,FALSE)=0,\"\",VLOOKUP(A141,Itinerário!$A$3:$I$875,9,FALSE))","v":""}]
[139,{"$f":"VLOOKUP(A142,Itinerário!$A$3:$I$875,3,FALSE)","v":"LUCIANO RODRIGO BARBOSA SANCHES"},{"$f":"VLOOKUP(A142,Itinerário!$A$3:$I$875,5,FALSE)","v":"AGOSTO"},{"$f":"IF(VLOOKUP(A142,Itinerário!$A$3:$I$875,6,FALSE)=0,\"\",VLOOKUP(A142,Itinerário!$A$3:$I$875,6,FALSE))","v":""},"00:00:00",{"$f":"IF(VLOOKUP(A142,Itinerário!$A$3:$I$875,7,FALSE)=0,\"\",VLOOKUP(A142,Itinerário!$A$3:$I$875,7,FALSE))","v":""},{"$f":"IF(VLOOKUP(A142,Itinerário!$A$3:$I$875,8,FALSE)=0,\"\",VLOOKUP(A142,Itinerário!$A$3:$I$875,8,FALSE))","v":""},{"$f":"IF(VLOOKUP(A142,Itinerário!$A$3:$I$875,9,FALSE)=0,\"\",VLOOKUP(A142,Itinerário!$A$3:$I$875,9,FALSE))","v":""}]
[140,{"$f":"VLOOKUP(A143,Itinerário!$A$3:$I$875,3,FALSE)","v":"LUCIANO RODRIGO BARBOSA SANCHES"},{"$f":"VLOOKUP(A143,Itinerário!$A$3:$I$875,5,FALSE)","v":"AGOSTO"},{"$f":"IF(VLOOKUP(A143,Itinerário!$A$3:$I$875,6,FALSE)=0,\"\",VLOOKUP(A143,Itinerário!$A$3:$I$875,6,FALSE))","v":""},"00:00:00",{"$f":"IF(VLOOKUP(A143,Itinerário!$A$3:$I$875,7,FALSE)=0,\"\",VLOOKUP(A143,Itinerário!$A$3:$I$875,7,FALSE))","v":""},{"$f":"IF(VLOOKUP(A143,Itinerário!$A$3:$I$875,8,FALSE)=0,\"\",VLOOKUP(A143,Itinerário!$A$3:$I$875,8,FALSE))","v":""},{"$f":"IF(VLOOKUP(A143,Itinerário!$A$3:$I$875,9,FALSE)=0,\"\",VLOOKUP(A143,Itinerário!$A$3:$I$875,9,FALSE))","v":""}]
[141,{"$f":"VLOOKUP(A144,Itinerário!$A$3:$I$875,3,FALSE)","v":"LUCIANO RODRIGO BARBOSA SANCHES"},{"$f":"VLOOKUP(A144,Itinerário!$A$3:$I$875,5,FALSE)","v":"SETEMBRO"},{"$f":"IF(VLOOKUP(A144,Itinerário!$A$3:$I$875,6,FALSE)=0,\"\",VLOOKUP(A144,Itinerário!$A$3:$I$875,6,FALSE))","v":1},"2018-09-01",{"$f":"IF(VLOOKUP(A144,Itinerário!$A$3:$I$875,7,FALSE)=0,\"\",VLOOKUP(A144,Itinerário!$A$3:$I$875,7,FALSE))","v":"Pregação e Visita Tesoureiro"},{"$f":"IF(VLOOKUP(A144,Itinerário!$A$3:$I$875,8,FALSE)=0,\"\",VLOOKUP(A144,Itinerário!$A$3:$I$875,8,FALSE))","v":"Barreiros"},{"$f":"IF(VLOOKUP(A144,Itinerário!$A$3:$I$875,9,FALSE)=0,\"\",VLOOKUP(A144,Itinerário!$A$3:$I$875,9,FALSE))","v":"Barreiros"}]
[142,{"$f":"VLOOKUP(A145,Itinerário!$A$3:$I$875,3,FALSE)","v":"LUCIANO RODRIGO BARBOSA SANCHES"},{"$f":"VLOOKUP(A145,Itinerário!$A$3:$I$875,5,FALSE)","v":"SETEMBRO"},{"$f":"IF(VLOOKUP(A145,Itinerário!$A$3:$I$875,6,FALSE)=0,\"\",VLOOKUP(A145,Itinerário!$A$3:$I$875,6,FALSE))","v":8},"2018-09-08",{"$f":"IF(VLOOKUP(A145,Itinerário!$A$3:$I$875,7,FALSE)=0,\"\",VLOOKUP(A145,Itinerário!$A$3:$I$875,7,FALSE))","v":"Encontro Filhos de Obreiros - USB"},{"$f":"IF(VLOOKUP(A145,Itinerário!$A$3:$I$875,8,FALSE)=0,\"\",VLOOKUP(A145,Itinerário!$A$3:$I$875,8,FALSE))","v":"CATRE"},{"$f":"IF(VLOOKUP(A145,Itinerário!$A$3:$I$875,9,FALSE)=0,\"\",VLOOKUP(A145,Itinerário!$A$3:$I$875,9,FALSE))","v":"CATRE"}]
[143,{"$f":"VLOOKUP(A146,Itinerário!$A$3:$I$875,3,FALSE)","v":"LUCIANO RODRIGO BARBOSA SANCHES"},{"$f":"VLOOKUP(A146,Itinerário!$A$3:$I$875,5,FALSE)","v":"SETEMBRO"},{"$f":"IF(VLOOKUP(A146,Itinerário!$A$3:$I$875,6,FALSE)=0,\"\",VLOOKUP(A146,Itinerário!$A$3:$I$875,6,FALSE))","v":15},"2018-09-15",{"$f":"IF(VLOOKUP(A146,Itinerário!$A$3:$I$875,7,FALSE)=0,\"\",VLOOKUP(A146,Itinerário!$A$3:$I$875,7,FALSE))","v":"Pregação e Visita Tesoureiro"},{"$f":"IF(VLOOKUP(A146,Itinerário!$A$3:$I$875,8,FALSE)=0,\"\",VLOOKUP(A146,Itinerário!$A$3:$I$875,8,FALSE))","v":"Próspera"},{"$f":"IF(VLOOKUP(A146,Itinerário!$A$3:$I$875,9,FALSE)=0,\"\",VLOOKUP(A146,Itinerário!$A$3:$I$875,9,FALSE))","v":"Próspera"}]
[144,{"$f":"VLOOKUP(A147,Itinerário!$A$3:$I$875,3,FALSE)","v":"LUCIANO RODRIGO BARBOSA SANCHES"},{"$f":"VLOOKUP(A147,Itinerário!$A$3:$I$875,5,FALSE)","v":"SETEMBRO"},{"$f":"IF(VLOOKUP(A147,Itinerário!$A$3:$I$875,6,FALSE)=0,\"\",VLOOKUP(A147,Itinerário!$A$3:$I$875,6,FALSE))","v":29},"2018-09-29",{"$f":"IF(VLOOKUP(A147,Itinerário!$A$3:$I$875,7,FALSE)=0,\"\",VLOOKUP(A147,Itinerário!$A$3:$I$875,7,FALSE))","v":"Pregação e Visita Tesoureiro"},{"$f":"IF(VLOOKUP(A147,Itinerário!$A$3:$I$875,8,FALSE)=0,\"\",VLOOKUP(A147,Itinerário!$A$3:$I$875,8,FALSE))","v":"Praia Brava"},{"$f":"IF(VLOOKUP(A147,Itinerário!$A$3:$I$875,9,FALSE)=0,\"\",VLOOKUP(A147,Itinerário!$A$3:$I$875,9,FALSE))","v":"Balneário Camboriú"}]
[145,{"$f":"VLOOKUP(A148,Itinerário!$A$3:$I$875,3,FALSE)","v":"LUCIANO RODRIGO BARBOSA SANCHES"},{"$f":"VLOOKUP(A148,Itinerário!$A$3:$I$875,5,FALSE)","v":"SETEMBRO"},{"$f":"IF(VLOOKUP(A148,Itinerário!$A$3:$I$875,6,FALSE)=0,\"\",VLOOKUP(A148,Itinerário!$A$3:$I$875,6,FALSE))","v":""},"00:00:00",{"$f":"IF(VLOOKUP(A148,Itinerário!$A$3:$I$875,7,FALSE)=0,\"\",VLOOKUP(A148,Itinerário!$A$3:$I$875,7,FALSE))","v":""},{"$f":"IF(VLOOKUP(A148,Itinerário!$A$3:$I$875,8,FALSE)=0,\"\",VLOOKUP(A148,Itinerário!$A$3:$I$875,8,FALSE))","v":""},{"$f":"IF(VLOOKUP(A148,Itinerário!$A$3:$I$875,9,FALSE)=0,\"\",VLOOKUP(A148,Itinerário!$A$3:$I$875,9,FALSE))","v":""}]
[146,{"$f":"VLOOKUP(A149,Itinerário!$A$3:$I$875,3,FALSE)","v":"LUCIANO RODRIGO BARBOSA SANCHES"},{"$f":"VLOOKUP(A149,Itinerário!$A$3:$I$875,5,FALSE)","v":"SETEMBRO"},{"$f":"IF(VLOOKUP(A149,Itinerário!$A$3:$I$875,6,FALSE)=0,\"\",VLOOKUP(A149,Itinerário!$A$3:$I$875,6,FALSE))","v":""},"00:00:00",{"$f":"IF(VLOOKUP(A149,Itinerário!$A$3:$I$875,7,FALSE)=0,\"\",VLOOKUP(A149,Itinerário!$A$3:$I$875,7,FALSE))","v":""},{"$f":"IF(VLOOKUP(A149,Itinerário!$A$3:$I$875,8,FALSE)=0,\"\",VLOOKUP(A149,Itinerário!$A$3:$I$875,8,FALSE))","v":""},{"$f":"IF(VLOOKUP(A149,Itinerário!$A$3:$I$875,9,FALSE)=0,\"\",VLOOKUP(A149,Itinerário!$A$3:$I$875,9,FALSE))","v":""}]
[147,{"$f":"VLOOKUP(A150,Itinerário!$A$3:$I$875,3,FALSE)","v":"LUCIANO RODRIGO BARBOSA SANCHES"},{"$f":"VLOOKUP(A150,Itinerário!$A$3:$I$875,5,FALSE)","v":"SETEMBRO"},{"$f":"IF(VLOOKUP(A150,Itinerário!$A$3:$I$875,6,FALSE)=0,\"\",VLOOKUP(A150,Itinerário!$A$3:$I$875,6,FALSE))","v":""},"00:00:00",{"$f":"IF(VLOOKUP(A150,Itinerário!$A$3:$I$875,7,FALSE)=0,\"\",VLOOKUP(A150,Itinerário!$A$3:$I$875,7,FALSE))","v":""},{"$f":"IF(VLOOKUP(A150,Itinerário!$A$3:$I$875,8,FALSE)=0,\"\",VLOOKUP(A150,Itinerário!$A$3:$I$875,8,FALSE))","v":""},{"$f":"IF(VLOOKUP(A150,Itinerário!$A$3:$I$875,9,FALSE)=0,\"\",VLOOKUP(A150,Itinerário!$A$3:$I$875,9,FALSE))","v":""}]
[148,{"$f":"VLOOKUP(A151,Itinerário!$A$3:$I$875,3,FALSE)","v":"LUCIANO RODRIGO BARBOSA SANCHES"},{"$f":"VLOOKUP(A151,Itinerário!$A$3:$I$875,5,FALSE)","v":"SETEMBRO"},{"$f":"IF(VLOOKUP(A151,Itinerário!$A$3:$I$875,6,FALSE)=0,\"\",VLOOKUP(A151,Itinerário!$A$3:$I$875,6,FALSE))","v":""},"00:00:00",{"$f":"IF(VLOOKUP(A151,Itinerário!$A$3:$I$875,7,FALSE)=0,\"\",VLOOKUP(A151,Itinerário!$A$3:$I$875,7,FALSE))","v":""},{"$f":"IF(VLOOKUP(A151,Itinerário!$A$3:$I$875,8,FALSE)=0,\"\",VLOOKUP(A151,Itinerário!$A$3:$I$875,8,FALSE))","v":""},{"$f":"IF(VLOOKUP(A151,Itinerário!$A$3:$I$875,9,FALSE)=0,\"\",VLOOKUP(A151,Itinerário!$A$3:$I$875,9,FALSE))","v":""}]
[149,{"$f":"VLOOKUP(A152,Itinerário!$A$3:$I$875,3,FALSE)","v":"LUCIANO RODRIGO BARBOSA SANCHES"},{"$f":"VLOOKUP(A152,Itinerário!$A$3:$I$875,5,FALSE)","v":"SETEMBRO"},{"$f":"IF(VLOOKUP(A152,Itinerário!$A$3:$I$875,6,FALSE)=0,\"\",VLOOKUP(A152,Itinerário!$A$3:$I$875,6,FALSE))","v":""},"00:00:00",{"$f":"IF(VLOOKUP(A152,Itinerário!$A$3:$I$875,7,FALSE)=0,\"\",VLOOKUP(A152,Itinerário!$A$3:$I$875,7,FALSE))","v":""},{"$f":"IF(VLOOKUP(A152,Itinerário!$A$3:$I$875,8,FALSE)=0,\"\",VLOOKUP(A152,Itinerário!$A$3:$I$875,8,FALSE))","v":""},{"$f":"IF(VLOOKUP(A152,Itinerário!$A$3:$I$875,9,FALSE)=0,\"\",VLOOKUP(A152,Itinerário!$A$3:$I$875,9,FALSE))","v":""}]
[150,{"$f":"VLOOKUP(A153,Itinerário!$A$3:$I$875,3,FALSE)","v":"LUCIANO RODRIGO BARBOSA SANCHES"},{"$f":"VLOOKUP(A153,Itinerário!$A$3:$I$875,5,FALSE)","v":"SETEMBRO"},{"$f":"IF(VLOOKUP(A153,Itinerário!$A$3:$I$875,6,FALSE)=0,\"\",VLOOKUP(A153,Itinerário!$A$3:$I$875,6,FALSE))","v":""},"00:00:00",{"$f":"IF(VLOOKUP(A153,Itinerário!$A$3:$I$875,7,FALSE)=0,\"\",VLOOKUP(A153,Itinerário!$A$3:$I$875,7,FALSE))","v":""},{"$f":"IF(VLOOKUP(A153,Itinerário!$A$3:$I$875,8,FALSE)=0,\"\",VLOOKUP(A153,Itinerário!$A$3:$I$875,8,FALSE))","v":""},{"$f":"IF(VLOOKUP(A153,Itinerário!$A$3:$I$875,9,FALSE)=0,\"\",VLOOKUP(A153,Itinerário!$A$3:$I$875,9,FALSE))","v":""}]
[151,{"$f":"VLOOKUP(A154,Itinerário!$A$3:$I$875,3,FALSE)","v":"LUCIANO RODRIGO BARBOSA SANCHES"},{"$f":"VLOOKUP(A154,Itinerário!$A$3:$I$875,5,FALSE)","v":"OUTUBRO"},{"$f":"IF(VLOOKUP(A154,Itinerário!$A$3:$I$875,6,FALSE)=0,\"\",VLOOKUP(A154,Itinerário!$A$3:$I$875,6,FALSE))","v":6},"2018-10-06",{"$f":"IF(VLOOKUP(A154,Itinerário!$A$3:$I$875,7,FALSE)=0,\"\",VLOOKUP(A154,Itinerário!$A$3:$I$875,7,FALSE))","v":"Encontro Administradores Escolares USB"},{"$f":"IF(VLOOKUP(A154,Itinerário!$A$3:$I$875,8,FALSE)=0,\"\",VLOOKUP(A154,Itinerário!$A$3:$I$875,8,FALSE))","v":"USB"},{"$f":"IF(VLOOKUP(A154,Itinerário!$A$3:$I$875,9,FALSE)=0,\"\",VLOOKUP(A154,Itinerário!$A$3:$I$875,9,FALSE))","v":"USB"}]
[152,{"$f":"VLOOKUP(A155,Itinerário!$A$3:$I$875,3,FALSE)","v":"LUCIANO RODRIGO BARBOSA SANCHES"},{"$f":"VLOOKUP(A155,Itinerário!$A$3:$I$875,5,FALSE)","v":"OUTUBRO"},{"$f":"IF(VLOOKUP(A155,Itinerário!$A$3:$I$875,6,FALSE)=0,\"\",VLOOKUP(A155,Itinerário!$A$3:$I$875,6,FALSE))","v":20},"2018-10-20",{"$f":"IF(VLOOKUP(A155,Itinerário!$A$3:$I$875,7,FALSE)=0,\"\",VLOOKUP(A155,Itinerário!$A$3:$I$875,7,FALSE))","v":"ECC Estreito"},{"$f":"IF(VLOOKUP(A155,Itinerário!$A$3:$I$875,8,FALSE)=0,\"\",VLOOKUP(A155,Itinerário!$A$3:$I$875,8,FALSE))","v":"Estreito"},{"$f":"IF(VLOOKUP(A155,Itinerário!$A$3:$I$875,9,FALSE)=0,\"\",VLOOKUP(A155,Itinerário!$A$3:$I$875,9,FALSE))","v":"Estreito"}]
[153,{"$f":"VLOOKUP(A156,Itinerário!$A$3:$I$875,3,FALSE)","v":"LUCIANO RODRIGO BARBOSA SANCHES"},{"$f":"VLOOKUP(A156,Itinerário!$A$3:$I$875,5,FALSE)","v":"OUTUBRO"},{"$f":"IF(VLOOKUP(A156,Itinerário!$A$3:$I$875,6,FALSE)=0,\"\",VLOOKUP(A156,Itinerário!$A$3:$I$875,6,FALSE))","v":27},"2018-10-27",{"$f":"IF(VLOOKUP(A156,Itinerário!$A$3:$I$875,7,FALSE)=0,\"\",VLOOKUP(A156,Itinerário!$A$3:$I$875,7,FALSE))","v":"Pregação e Visita Tesoureiro"},{"$f":"IF(VLOOKUP(A156,Itinerário!$A$3:$I$875,8,FALSE)=0,\"\",VLOOKUP(A156,Itinerário!$A$3:$I$875,8,FALSE))","v":"Revoredo"},{"$f":"IF(VLOOKUP(A156,Itinerário!$A$3:$I$875,9,FALSE)=0,\"\",VLOOKUP(A156,Itinerário!$A$3:$I$875,9,FALSE))","v":"Revoredo"}]
[154,{"$f":"VLOOKUP(A157,Itinerário!$A$3:$I$875,3,FALSE)","v":"LUCIANO RODRIGO BARBOSA SANCHES"},{"$f":"VLOOKUP(A157,Itinerário!$A$3:$I$875,5,FALSE)","v":"OUTUBRO"},{"$f":"IF(VLOOKUP(A157,Itinerário!$A$3:$I$875,6,FALSE)=0,\"\",VLOOKUP(A157,Itinerário!$A$3:$I$875,6,FALSE))","v":""},"00:00:00",{"$f":"IF(VLOOKUP(A157,Itinerário!$A$3:$I$875,7,FALSE)=0,\"\",VLOOKUP(A157,Itinerário!$A$3:$I$875,7,FALSE))","v":""},{"$f":"IF(VLOOKUP(A157,Itinerário!$A$3:$I$875,8,FALSE)=0,\"\",VLOOKUP(A157,Itinerário!$A$3:$I$875,8,FALSE))","v":""},{"$f":"IF(VLOOKUP(A157,Itinerário!$A$3:$I$875,9,FALSE)=0,\"\",VLOOKUP(A157,Itinerário!$A$3:$I$875,9,FALSE))","v":""}]
[155,{"$f":"VLOOKUP(A158,Itinerário!$A$3:$I$875,3,FALSE)","v":"LUCIANO RODRIGO BARBOSA SANCHES"},{"$f":"VLOOKUP(A158,Itinerário!$A$3:$I$875,5,FALSE)","v":"OUTUBRO"},{"$f":"IF(VLOOKUP(A158,Itinerário!$A$3:$I$875,6,FALSE)=0,\"\",VLOOKUP(A158,Itinerário!$A$3:$I$875,6,FALSE))","v":""},"00:00:00",{"$f":"IF(VLOOKUP(A158,Itinerário!$A$3:$I$875,7,FALSE)=0,\"\",VLOOKUP(A158,Itinerário!$A$3:$I$875,7,FALSE))","v":""},{"$f":"IF(VLOOKUP(A158,Itinerário!$A$3:$I$875,8,FALSE)=0,\"\",VLOOKUP(A158,Itinerário!$A$3:$I$875,8,FALSE))","v":""},{"$f":"IF(VLOOKUP(A158,Itinerário!$A$3:$I$875,9,FALSE)=0,\"\",VLOOKUP(A158,Itinerário!$A$3:$I$875,9,FALSE))","v":""}]
[156,{"$f":"VLOOKUP(A159,Itinerário!$A$3:$I$875,3,FALSE)","v":"LUCIANO RODRIGO BARBOSA SANCHES"},{"$f":"VLOOKUP(A159,Itinerário!$A$3:$I$875,5,FALSE)","v":"OUTUBRO"},{"$f":"IF(VLOOKUP(A159,Itinerário!$A$3:$I$875,6,FALSE)=0,\"\",VLOOKUP(A159,Itinerário!$A$3:$I$875,6,FALSE))","v":""},"00:00:00",{"$f":"IF(VLOOKUP(A159,Itinerário!$A$3:$I$875,7,FALSE)=0,\"\",VLOOKUP(A159,Itinerário!$A$3:$I$875,7,FALSE))","v":""},{"$f":"IF(VLOOKUP(A159,Itinerário!$A$3:$I$875,8,FALSE)=0,\"\",VLOOKUP(A159,Itinerário!$A$3:$I$875,8,FALSE))","v":""},{"$f":"IF(VLOOKUP(A159,Itinerário!$A$3:$I$875,9,FALSE)=0,\"\",VLOOKUP(A159,Itinerário!$A$3:$I$875,9,FALSE))","v":""}]
[157,{"$f":"VLOOKUP(A160,Itinerário!$A$3:$I$875,3,FALSE)","v":"LUCIANO RODRIGO BARBOSA SANCHES"},{"$f":"VLOOKUP(A160,Itinerário!$A$3:$I$875,5,FALSE)","v":"OUTUBRO"},{"$f":"IF(VLOOKUP(A160,Itinerário!$A$3:$I$875,6,FALSE)=0,\"\",VLOOKUP(A160,Itinerário!$A$3:$I$875,6,FALSE))","v":""},"00:00:00",{"$f":"IF(VLOOKUP(A160,Itinerário!$A$3:$I$875,7,FALSE)=0,\"\",VLOOKUP(A160,Itinerário!$A$3:$I$875,7,FALSE))","v":""},{"$f":"IF(VLOOKUP(A160,Itinerário!$A$3:$I$875,8,FALSE)=0,\"\",VLOOKUP(A160,Itinerário!$A$3:$I$875,8,FALSE))","v":""},{"$f":"IF(VLOOKUP(A160,Itinerário!$A$3:$I$875,9,FALSE)=0,\"\",VLOOKUP(A160,Itinerário!$A$3:$I$875,9,FALSE))","v":""}]
[158,{"$f":"VLOOKUP(A161,Itinerário!$A$3:$I$875,3,FALSE)","v":"LUCIANO RODRIGO BARBOSA SANCHES"},{"$f":"VLOOKUP(A161,Itinerário!$A$3:$I$875,5,FALSE)","v":"OUTUBRO"},{"$f":"IF(VLOOKUP(A161,Itinerário!$A$3:$I$875,6,FALSE)=0,\"\",VLOOKUP(A161,Itinerário!$A$3:$I$875,6,FALSE))","v":""},"00:00:00",{"$f":"IF(VLOOKUP(A161,Itinerário!$A$3:$I$875,7,FALSE)=0,\"\",VLOOKUP(A161,Itinerário!$A$3:$I$875,7,FALSE))","v":""},{"$f":"IF(VLOOKUP(A161,Itinerário!$A$3:$I$875,8,FALSE)=0,\"\",VLOOKUP(A161,Itinerário!$A$3:$I$875,8,FALSE))","v":""},{"$f":"IF(VLOOKUP(A161,Itinerário!$A$3:$I$875,9,FALSE)=0,\"\",VLOOKUP(A161,Itinerário!$A$3:$I$875,9,FALSE))","v":""}]
[159,{"$f":"VLOOKUP(A162,Itinerário!$A$3:$I$875,3,FALSE)","v":"LUCIANO RODRIGO BARBOSA SANCHES"},{"$f":"VLOOKUP(A162,Itinerário!$A$3:$I$875,5,FALSE)","v":"OUTUBRO"},{"$f":"IF(VLOOKUP(A162,Itinerário!$A$3:$I$875,6,FALSE)=0,\"\",VLOOKUP(A162,Itinerário!$A$3:$I$875,6,FALSE))","v":""},"00:00:00",{"$f":"IF(VLOOKUP(A162,Itinerário!$A$3:$I$875,7,FALSE)=0,\"\",VLOOKUP(A162,Itinerário!$A$3:$I$875,7,FALSE))","v":""},{"$f":"IF(VLOOKUP(A162,Itinerário!$A$3:$I$875,8,FALSE)=0,\"\",VLOOKUP(A162,Itinerário!$A$3:$I$875,8,FALSE))","v":""},{"$f":"IF(VLOOKUP(A162,Itinerário!$A$3:$I$875,9,FALSE)=0,\"\",VLOOKUP(A162,Itinerário!$A$3:$I$875,9,FALSE))","v":""}]
[160,{"$f":"VLOOKUP(A163,Itinerário!$A$3:$I$875,3,FALSE)","v":"LUCIANO RODRIGO BARBOSA SANCHES"},{"$f":"VLOOKUP(A163,Itinerário!$A$3:$I$875,5,FALSE)","v":"OUTUBRO"},{"$f":"IF(VLOOKUP(A163,Itinerário!$A$3:$I$875,6,FALSE)=0,\"\",VLOOKUP(A163,Itinerário!$A$3:$I$875,6,FALSE))","v":""},"00:00:00",{"$f":"IF(VLOOKUP(A163,Itinerário!$A$3:$I$875,7,FALSE)=0,\"\",VLOOKUP(A163,Itinerário!$A$3:$I$875,7,FALSE))","v":""},{"$f":"IF(VLOOKUP(A163,Itinerário!$A$3:$I$875,8,FALSE)=0,\"\",VLOOKUP(A163,Itinerário!$A$3:$I$875,8,FALSE))","v":""},{"$f":"IF(VLOOKUP(A163,Itinerário!$A$3:$I$875,9,FALSE)=0,\"\",VLOOKUP(A163,Itinerário!$A$3:$I$875,9,FALSE))","v":""}]
[161,{"$f":"VLOOKUP(A164,Itinerário!$A$3:$I$875,3,FALSE)","v":"LUCIANO RODRIGO BARBOSA SANCHES"},{"$f":"VLOOKUP(A164,Itinerário!$A$3:$I$875,5,FALSE)","v":"NOVEMBRO"},{"$f":"IF(VLOOKUP(A164,Itinerário!$A$3:$I$875,6,FALSE)=0,\"\",VLOOKUP(A164,Itinerário!$A$3:$I$875,6,FALSE))","v":10},"2018-11-10",{"$f":"IF(VLOOKUP(A164,Itinerário!$A$3:$I$875,7,FALSE)=0,\"\",VLOOKUP(A164,Itinerário!$A$3:$I$875,7,FALSE))","v":"Impacto Criciuma"},{"$f":"IF(VLOOKUP(A164,Itinerário!$A$3:$I$875,8,FALSE)=0,\"\",VLOOKUP(A164,Itinerário!$A$3:$I$875,8,FALSE))","v":"AC"},{"$f":"IF(VLOOKUP(A164,Itinerário!$A$3:$I$875,9,FALSE)=0,\"\",VLOOKUP(A164,Itinerário!$A$3:$I$875,9,FALSE))","v":"AC"}]
[162,{"$f":"VLOOKUP(A165,Itinerário!$A$3:$I$875,3,FALSE)","v":"LUCIANO RODRIGO BARBOSA SANCHES"},{"$f":"VLOOKUP(A165,Itinerário!$A$3:$I$875,5,FALSE)","v":"NOVEMBRO"},{"$f":"IF(VLOOKUP(A165,Itinerário!$A$3:$I$875,6,FALSE)=0,\"\",VLOOKUP(A165,Itinerário!$A$3:$I$875,6,FALSE))","v":17},"2018-11-17",{"$f":"IF(VLOOKUP(A165,Itinerário!$A$3:$I$875,7,FALSE)=0,\"\",VLOOKUP(A165,Itinerário!$A$3:$I$875,7,FALSE))","v":"Campori de Jovens USB"},{"$f":"IF(VLOOKUP(A165,Itinerário!$A$3:$I$875,8,FALSE)=0,\"\",VLOOKUP(A165,Itinerário!$A$3:$I$875,8,FALSE))","v":"USB"},{"$f":"IF(VLOOKUP(A165,Itinerário!$A$3:$I$875,9,FALSE)=0,\"\",VLOOKUP(A165,Itinerário!$A$3:$I$875,9,FALSE))","v":"USB"}]
[163,{"$f":"VLOOKUP(A166,Itinerário!$A$3:$I$875,3,FALSE)","v":"LUCIANO RODRIGO BARBOSA SANCHES"},{"$f":"VLOOKUP(A166,Itinerário!$A$3:$I$875,5,FALSE)","v":"NOVEMBRO"},{"$f":"IF(VLOOKUP(A166,Itinerário!$A$3:$I$875,6,FALSE)=0,\"\",VLOOKUP(A166,Itinerário!$A$3:$I$875,6,FALSE))","v":24},"2018-11-24",{"$f":"IF(VLOOKUP(A166,Itinerário!$A$3:$I$875,7,FALSE)=0,\"\",VLOOKUP(A166,Itinerário!$A$3:$I$875,7,FALSE))","v":"Pregação e Visita Tesoureiro"},{"$f":"IF(VLOOKUP(A166,Itinerário!$A$3:$I$875,8,FALSE)=0,\"\",VLOOKUP(A166,Itinerário!$A$3:$I$875,8,FALSE))","v":"Criciúma"},{"$f":"IF(VLOOKUP(A166,Itinerário!$A$3:$I$875,9,FALSE)=0,\"\",VLOOKUP(A166,Itinerário!$A$3:$I$875,9,FALSE))","v":"Criciúma"}]
[164,{"$f":"VLOOKUP(A167,Itinerário!$A$3:$I$875,3,FALSE)","v":"LUCIANO RODRIGO BARBOSA SANCHES"},{"$f":"VLOOKUP(A167,Itinerário!$A$3:$I$875,5,FALSE)","v":"NOVEMBRO"},{"$f":"IF(VLOOKUP(A167,Itinerário!$A$3:$I$875,6,FALSE)=0,\"\",VLOOKUP(A167,Itinerário!$A$3:$I$875,6,FALSE))","v":""},"00:00:00",{"$f":"IF(VLOOKUP(A167,Itinerário!$A$3:$I$875,7,FALSE)=0,\"\",VLOOKUP(A167,Itinerário!$A$3:$I$875,7,FALSE))","v":""},{"$f":"IF(VLOOKUP(A167,Itinerário!$A$3:$I$875,8,FALSE)=0,\"\",VLOOKUP(A167,Itinerário!$A$3:$I$875,8,FALSE))","v":""},{"$f":"IF(VLOOKUP(A167,Itinerário!$A$3:$I$875,9,FALSE)=0,\"\",VLOOKUP(A167,Itinerário!$A$3:$I$875,9,FALSE))","v":""}]
[165,{"$f":"VLOOKUP(A168,Itinerário!$A$3:$I$875,3,FALSE)","v":"LUCIANO RODRIGO BARBOSA SANCHES"},{"$f":"VLOOKUP(A168,Itinerário!$A$3:$I$875,5,FALSE)","v":"NOVEMBRO"},{"$f":"IF(VLOOKUP(A168,Itinerário!$A$3:$I$875,6,FALSE)=0,\"\",VLOOKUP(A168,Itinerário!$A$3:$I$875,6,FALSE))","v":""},"00:00:00",{"$f":"IF(VLOOKUP(A168,Itinerário!$A$3:$I$875,7,FALSE)=0,\"\",VLOOKUP(A168,Itinerário!$A$3:$I$875,7,FALSE))","v":""},{"$f":"IF(VLOOKUP(A168,Itinerário!$A$3:$I$875,8,FALSE)=0,\"\",VLOOKUP(A168,Itinerário!$A$3:$I$875,8,FALSE))","v":""},{"$f":"IF(VLOOKUP(A168,Itinerário!$A$3:$I$875,9,FALSE)=0,\"\",VLOOKUP(A168,Itinerário!$A$3:$I$875,9,FALSE))","v":""}]
[166,{"$f":"VLOOKUP(A169,Itinerário!$A$3:$I$875,3,FALSE)","v":"LUCIANO RODRIGO BARBOSA SANCHES"},{"$f":"VLOOKUP(A169,Itinerário!$A$3:$I$875,5,FALSE)","v":"NOVEMBRO"},{"$f":"IF(VLOOKUP(A169,Itinerário!$A$3:$I$875,6,FALSE)=0,\"\",VLOOKUP(A169,Itinerário!$A$3:$I$875,6,FALSE))","v":""},"00:00:00",{"$f":"IF(VLOOKUP(A169,Itinerário!$A$3:$I$875,7,FALSE)=0,\"\",VLOOKUP(A169,Itinerário!$A$3:$I$875,7,FALSE))","v":""},{"$f":"IF(VLOOKUP(A169,Itinerário!$A$3:$I$875,8,FALSE)=0,\"\",VLOOKUP(A169,Itinerário!$A$3:$I$875,8,FALSE))","v":""},{"$f":"IF(VLOOKUP(A169,Itinerário!$A$3:$I$875,9,FALSE)=0,\"\",VLOOKUP(A169,Itinerário!$A$3:$I$875,9,FALSE))","v":""}]
[167,{"$f":"VLOOKUP(A170,Itinerário!$A$3:$I$875,3,FALSE)","v":"LUCIANO RODRIGO BARBOSA SANCHES"},{"$f":"VLOOKUP(A170,Itinerário!$A$3:$I$875,5,FALSE)","v":"NOVEMBRO"},{"$f":"IF(VLOOKUP(A170,Itinerário!$A$3:$I$875,6,FALSE)=0,\"\",VLOOKUP(A170,Itinerário!$A$3:$I$875,6,FALSE))","v":""},"00:00:00",{"$f":"IF(VLOOKUP(A170,Itinerário!$A$3:$I$875,7,FALSE)=0,\"\",VLOOKUP(A170,Itinerário!$A$3:$I$875,7,FALSE))","v":""},{"$f":"IF(VLOOKUP(A170,Itinerário!$A$3:$I$875,8,FALSE)=0,\"\",VLOOKUP(A170,Itinerário!$A$3:$I$875,8,FALSE))","v":""},{"$f":"IF(VLOOKUP(A170,Itinerário!$A$3:$I$875,9,FALSE)=0,\"\",VLOOKUP(A170,Itinerário!$A$3:$I$875,9,FALSE))","v":""}]
[168,{"$f":"VLOOKUP(A171,Itinerário!$A$3:$I$875,3,FALSE)","v":"LUCIANO RODRIGO BARBOSA SANCHES"},{"$f":"VLOOKUP(A171,Itinerário!$A$3:$I$875,5,FALSE)","v":"NOVEMBRO"},{"$f":"IF(VLOOKUP(A171,Itinerário!$A$3:$I$875,6,FALSE)=0,\"\",VLOOKUP(A171,Itinerário!$A$3:$I$875,6,FALSE))","v":""},"00:00:00",{"$f":"IF(VLOOKUP(A171,Itinerário!$A$3:$I$875,7,FALSE)=0,\"\",VLOOKUP(A171,Itinerário!$A$3:$I$875,7,FALSE))","v":""},{"$f":"IF(VLOOKUP(A171,Itinerário!$A$3:$I$875,8,FALSE)=0,\"\",VLOOKUP(A171,Itinerário!$A$3:$I$875,8,FALSE))","v":""},{"$f":"IF(VLOOKUP(A171,Itinerário!$A$3:$I$875,9,FALSE)=0,\"\",VLOOKUP(A171,Itinerário!$A$3:$I$875,9,FALSE))","v":""}]
[169,{"$f":"VLOOKUP(A172,Itinerário!$A$3:$I$875,3,FALSE)","v":"LUCIANO RODRIGO BARBOSA SANCHES"},{"$f":"VLOOKUP(A172,Itinerário!$A$3:$I$875,5,FALSE)","v":"NOVEMBRO"},{"$f":"IF(VLOOKUP(A172,Itinerário!$A$3:$I$875,6,FALSE)=0,\"\",VLOOKUP(A172,Itinerário!$A$3:$I$875,6,FALSE))","v":""},"00:00:00",{"$f":"IF(VLOOKUP(A172,Itinerário!$A$3:$I$875,7,FALSE)=0,\"\",VLOOKUP(A172,Itinerário!$A$3:$I$875,7,FALSE))","v":""},{"$f":"IF(VLOOKUP(A172,Itinerário!$A$3:$I$875,8,FALSE)=0,\"\",VLOOKUP(A172,Itinerário!$A$3:$I$875,8,FALSE))","v":""},{"$f":"IF(VLOOKUP(A172,Itinerário!$A$3:$I$875,9,FALSE)=0,\"\",VLOOKUP(A172,Itinerário!$A$3:$I$875,9,FALSE))","v":""}]
[170,{"$f":"VLOOKUP(A173,Itinerário!$A$3:$I$875,3,FALSE)","v":"LUCIANO RODRIGO BARBOSA SANCHES"},{"$f":"VLOOKUP(A173,Itinerário!$A$3:$I$875,5,FALSE)","v":"NOVEMBRO"},{"$f":"IF(VLOOKUP(A173,Itinerário!$A$3:$I$875,6,FALSE)=0,\"\",VLOOKUP(A173,Itinerário!$A$3:$I$875,6,FALSE))","v":""},"00:00:00",{"$f":"IF(VLOOKUP(A173,Itinerário!$A$3:$I$875,7,FALSE)=0,\"\",VLOOKUP(A173,Itinerário!$A$3:$I$875,7,FALSE))","v":""},{"$f":"IF(VLOOKUP(A173,Itinerário!$A$3:$I$875,8,FALSE)=0,\"\",VLOOKUP(A173,Itinerário!$A$3:$I$875,8,FALSE))","v":""},{"$f":"IF(VLOOKUP(A173,Itinerário!$A$3:$I$875,9,FALSE)=0,\"\",VLOOKUP(A173,Itinerário!$A$3:$I$875,9,FALSE))","v":""}]
[171,{"$f":"VLOOKUP(A174,Itinerário!$A$3:$I$875,3,FALSE)","v":"LUCIANO RODRIGO BARBOSA SANCHES"},{"$f":"VLOOKUP(A174,Itinerário!$A$3:$I$875,5,FALSE)","v":"DEZEMBRO"},{"$f":"IF(VLOOKUP(A174,Itinerário!$A$3:$I$875,6,FALSE)=0,\"\",VLOOKUP(A174,Itinerário!$A$3:$I$875,6,FALSE))","v":8},"2018-12-08",{"$f":"IF(VLOOKUP(A174,Itinerário!$A$3:$I$875,7,FALSE)=0,\"\",VLOOKUP(A174,Itinerário!$A$3:$I$875,7,FALSE))","v":"Pregação e Visita Tesoureiro"},{"$f":"IF(VLOOKUP(A174,Itinerário!$A$3:$I$875,8,FALSE)=0,\"\",VLOOKUP(A174,Itinerário!$A$3:$I$875,8,FALSE))","v":"Biguaçu"},{"$f":"IF(VLOOKUP(A174,Itinerário!$A$3:$I$875,9,FALSE)=0,\"\",VLOOKUP(A174,Itinerário!$A$3:$I$875,9,FALSE))","v":"Biguaçu"}]
[172,{"$f":"VLOOKUP(A175,Itinerário!$A$3:$I$875,3,FALSE)","v":"LUCIANO RODRIGO BARBOSA SANCHES"},{"$f":"VLOOKUP(A175,Itinerário!$A$3:$I$875,5,FALSE)","v":"DEZEMBRO"},{"$f":"IF(VLOOKUP(A175,Itinerário!$A$3:$I$875,6,FALSE)=0,\"\",VLOOKUP(A175,Itinerário!$A$3:$I$875,6,FALSE))","v":""},"00:00:00",{"$f":"IF(VLOOKUP(A175,Itinerário!$A$3:$I$875,7,FALSE)=0,\"\",VLOOKUP(A175,Itinerário!$A$3:$I$875,7,FALSE))","v":""},{"$f":"IF(VLOOKUP(A175,Itinerário!$A$3:$I$875,8,FALSE)=0,\"\",VLOOKUP(A175,Itinerário!$A$3:$I$875,8,FALSE))","v":""},{"$f":"IF(VLOOKUP(A175,Itinerário!$A$3:$I$875,9,FALSE)=0,\"\",VLOOKUP(A175,Itinerário!$A$3:$I$875,9,FALSE))","v":""}]
[173,{"$f":"VLOOKUP(A176,Itinerário!$A$3:$I$875,3,FALSE)","v":"LUCIANO RODRIGO BARBOSA SANCHES"},{"$f":"VLOOKUP(A176,Itinerário!$A$3:$I$875,5,FALSE)","v":"DEZEMBRO"},{"$f":"IF(VLOOKUP(A176,Itinerário!$A$3:$I$875,6,FALSE)=0,\"\",VLOOKUP(A176,Itinerário!$A$3:$I$875,6,FALSE))","v":""},"00:00:00",{"$f":"IF(VLOOKUP(A176,Itinerário!$A$3:$I$875,7,FALSE)=0,\"\",VLOOKUP(A176,Itinerário!$A$3:$I$875,7,FALSE))","v":""},{"$f":"IF(VLOOKUP(A176,Itinerário!$A$3:$I$875,8,FALSE)=0,\"\",VLOOKUP(A176,Itinerário!$A$3:$I$875,8,FALSE))","v":""},{"$f":"IF(VLOOKUP(A176,Itinerário!$A$3:$I$875,9,FALSE)=0,\"\",VLOOKUP(A176,Itinerário!$A$3:$I$875,9,FALSE))","v":""}]
[174,{"$f":"VLOOKUP(A177,Itinerário!$A$3:$I$875,3,FALSE)","v":"LUCIANO RODRIGO BARBOSA SANCHES"},{"$f":"VLOOKUP(A177,Itinerário!$A$3:$I$875,5,FALSE)","v":"DEZEMBRO"},{"$f":"IF(VLOOKUP(A177,Itinerário!$A$3:$I$875,6,FALSE)=0,\"\",VLOOKUP(A177,Itinerário!$A$3:$I$875,6,FALSE))","v":""},"00:00:00",{"$f":"IF(VLOOKUP(A177,Itinerário!$A$3:$I$875,7,FALSE)=0,\"\",VLOOKUP(A177,Itinerário!$A$3:$I$875,7,FALSE))","v":""},{"$f":"IF(VLOOKUP(A177,Itinerário!$A$3:$I$875,8,FALSE)=0,\"\",VLOOKUP(A177,Itinerário!$A$3:$I$875,8,FALSE))","v":""},{"$f":"IF(VLOOKUP(A177,Itinerário!$A$3:$I$875,9,FALSE)=0,\"\",VLOOKUP(A177,Itinerário!$A$3:$I$875,9,FALSE))","v":""}]
[175,{"$f":"VLOOKUP(A178,Itinerário!$A$3:$I$875,3,FALSE)","v":"LUCIANO RODRIGO BARBOSA SANCHES"},{"$f":"VLOOKUP(A178,Itinerário!$A$3:$I$875,5,FALSE)","v":"DEZEMBRO"},{"$f":"IF(VLOOKUP(A178,Itinerário!$A$3:$I$875,6,FALSE)=0,\"\",VLOOKUP(A178,Itinerário!$A$3:$I$875,6,FALSE))","v":""},"00:00:00",{"$f":"IF(VLOOKUP(A178,Itinerário!$A$3:$I$875,7,FALSE)=0,\"\",VLOOKUP(A178,Itinerário!$A$3:$I$875,7,FALSE))","v":""},{"$f":"IF(VLOOKUP(A178,Itinerário!$A$3:$I$875,8,FALSE)=0,\"\",VLOOKUP(A178,Itinerário!$A$3:$I$875,8,FALSE))","v":""},{"$f":"IF(VLOOKUP(A178,Itinerário!$A$3:$I$875,9,FALSE)=0,\"\",VLOOKUP(A178,Itinerário!$A$3:$I$875,9,FALSE))","v":""}]
[176,{"$f":"VLOOKUP(A179,Itinerário!$A$3:$I$875,3,FALSE)","v":"LUCIANO RODRIGO BARBOSA SANCHES"},{"$f":"VLOOKUP(A179,Itinerário!$A$3:$I$875,5,FALSE)","v":"DEZEMBRO"},{"$f":"IF(VLOOKUP(A179,Itinerário!$A$3:$I$875,6,FALSE)=0,\"\",VLOOKUP(A179,Itinerário!$A$3:$I$875,6,FALSE))","v":""},"00:00:00",{"$f":"IF(VLOOKUP(A179,Itinerário!$A$3:$I$875,7,FALSE)=0,\"\",VLOOKUP(A179,Itinerário!$A$3:$I$875,7,FALSE))","v":""},{"$f":"IF(VLOOKUP(A179,Itinerário!$A$3:$I$875,8,FALSE)=0,\"\",VLOOKUP(A179,Itinerário!$A$3:$I$875,8,FALSE))","v":""},{"$f":"IF(VLOOKUP(A179,Itinerário!$A$3:$I$875,9,FALSE)=0,\"\",VLOOKUP(A179,Itinerário!$A$3:$I$875,9,FALSE))","v":""}]
[177,{"$f":"VLOOKUP(A180,Itinerário!$A$3:$I$875,3,FALSE)","v":"LUCIANO RODRIGO BARBOSA SANCHES"},{"$f":"VLOOKUP(A180,Itinerário!$A$3:$I$875,5,FALSE)","v":"DEZEMBRO"},{"$f":"IF(VLOOKUP(A180,Itinerário!$A$3:$I$875,6,FALSE)=0,\"\",VLOOKUP(A180,Itinerário!$A$3:$I$875,6,FALSE))","v":""},"00:00:00",{"$f":"IF(VLOOKUP(A180,Itinerário!$A$3:$I$875,7,FALSE)=0,\"\",VLOOKUP(A180,Itinerário!$A$3:$I$875,7,FALSE))","v":""},{"$f":"IF(VLOOKUP(A180,Itinerário!$A$3:$I$875,8,FALSE)=0,\"\",VLOOKUP(A180,Itinerário!$A$3:$I$875,8,FALSE))","v":""},{"$f":"IF(VLOOKUP(A180,Itinerário!$A$3:$I$875,9,FALSE)=0,\"\",VLOOKUP(A180,Itinerário!$A$3:$I$875,9,FALSE))","v":""}]
[178,{"$f":"VLOOKUP(A181,Itinerário!$A$3:$I$875,3,FALSE)","v":"LUCIANO RODRIGO BARBOSA SANCHES"},{"$f":"VLOOKUP(A181,Itinerário!$A$3:$I$875,5,FALSE)","v":"DEZEMBRO"},{"$f":"IF(VLOOKUP(A181,Itinerário!$A$3:$I$875,6,FALSE)=0,\"\",VLOOKUP(A181,Itinerário!$A$3:$I$875,6,FALSE))","v":""},"00:00:00",{"$f":"IF(VLOOKUP(A181,Itinerário!$A$3:$I$875,7,FALSE)=0,\"\",VLOOKUP(A181,Itinerário!$A$3:$I$875,7,FALSE))","v":""},{"$f":"IF(VLOOKUP(A181,Itinerário!$A$3:$I$875,8,FALSE)=0,\"\",VLOOKUP(A181,Itinerário!$A$3:$I$875,8,FALSE))","v":""},{"$f":"IF(VLOOKUP(A181,Itinerário!$A$3:$I$875,9,FALSE)=0,\"\",VLOOKUP(A181,Itinerário!$A$3:$I$875,9,FALSE))","v":""}]
[179,{"$f":"VLOOKUP(A182,Itinerário!$A$3:$I$875,3,FALSE)","v":"LUCIANO RODRIGO BARBOSA SANCHES"},{"$f":"VLOOKUP(A182,Itinerário!$A$3:$I$875,5,FALSE)","v":"DEZEMBRO"},{"$f":"IF(VLOOKUP(A182,Itinerário!$A$3:$I$875,6,FALSE)=0,\"\",VLOOKUP(A182,Itinerário!$A$3:$I$875,6,FALSE))","v":""},"00:00:00",{"$f":"IF(VLOOKUP(A182,Itinerário!$A$3:$I$875,7,FALSE)=0,\"\",VLOOKUP(A182,Itinerário!$A$3:$I$875,7,FALSE))","v":""},{"$f":"IF(VLOOKUP(A182,Itinerário!$A$3:$I$875,8,FALSE)=0,\"\",VLOOKUP(A182,Itinerário!$A$3:$I$875,8,FALSE))","v":""},{"$f":"IF(VLOOKUP(A182,Itinerário!$A$3:$I$875,9,FALSE)=0,\"\",VLOOKUP(A182,Itinerário!$A$3:$I$875,9,FALSE))","v":""}]
[180,{"$f":"VLOOKUP(A183,Itinerário!$A$3:$I$875,3,FALSE)","v":"LUCIANO RODRIGO BARBOSA SANCHES"},{"$f":"VLOOKUP(A183,Itinerário!$A$3:$I$875,5,FALSE)","v":"DEZEMBRO"},{"$f":"IF(VLOOKUP(A183,Itinerário!$A$3:$I$875,6,FALSE)=0,\"\",VLOOKUP(A183,Itinerário!$A$3:$I$875,6,FALSE))","v":""},"00:00:00",{"$f":"IF(VLOOKUP(A183,Itinerário!$A$3:$I$875,7,FALSE)=0,\"\",VLOOKUP(A183,Itinerário!$A$3:$I$875,7,FALSE))","v":""},{"$f":"IF(VLOOKUP(A183,Itinerário!$A$3:$I$875,8,FALSE)=0,\"\",VLOOKUP(A183,Itinerário!$A$3:$I$875,8,FALSE))","v":""},{"$f":"IF(VLOOKUP(A183,Itinerário!$A$3:$I$875,9,FALSE)=0,\"\",VLOOKUP(A183,Itinerário!$A$3:$I$875,9,FALSE))","v":""}]
[181,{"$f":"VLOOKUP(A184,Itinerário!$A$3:$I$875,3,FALSE)","v":"DÉBORA MOROZ MARTINS ABRÁSCIO"},{"$f":"VLOOKUP(A184,Itinerário!$A$3:$I$875,5,FALSE)","v":"JULHO"},{"$f":"IF(VLOOKUP(A184,Itinerário!$A$3:$I$875,6,FALSE)=0,\"\",VLOOKUP(A184,Itinerário!$A$3:$I$875,6,FALSE))","v":7},"2018-07-07",{"$f":"IF(VLOOKUP(A184,Itinerário!$A$3:$I$875,7,FALSE)=0,\"\",VLOOKUP(A184,Itinerário!$A$3:$I$875,7,FALSE))","v":"Atendimento distrital MM e AFAM"},{"$f":"IF(VLOOKUP(A184,Itinerário!$A$3:$I$875,8,FALSE)=0,\"\",VLOOKUP(A184,Itinerário!$A$3:$I$875,8,FALSE))","v":"Santa Helena"},{"$f":"IF(VLOOKUP(A184,Itinerário!$A$3:$I$875,9,FALSE)=0,\"\",VLOOKUP(A184,Itinerário!$A$3:$I$875,9,FALSE))","v":"Santa Helena"}]
[182,{"$f":"VLOOKUP(A185,Itinerário!$A$3:$I$875,3,FALSE)","v":"DÉBORA MOROZ MARTINS ABRÁSCIO"},{"$f":"VLOOKUP(A185,Itinerário!$A$3:$I$875,5,FALSE)","v":"JULHO"},{"$f":"IF(VLOOKUP(A185,Itinerário!$A$3:$I$875,6,FALSE)=0,\"\",VLOOKUP(A185,Itinerário!$A$3:$I$875,6,FALSE))","v":14},"2018-07-14",{"$f":"IF(VLOOKUP(A185,Itinerário!$A$3:$I$875,7,FALSE)=0,\"\",VLOOKUP(A185,Itinerário!$A$3:$I$875,7,FALSE))","v":"Artendimento Distrital"},{"$f":"IF(VLOOKUP(A185,Itinerário!$A$3:$I$875,8,FALSE)=0,\"\",VLOOKUP(A185,Itinerário!$A$3:$I$875,8,FALSE))","v":"Rio Tavares"},{"$f":"IF(VLOOKUP(A185,Itinerário!$A$3:$I$875,9,FALSE)=0,\"\",VLOOKUP(A185,Itinerário!$A$3:$I$875,9,FALSE))","v":"Rio Tavares"}]
[183,{"$f":"VLOOKUP(A186,Itinerário!$A$3:$I$875,3,FALSE)","v":"DÉBORA MOROZ MARTINS ABRÁSCIO"},{"$f":"VLOOKUP(A186,Itinerário!$A$3:$I$875,5,FALSE)","v":"JULHO"},{"$f":"IF(VLOOKUP(A186,Itinerário!$A$3:$I$875,6,FALSE)=0,\"\",VLOOKUP(A186,Itinerário!$A$3:$I$875,6,FALSE))","v":"16-26"},"00:00:00",{"$f":"IF(VLOOKUP(A186,Itinerário!$A$3:$I$875,7,FALSE)=0,\"\",VLOOKUP(A186,Itinerário!$A$3:$I$875,7,FALSE))","v":"Férias"},{"$f":"IF(VLOOKUP(A186,Itinerário!$A$3:$I$875,8,FALSE)=0,\"\",VLOOKUP(A186,Itinerário!$A$3:$I$875,8,FALSE))","v":""},{"$f":"IF(VLOOKUP(A186,Itinerário!$A$3:$I$875,9,FALSE)=0,\"\",VLOOKUP(A186,Itinerário!$A$3:$I$875,9,FALSE))","v":""}]
[184,{"$f":"VLOOKUP(A187,Itinerário!$A$3:$I$875,3,FALSE)","v":"DÉBORA MOROZ MARTINS ABRÁSCIO"},{"$f":"VLOOKUP(A187,Itinerário!$A$3:$I$875,5,FALSE)","v":"JULHO"},{"$f":"IF(VLOOKUP(A187,Itinerário!$A$3:$I$875,6,FALSE)=0,\"\",VLOOKUP(A187,Itinerário!$A$3:$I$875,6,FALSE))","v":28},"2018-07-28",{"$f":"IF(VLOOKUP(A187,Itinerário!$A$3:$I$875,7,FALSE)=0,\"\",VLOOKUP(A187,Itinerário!$A$3:$I$875,7,FALSE))","v":"LIVRE"},{"$f":"IF(VLOOKUP(A187,Itinerário!$A$3:$I$875,8,FALSE)=0,\"\",VLOOKUP(A187,Itinerário!$A$3:$I$875,8,FALSE))","v":""},{"$f":"IF(VLOOKUP(A187,Itinerário!$A$3:$I$875,9,FALSE)=0,\"\",VLOOKUP(A187,Itinerário!$A$3:$I$875,9,FALSE))","v":""}]
[185,{"$f":"VLOOKUP(A188,Itinerário!$A$3:$I$875,3,FALSE)","v":"DÉBORA MOROZ MARTINS ABRÁSCIO"},{"$f":"VLOOKUP(A188,Itinerário!$A$3:$I$875,5,FALSE)","v":"JULHO"},{"$f":"IF(VLOOKUP(A188,Itinerário!$A$3:$I$875,6,FALSE)=0,\"\",VLOOKUP(A188,Itinerário!$A$3:$I$875,6,FALSE))","v":""},"00:00:00",{"$f":"IF(VLOOKUP(A188,Itinerário!$A$3:$I$875,7,FALSE)=0,\"\",VLOOKUP(A188,Itinerário!$A$3:$I$875,7,FALSE))","v":""},{"$f":"IF(VLOOKUP(A188,Itinerário!$A$3:$I$875,8,FALSE)=0,\"\",VLOOKUP(A188,Itinerário!$A$3:$I$875,8,FALSE))","v":""},{"$f":"IF(VLOOKUP(A188,Itinerário!$A$3:$I$875,9,FALSE)=0,\"\",VLOOKUP(A188,Itinerário!$A$3:$I$875,9,FALSE))","v":""}]
[186,{"$f":"VLOOKUP(A189,Itinerário!$A$3:$I$875,3,FALSE)","v":"DÉBORA MOROZ MARTINS ABRÁSCIO"},{"$f":"VLOOKUP(A189,Itinerário!$A$3:$I$875,5,FALSE)","v":"JULHO"},{"$f":"IF(VLOOKUP(A189,Itinerário!$A$3:$I$875,6,FALSE)=0,\"\",VLOOKUP(A189,Itinerário!$A$3:$I$875,6,FALSE))","v":""},"00:00:00",{"$f":"IF(VLOOKUP(A189,Itinerário!$A$3:$I$875,7,FALSE)=0,\"\",VLOOKUP(A189,Itinerário!$A$3:$I$875,7,FALSE))","v":""},{"$f":"IF(VLOOKUP(A189,Itinerário!$A$3:$I$875,8,FALSE)=0,\"\",VLOOKUP(A189,Itinerário!$A$3:$I$875,8,FALSE))","v":""},{"$f":"IF(VLOOKUP(A189,Itinerário!$A$3:$I$875,9,FALSE)=0,\"\",VLOOKUP(A189,Itinerário!$A$3:$I$875,9,FALSE))","v":""}]
[187,{"$f":"VLOOKUP(A190,Itinerário!$A$3:$I$875,3,FALSE)","v":"DÉBORA MOROZ MARTINS ABRÁSCIO"},{"$f":"VLOOKUP(A190,Itinerário!$A$3:$I$875,5,FALSE)","v":"JULHO"},{"$f":"IF(VLOOKUP(A190,Itinerário!$A$3:$I$875,6,FALSE)=0,\"\",VLOOKUP(A190,Itinerário!$A$3:$I$875,6,FALSE))","v":""},"00:00:00",{"$f":"IF(VLOOKUP(A190,Itinerário!$A$3:$I$875,7,FALSE)=0,\"\",VLOOKUP(A190,Itinerário!$A$3:$I$875,7,FALSE))","v":""},{"$f":"IF(VLOOKUP(A190,Itinerário!$A$3:$I$875,8,FALSE)=0,\"\",VLOOKUP(A190,Itinerário!$A$3:$I$875,8,FALSE))","v":""},{"$f":"IF(VLOOKUP(A190,Itinerário!$A$3:$I$875,9,FALSE)=0,\"\",VLOOKUP(A190,Itinerário!$A$3:$I$875,9,FALSE))","v":""}]
[188,{"$f":"VLOOKUP(A191,Itinerário!$A$3:$I$875,3,FALSE)","v":"DÉBORA MOROZ MARTINS ABRÁSCIO"},{"$f":"VLOOKUP(A191,Itinerário!$A$3:$I$875,5,FALSE)","v":"JULHO"},{"$f":"IF(VLOOKUP(A191,Itinerário!$A$3:$I$875,6,FALSE)=0,\"\",VLOOKUP(A191,Itinerário!$A$3:$I$875,6,FALSE))","v":""},"00:00:00",{"$f":"IF(VLOOKUP(A191,Itinerário!$A$3:$I$875,7,FALSE)=0,\"\",VLOOKUP(A191,Itinerário!$A$3:$I$875,7,FALSE))","v":""},{"$f":"IF(VLOOKUP(A191,Itinerário!$A$3:$I$875,8,FALSE)=0,\"\",VLOOKUP(A191,Itinerário!$A$3:$I$875,8,FALSE))","v":""},{"$f":"IF(VLOOKUP(A191,Itinerário!$A$3:$I$875,9,FALSE)=0,\"\",VLOOKUP(A191,Itinerário!$A$3:$I$875,9,FALSE))","v":""}]
[189,{"$f":"VLOOKUP(A192,Itinerário!$A$3:$I$875,3,FALSE)","v":"DÉBORA MOROZ MARTINS ABRÁSCIO"},{"$f":"VLOOKUP(A192,Itinerário!$A$3:$I$875,5,FALSE)","v":"JULHO"},{"$f":"IF(VLOOKUP(A192,Itinerário!$A$3:$I$875,6,FALSE)=0,\"\",VLOOKUP(A192,Itinerário!$A$3:$I$875,6,FALSE))","v":""},"00:00:00",{"$f":"IF(VLOOKUP(A192,Itinerário!$A$3:$I$875,7,FALSE)=0,\"\",VLOOKUP(A192,Itinerário!$A$3:$I$875,7,FALSE))","v":""},{"$f":"IF(VLOOKUP(A192,Itinerário!$A$3:$I$875,8,FALSE)=0,\"\",VLOOKUP(A192,Itinerário!$A$3:$I$875,8,FALSE))","v":""},{"$f":"IF(VLOOKUP(A192,Itinerário!$A$3:$I$875,9,FALSE)=0,\"\",VLOOKUP(A192,Itinerário!$A$3:$I$875,9,FALSE))","v":""}]
[190,{"$f":"VLOOKUP(A193,Itinerário!$A$3:$I$875,3,FALSE)","v":"DÉBORA MOROZ MARTINS ABRÁSCIO"},{"$f":"VLOOKUP(A193,Itinerário!$A$3:$I$875,5,FALSE)","v":"JULHO"},{"$f":"IF(VLOOKUP(A193,Itinerário!$A$3:$I$875,6,FALSE)=0,\"\",VLOOKUP(A193,Itinerário!$A$3:$I$875,6,FALSE))","v":""},"00:00:00",{"$f":"IF(VLOOKUP(A193,Itinerário!$A$3:$I$875,7,FALSE)=0,\"\",VLOOKUP(A193,Itinerário!$A$3:$I$875,7,FALSE))","v":""},{"$f":"IF(VLOOKUP(A193,Itinerário!$A$3:$I$875,8,FALSE)=0,\"\",VLOOKUP(A193,Itinerário!$A$3:$I$875,8,FALSE))","v":""},{"$f":"IF(VLOOKUP(A193,Itinerário!$A$3:$I$875,9,FALSE)=0,\"\",VLOOKUP(A193,Itinerário!$A$3:$I$875,9,FALSE))","v":""}]
[191,{"$f":"VLOOKUP(A194,Itinerário!$A$3:$I$875,3,FALSE)","v":"DÉBORA MOROZ MARTINS ABRÁSCIO"},{"$f":"VLOOKUP(A194,Itinerário!$A$3:$I$875,5,FALSE)","v":"AGOSTO"},{"$f":"IF(VLOOKUP(A194,Itinerário!$A$3:$I$875,6,FALSE)=0,\"\",VLOOKUP(A194,Itinerário!$A$3:$I$875,6,FALSE))","v":4},"2018-08-04",{"$f":"IF(VLOOKUP(A194,Itinerário!$A$3:$I$875,7,FALSE)=0,\"\",VLOOKUP(A194,Itinerário!$A$3:$I$875,7,FALSE))","v":"Retiro de Anciãos com esposas"},{"$f":"IF(VLOOKUP(A194,Itinerário!$A$3:$I$875,8,FALSE)=0,\"\",VLOOKUP(A194,Itinerário!$A$3:$I$875,8,FALSE))","v":"Revoredo"},{"$f":"IF(VLOOKUP(A194,Itinerário!$A$3:$I$875,9,FALSE)=0,\"\",VLOOKUP(A194,Itinerário!$A$3:$I$875,9,FALSE))","v":"Revoredo"}]
[192,{"$f":"VLOOKUP(A195,Itinerário!$A$3:$I$875,3,FALSE)","v":"DÉBORA MOROZ MARTINS ABRÁSCIO"},{"$f":"VLOOKUP(A195,Itinerário!$A$3:$I$875,5,FALSE)","v":"AGOSTO"},{"$f":"IF(VLOOKUP(A195,Itinerário!$A$3:$I$875,6,FALSE)=0,\"\",VLOOKUP(A195,Itinerário!$A$3:$I$875,6,FALSE))","v":5},"2018-08-05",{"$f":"IF(VLOOKUP(A195,Itinerário!$A$3:$I$875,7,FALSE)=0,\"\",VLOOKUP(A195,Itinerário!$A$3:$I$875,7,FALSE))","v":"Chá Evangelístico "},{"$f":"IF(VLOOKUP(A195,Itinerário!$A$3:$I$875,8,FALSE)=0,\"\",VLOOKUP(A195,Itinerário!$A$3:$I$875,8,FALSE))","v":"Sertão do Valongo"},{"$f":"IF(VLOOKUP(A195,Itinerário!$A$3:$I$875,9,FALSE)=0,\"\",VLOOKUP(A195,Itinerário!$A$3:$I$875,9,FALSE))","v":"Tijucas"}]
[193,{"$f":"VLOOKUP(A196,Itinerário!$A$3:$I$875,3,FALSE)","v":"DÉBORA MOROZ MARTINS ABRÁSCIO"},{"$f":"VLOOKUP(A196,Itinerário!$A$3:$I$875,5,FALSE)","v":"AGOSTO"},{"$f":"IF(VLOOKUP(A196,Itinerário!$A$3:$I$875,6,FALSE)=0,\"\",VLOOKUP(A196,Itinerário!$A$3:$I$875,6,FALSE))","v":11},{"$f":"IFERROR(DATE(RIGHT($B$2,4),VLOOKUP(C196,$J$4:$K$15,2,FALSE),D196),0)","v":"2018-08-11"},{"$f":"IF(VLOOKUP(A196,Itinerário!$A$3:$I$875,7,FALSE)=0,\"\",VLOOKUP(A196,Itinerário!$A$3:$I$875,7,FALSE))","v":"Atendimento Distrital (Gravatá e Escalvados)"},{"$f":"IF(VLOOKUP(A196,Itinerário!$A$3:$I$875,8,FALSE)=0,\"\",VLOOKUP(A196,Itinerário!$A$3:$I$875,8,FALSE))","v":"Gravatá"},{"$f":"IF(VLOOKUP(A196,Itinerário!$A$3:$I$875,9,FALSE)=0,\"\",VLOOKUP(A196,Itinerário!$A$3:$I$875,9,FALSE))","v":"Navegantes"}]
[194,{"$f":"VLOOKUP(A197,Itinerário!$A$3:$I$875,3,FALSE)","v":"DÉBORA MOROZ MARTINS ABRÁSCIO"},{"$f":"VLOOKUP(A197,Itinerário!$A$3:$I$875,5,FALSE)","v":"AGOSTO"},{"$f":"IF(VLOOKUP(A197,Itinerário!$A$3:$I$875,6,FALSE)=0,\"\",VLOOKUP(A197,Itinerário!$A$3:$I$875,6,FALSE))","v":13},"2018-08-13",{"$f":"IF(VLOOKUP(A197,Itinerário!$A$3:$I$875,7,FALSE)=0,\"\",VLOOKUP(A197,Itinerário!$A$3:$I$875,7,FALSE))","v":"PGESP Região Capital"},{"$f":"IF(VLOOKUP(A197,Itinerário!$A$3:$I$875,8,FALSE)=0,\"\",VLOOKUP(A197,Itinerário!$A$3:$I$875,8,FALSE))","v":"AC"},{"$f":"IF(VLOOKUP(A197,Itinerário!$A$3:$I$875,9,FALSE)=0,\"\",VLOOKUP(A197,Itinerário!$A$3:$I$875,9,FALSE))","v":"AC"}]
[195,{"$f":"VLOOKUP(A198,Itinerário!$A$3:$I$875,3,FALSE)","v":"DÉBORA MOROZ MARTINS ABRÁSCIO"},{"$f":"VLOOKUP(A198,Itinerário!$A$3:$I$875,5,FALSE)","v":"AGOSTO"},{"$f":"IF(VLOOKUP(A198,Itinerário!$A$3:$I$875,6,FALSE)=0,\"\",VLOOKUP(A198,Itinerário!$A$3:$I$875,6,FALSE))","v":14},"2018-08-14",{"$f":"IF(VLOOKUP(A198,Itinerário!$A$3:$I$875,7,FALSE)=0,\"\",VLOOKUP(A198,Itinerário!$A$3:$I$875,7,FALSE))","v":"PGESP Região Serra"},{"$f":"IF(VLOOKUP(A198,Itinerário!$A$3:$I$875,8,FALSE)=0,\"\",VLOOKUP(A198,Itinerário!$A$3:$I$875,8,FALSE))","v":"AC"},{"$f":"IF(VLOOKUP(A198,Itinerário!$A$3:$I$875,9,FALSE)=0,\"\",VLOOKUP(A198,Itinerário!$A$3:$I$875,9,FALSE))","v":"AC"}]
[196,{"$f":"VLOOKUP(A199,Itinerário!$A$3:$I$875,3,FALSE)","v":"DÉBORA MOROZ MARTINS ABRÁSCIO"},{"$f":"VLOOKUP(A199,Itinerário!$A$3:$I$875,5,FALSE)","v":"AGOSTO"},{"$f":"IF(VLOOKUP(A199,Itinerário!$A$3:$I$875,6,FALSE)=0,\"\",VLOOKUP(A199,Itinerário!$A$3:$I$875,6,FALSE))","v":15},"2018-08-15",{"$f":"IF(VLOOKUP(A199,Itinerário!$A$3:$I$875,7,FALSE)=0,\"\",VLOOKUP(A199,Itinerário!$A$3:$I$875,7,FALSE))","v":"PGESP Região Sul"},{"$f":"IF(VLOOKUP(A199,Itinerário!$A$3:$I$875,8,FALSE)=0,\"\",VLOOKUP(A199,Itinerário!$A$3:$I$875,8,FALSE))","v":"AC"},{"$f":"IF(VLOOKUP(A199,Itinerário!$A$3:$I$875,9,FALSE)=0,\"\",VLOOKUP(A199,Itinerário!$A$3:$I$875,9,FALSE))","v":"AC"}]
[197,{"$f":"VLOOKUP(A200,Itinerário!$A$3:$I$875,3,FALSE)","v":"DÉBORA MOROZ MARTINS ABRÁSCIO"},{"$f":"VLOOKUP(A200,Itinerário!$A$3:$I$875,5,FALSE)","v":"AGOSTO"},{"$f":"IF(VLOOKUP(A200,Itinerário!$A$3:$I$875,6,FALSE)=0,\"\",VLOOKUP(A200,Itinerário!$A$3:$I$875,6,FALSE))","v":16},"2018-08-16",{"$f":"IF(VLOOKUP(A200,Itinerário!$A$3:$I$875,7,FALSE)=0,\"\",VLOOKUP(A200,Itinerário!$A$3:$I$875,7,FALSE))","v":"PGESP Região Norte"},{"$f":"IF(VLOOKUP(A200,Itinerário!$A$3:$I$875,8,FALSE)=0,\"\",VLOOKUP(A200,Itinerário!$A$3:$I$875,8,FALSE))","v":"AC"},{"$f":"IF(VLOOKUP(A200,Itinerário!$A$3:$I$875,9,FALSE)=0,\"\",VLOOKUP(A200,Itinerário!$A$3:$I$875,9,FALSE))","v":"AC"}]
[198,{"$f":"VLOOKUP(A201,Itinerário!$A$3:$I$875,3,FALSE)","v":"DÉBORA MOROZ MARTINS ABRÁSCIO"},{"$f":"VLOOKUP(A201,Itinerário!$A$3:$I$875,5,FALSE)","v":"AGOSTO"},{"$f":"IF(VLOOKUP(A201,Itinerário!$A$3:$I$875,6,FALSE)=0,\"\",VLOOKUP(A201,Itinerário!$A$3:$I$875,6,FALSE))","v":18},"2018-08-18",{"$f":"IF(VLOOKUP(A201,Itinerário!$A$3:$I$875,7,FALSE)=0,\"\",VLOOKUP(A201,Itinerário!$A$3:$I$875,7,FALSE))","v":"Congresso MM Região Serra"},{"$f":"IF(VLOOKUP(A201,Itinerário!$A$3:$I$875,8,FALSE)=0,\"\",VLOOKUP(A201,Itinerário!$A$3:$I$875,8,FALSE))","v":""},{"$f":"IF(VLOOKUP(A201,Itinerário!$A$3:$I$875,9,FALSE)=0,\"\",VLOOKUP(A201,Itinerário!$A$3:$I$875,9,FALSE))","v":"Bom Retiro"}]
[199,{"$f":"VLOOKUP(A202,Itinerário!$A$3:$I$875,3,FALSE)","v":"DÉBORA MOROZ MARTINS ABRÁSCIO"},{"$f":"VLOOKUP(A202,Itinerário!$A$3:$I$875,5,FALSE)","v":"AGOSTO"},{"$f":"IF(VLOOKUP(A202,Itinerário!$A$3:$I$875,6,FALSE)=0,\"\",VLOOKUP(A202,Itinerário!$A$3:$I$875,6,FALSE))","v":25},"2018-08-25",{"$f":"IF(VLOOKUP(A202,Itinerário!$A$3:$I$875,7,FALSE)=0,\"\",VLOOKUP(A202,Itinerário!$A$3:$I$875,7,FALSE))","v":"Sermão QS e atendimento distrital"},{"$f":"IF(VLOOKUP(A202,Itinerário!$A$3:$I$875,8,FALSE)=0,\"\",VLOOKUP(A202,Itinerário!$A$3:$I$875,8,FALSE))","v":"Campinas"},{"$f":"IF(VLOOKUP(A202,Itinerário!$A$3:$I$875,9,FALSE)=0,\"\",VLOOKUP(A202,Itinerário!$A$3:$I$875,9,FALSE))","v":"Campinas"}]
[200,{"$f":"VLOOKUP(A203,Itinerário!$A$3:$I$875,3,FALSE)","v":"DÉBORA MOROZ MARTINS ABRÁSCIO"},{"$f":"VLOOKUP(A203,Itinerário!$A$3:$I$875,5,FALSE)","v":"AGOSTO"},{"$f":"IF(VLOOKUP(A203,Itinerário!$A$3:$I$875,6,FALSE)=0,\"\",VLOOKUP(A203,Itinerário!$A$3:$I$875,6,FALSE))","v":""},"00:00:00",{"$f":"IF(VLOOKUP(A203,Itinerário!$A$3:$I$875,7,FALSE)=0,\"\",VLOOKUP(A203,Itinerário!$A$3:$I$875,7,FALSE))","v":""},{"$f":"IF(VLOOKUP(A203,Itinerário!$A$3:$I$875,8,FALSE)=0,\"\",VLOOKUP(A203,Itinerário!$A$3:$I$875,8,FALSE))","v":""},{"$f":"IF(VLOOKUP(A203,Itinerário!$A$3:$I$875,9,FALSE)=0,\"\",VLOOKUP(A203,Itinerário!$A$3:$I$875,9,FALSE))","v":""}]
[201,{"$f":"VLOOKUP(A204,Itinerário!$A$3:$I$875,3,FALSE)","v":"DÉBORA MOROZ MARTINS ABRÁSCIO"},{"$f":"VLOOKUP(A204,Itinerário!$A$3:$I$875,5,FALSE)","v":"SETEMBRO"},{"$f":"IF(VLOOKUP(A204,Itinerário!$A$3:$I$875,6,FALSE)=0,\"\",VLOOKUP(A204,Itinerário!$A$3:$I$875,6,FALSE))","v":1},"2018-09-01",{"$f":"IF(VLOOKUP(A204,Itinerário!$A$3:$I$875,7,FALSE)=0,\"\",VLOOKUP(A204,Itinerário!$A$3:$I$875,7,FALSE))","v":"Atendimento distrital "},{"$f":"IF(VLOOKUP(A204,Itinerário!$A$3:$I$875,8,FALSE)=0,\"\",VLOOKUP(A204,Itinerário!$A$3:$I$875,8,FALSE))","v":"Areias do Meio"},{"$f":"IF(VLOOKUP(A204,Itinerário!$A$3:$I$875,9,FALSE)=0,\"\",VLOOKUP(A204,Itinerário!$A$3:$I$875,9,FALSE))","v":"Biguaçu"}]
[202,{"$f":"VLOOKUP(A205,Itinerário!$A$3:$I$875,3,FALSE)","v":"DÉBORA MOROZ MARTINS ABRÁSCIO"},{"$f":"VLOOKUP(A205,Itinerário!$A$3:$I$875,5,FALSE)","v":"SETEMBRO"},{"$f":"IF(VLOOKUP(A205,Itinerário!$A$3:$I$875,6,FALSE)=0,\"\",VLOOKUP(A205,Itinerário!$A$3:$I$875,6,FALSE))","v":"06 à 09"},"00:00:00",{"$f":"IF(VLOOKUP(A205,Itinerário!$A$3:$I$875,7,FALSE)=0,\"\",VLOOKUP(A205,Itinerário!$A$3:$I$875,7,FALSE))","v":"Concílio Filhos de Obreiros USB"},{"$f":"IF(VLOOKUP(A205,Itinerário!$A$3:$I$875,8,FALSE)=0,\"\",VLOOKUP(A205,Itinerário!$A$3:$I$875,8,FALSE))","v":"CATRE"},{"$f":"IF(VLOOKUP(A205,Itinerário!$A$3:$I$875,9,FALSE)=0,\"\",VLOOKUP(A205,Itinerário!$A$3:$I$875,9,FALSE))","v":"CATRE"}]
[203,{"$f":"VLOOKUP(A206,Itinerário!$A$3:$I$875,3,FALSE)","v":"DÉBORA MOROZ MARTINS ABRÁSCIO"},{"$f":"VLOOKUP(A206,Itinerário!$A$3:$I$875,5,FALSE)","v":"SETEMBRO"},{"$f":"IF(VLOOKUP(A206,Itinerário!$A$3:$I$875,6,FALSE)=0,\"\",VLOOKUP(A206,Itinerário!$A$3:$I$875,6,FALSE))","v":15},"2018-09-15",{"$f":"IF(VLOOKUP(A206,Itinerário!$A$3:$I$875,7,FALSE)=0,\"\",VLOOKUP(A206,Itinerário!$A$3:$I$875,7,FALSE))","v":"LIVRE"},{"$f":"IF(VLOOKUP(A206,Itinerário!$A$3:$I$875,8,FALSE)=0,\"\",VLOOKUP(A206,Itinerário!$A$3:$I$875,8,FALSE))","v":""},{"$f":"IF(VLOOKUP(A206,Itinerário!$A$3:$I$875,9,FALSE)=0,\"\",VLOOKUP(A206,Itinerário!$A$3:$I$875,9,FALSE))","v":""}]
[204,{"$f":"VLOOKUP(A207,Itinerário!$A$3:$I$875,3,FALSE)","v":"DÉBORA MOROZ MARTINS ABRÁSCIO"},{"$f":"VLOOKUP(A207,Itinerário!$A$3:$I$875,5,FALSE)","v":"SETEMBRO"},{"$f":"IF(VLOOKUP(A207,Itinerário!$A$3:$I$875,6,FALSE)=0,\"\",VLOOKUP(A207,Itinerário!$A$3:$I$875,6,FALSE))","v":18},"2018-09-18",{"$f":"IF(VLOOKUP(A207,Itinerário!$A$3:$I$875,7,FALSE)=0,\"\",VLOOKUP(A207,Itinerário!$A$3:$I$875,7,FALSE))","v":"PGCD junto com PGP  Região Serra 12h"},{"$f":"IF(VLOOKUP(A207,Itinerário!$A$3:$I$875,8,FALSE)=0,\"\",VLOOKUP(A207,Itinerário!$A$3:$I$875,8,FALSE))","v":"AC"},{"$f":"IF(VLOOKUP(A207,Itinerário!$A$3:$I$875,9,FALSE)=0,\"\",VLOOKUP(A207,Itinerário!$A$3:$I$875,9,FALSE))","v":"AC"}]
[205,{"$f":"VLOOKUP(A208,Itinerário!$A$3:$I$875,3,FALSE)","v":"DÉBORA MOROZ MARTINS ABRÁSCIO"},{"$f":"VLOOKUP(A208,Itinerário!$A$3:$I$875,5,FALSE)","v":"SETEMBRO"},{"$f":"IF(VLOOKUP(A208,Itinerário!$A$3:$I$875,6,FALSE)=0,\"\",VLOOKUP(A208,Itinerário!$A$3:$I$875,6,FALSE))","v":19},"2018-09-19",{"$f":"IF(VLOOKUP(A208,Itinerário!$A$3:$I$875,7,FALSE)=0,\"\",VLOOKUP(A208,Itinerário!$A$3:$I$875,7,FALSE))","v":"PGCD junto com PGP Região Sul 9h"},{"$f":"IF(VLOOKUP(A208,Itinerário!$A$3:$I$875,8,FALSE)=0,\"\",VLOOKUP(A208,Itinerário!$A$3:$I$875,8,FALSE))","v":"AC"},{"$f":"IF(VLOOKUP(A208,Itinerário!$A$3:$I$875,9,FALSE)=0,\"\",VLOOKUP(A208,Itinerário!$A$3:$I$875,9,FALSE))","v":"AC"}]
[206,{"$f":"VLOOKUP(A209,Itinerário!$A$3:$I$875,3,FALSE)","v":"DÉBORA MOROZ MARTINS ABRÁSCIO"},{"$f":"VLOOKUP(A209,Itinerário!$A$3:$I$875,5,FALSE)","v":"SETEMBRO"},{"$f":"IF(VLOOKUP(A209,Itinerário!$A$3:$I$875,6,FALSE)=0,\"\",VLOOKUP(A209,Itinerário!$A$3:$I$875,6,FALSE))","v":20},"2018-09-20",{"$f":"IF(VLOOKUP(A209,Itinerário!$A$3:$I$875,7,FALSE)=0,\"\",VLOOKUP(A209,Itinerário!$A$3:$I$875,7,FALSE))","v":"PGCD junto com PGP  Região Capital 9h"},{"$f":"IF(VLOOKUP(A209,Itinerário!$A$3:$I$875,8,FALSE)=0,\"\",VLOOKUP(A209,Itinerário!$A$3:$I$875,8,FALSE))","v":"AC"},{"$f":"IF(VLOOKUP(A209,Itinerário!$A$3:$I$875,9,FALSE)=0,\"\",VLOOKUP(A209,Itinerário!$A$3:$I$875,9,FALSE))","v":"AC"}]
[207,{"$f":"VLOOKUP(A210,Itinerário!$A$3:$I$875,3,FALSE)","v":"DÉBORA MOROZ MARTINS ABRÁSCIO"},{"$f":"VLOOKUP(A210,Itinerário!$A$3:$I$875,5,FALSE)","v":"SETEMBRO"},{"$f":"IF(VLOOKUP(A210,Itinerário!$A$3:$I$875,6,FALSE)=0,\"\",VLOOKUP(A210,Itinerário!$A$3:$I$875,6,FALSE))","v":20},"2018-09-20",{"$f":"IF(VLOOKUP(A210,Itinerário!$A$3:$I$875,7,FALSE)=0,\"\",VLOOKUP(A210,Itinerário!$A$3:$I$875,7,FALSE))","v":"PGCD junto com PGP Região Norte 15h"},{"$f":"IF(VLOOKUP(A210,Itinerário!$A$3:$I$875,8,FALSE)=0,\"\",VLOOKUP(A210,Itinerário!$A$3:$I$875,8,FALSE))","v":"AC"},{"$f":"IF(VLOOKUP(A210,Itinerário!$A$3:$I$875,9,FALSE)=0,\"\",VLOOKUP(A210,Itinerário!$A$3:$I$875,9,FALSE))","v":"AC"}]
[208,{"$f":"VLOOKUP(A211,Itinerário!$A$3:$I$875,3,FALSE)","v":"DÉBORA MOROZ MARTINS ABRÁSCIO"},{"$f":"VLOOKUP(A211,Itinerário!$A$3:$I$875,5,FALSE)","v":"SETEMBRO"},{"$f":"IF(VLOOKUP(A211,Itinerário!$A$3:$I$875,6,FALSE)=0,\"\",VLOOKUP(A211,Itinerário!$A$3:$I$875,6,FALSE))","v":22},"2018-09-22",{"$f":"IF(VLOOKUP(A211,Itinerário!$A$3:$I$875,7,FALSE)=0,\"\",VLOOKUP(A211,Itinerário!$A$3:$I$875,7,FALSE))","v":"Pregação "},{"$f":"IF(VLOOKUP(A211,Itinerário!$A$3:$I$875,8,FALSE)=0,\"\",VLOOKUP(A211,Itinerário!$A$3:$I$875,8,FALSE))","v":"Roçado"},{"$f":"IF(VLOOKUP(A211,Itinerário!$A$3:$I$875,9,FALSE)=0,\"\",VLOOKUP(A211,Itinerário!$A$3:$I$875,9,FALSE))","v":"Jardim Atlântico"}]
[209,{"$f":"VLOOKUP(A212,Itinerário!$A$3:$I$875,3,FALSE)","v":"DÉBORA MOROZ MARTINS ABRÁSCIO"},{"$f":"VLOOKUP(A212,Itinerário!$A$3:$I$875,5,FALSE)","v":"SETEMBRO"},{"$f":"IF(VLOOKUP(A212,Itinerário!$A$3:$I$875,6,FALSE)=0,\"\",VLOOKUP(A212,Itinerário!$A$3:$I$875,6,FALSE))","v":22},"2018-09-22",{"$f":"IF(VLOOKUP(A212,Itinerário!$A$3:$I$875,7,FALSE)=0,\"\",VLOOKUP(A212,Itinerário!$A$3:$I$875,7,FALSE))","v":"Pregação - Encontro com esposa de anciãos e Amigos de fé"},{"$f":"IF(VLOOKUP(A212,Itinerário!$A$3:$I$875,8,FALSE)=0,\"\",VLOOKUP(A212,Itinerário!$A$3:$I$875,8,FALSE))","v":"Jardim Atlântico"},{"$f":"IF(VLOOKUP(A212,Itinerário!$A$3:$I$875,9,FALSE)=0,\"\",VLOOKUP(A212,Itinerário!$A$3:$I$875,9,FALSE))","v":"Jardim Atlântico"}]
[210,{"$f":"VLOOKUP(A213,Itinerário!$A$3:$I$875,3,FALSE)","v":"DÉBORA MOROZ MARTINS ABRÁSCIO"},{"$f":"VLOOKUP(A213,Itinerário!$A$3:$I$875,5,FALSE)","v":"SETEMBRO"},{"$f":"IF(VLOOKUP(A213,Itinerário!$A$3:$I$875,6,FALSE)=0,\"\",VLOOKUP(A213,Itinerário!$A$3:$I$875,6,FALSE))","v":29},"2018-09-29",{"$f":"IF(VLOOKUP(A213,Itinerário!$A$3:$I$875,7,FALSE)=0,\"\",VLOOKUP(A213,Itinerário!$A$3:$I$875,7,FALSE))","v":"Pregação"},{"$f":"IF(VLOOKUP(A213,Itinerário!$A$3:$I$875,8,FALSE)=0,\"\",VLOOKUP(A213,Itinerário!$A$3:$I$875,8,FALSE))","v":"Sambaqui"},{"$f":"IF(VLOOKUP(A213,Itinerário!$A$3:$I$875,9,FALSE)=0,\"\",VLOOKUP(A213,Itinerário!$A$3:$I$875,9,FALSE))","v":"Universitario"}]
[211,{"$f":"VLOOKUP(A214,Itinerário!$A$3:$I$875,3,FALSE)","v":"DÉBORA MOROZ MARTINS ABRÁSCIO"},{"$f":"VLOOKUP(A214,Itinerário!$A$3:$I$875,5,FALSE)","v":"OUTUBRO"},{"$f":"IF(VLOOKUP(A214,Itinerário!$A$3:$I$875,6,FALSE)=0,\"\",VLOOKUP(A214,Itinerário!$A$3:$I$875,6,FALSE))","v":6},"2018-10-06",{"$f":"IF(VLOOKUP(A214,Itinerário!$A$3:$I$875,7,FALSE)=0,\"\",VLOOKUP(A214,Itinerário!$A$3:$I$875,7,FALSE))","v":"Programa Educação"},{"$f":"IF(VLOOKUP(A214,Itinerário!$A$3:$I$875,8,FALSE)=0,\"\",VLOOKUP(A214,Itinerário!$A$3:$I$875,8,FALSE))","v":"AC"},{"$f":"IF(VLOOKUP(A214,Itinerário!$A$3:$I$875,9,FALSE)=0,\"\",VLOOKUP(A214,Itinerário!$A$3:$I$875,9,FALSE))","v":"AC"}]
[212,{"$f":"VLOOKUP(A215,Itinerário!$A$3:$I$875,3,FALSE)","v":"DÉBORA MOROZ MARTINS ABRÁSCIO"},{"$f":"VLOOKUP(A215,Itinerário!$A$3:$I$875,5,FALSE)","v":"OUTUBRO"},{"$f":"IF(VLOOKUP(A215,Itinerário!$A$3:$I$875,6,FALSE)=0,\"\",VLOOKUP(A215,Itinerário!$A$3:$I$875,6,FALSE))","v":13},"2018-10-13",{"$f":"IF(VLOOKUP(A215,Itinerário!$A$3:$I$875,7,FALSE)=0,\"\",VLOOKUP(A215,Itinerário!$A$3:$I$875,7,FALSE))","v":"LIVRE"},{"$f":"IF(VLOOKUP(A215,Itinerário!$A$3:$I$875,8,FALSE)=0,\"\",VLOOKUP(A215,Itinerário!$A$3:$I$875,8,FALSE))","v":""},{"$f":"IF(VLOOKUP(A215,Itinerário!$A$3:$I$875,9,FALSE)=0,\"\",VLOOKUP(A215,Itinerário!$A$3:$I$875,9,FALSE))","v":""}]
[213,{"$f":"VLOOKUP(A216,Itinerário!$A$3:$I$875,3,FALSE)","v":"DÉBORA MOROZ MARTINS ABRÁSCIO"},{"$f":"VLOOKUP(A216,Itinerário!$A$3:$I$875,5,FALSE)","v":"OUTUBRO"},{"$f":"IF(VLOOKUP(A216,Itinerário!$A$3:$I$875,6,FALSE)=0,\"\",VLOOKUP(A216,Itinerário!$A$3:$I$875,6,FALSE))","v":16},"2018-10-16",{"$f":"IF(VLOOKUP(A216,Itinerário!$A$3:$I$875,7,FALSE)=0,\"\",VLOOKUP(A216,Itinerário!$A$3:$I$875,7,FALSE))","v":"PGESP Região Serra"},{"$f":"IF(VLOOKUP(A216,Itinerário!$A$3:$I$875,8,FALSE)=0,\"\",VLOOKUP(A216,Itinerário!$A$3:$I$875,8,FALSE))","v":"AC"},{"$f":"IF(VLOOKUP(A216,Itinerário!$A$3:$I$875,9,FALSE)=0,\"\",VLOOKUP(A216,Itinerário!$A$3:$I$875,9,FALSE))","v":"AC"}]
[214,{"$f":"VLOOKUP(A217,Itinerário!$A$3:$I$875,3,FALSE)","v":"DÉBORA MOROZ MARTINS ABRÁSCIO"},{"$f":"VLOOKUP(A217,Itinerário!$A$3:$I$875,5,FALSE)","v":"OUTUBRO"},{"$f":"IF(VLOOKUP(A217,Itinerário!$A$3:$I$875,6,FALSE)=0,\"\",VLOOKUP(A217,Itinerário!$A$3:$I$875,6,FALSE))","v":16},"2018-10-16",{"$f":"IF(VLOOKUP(A217,Itinerário!$A$3:$I$875,7,FALSE)=0,\"\",VLOOKUP(A217,Itinerário!$A$3:$I$875,7,FALSE))","v":"PGESP Região Capital"},{"$f":"IF(VLOOKUP(A217,Itinerário!$A$3:$I$875,8,FALSE)=0,\"\",VLOOKUP(A217,Itinerário!$A$3:$I$875,8,FALSE))","v":"AC"},{"$f":"IF(VLOOKUP(A217,Itinerário!$A$3:$I$875,9,FALSE)=0,\"\",VLOOKUP(A217,Itinerário!$A$3:$I$875,9,FALSE))","v":"AC"}]
[215,{"$f":"VLOOKUP(A218,Itinerário!$A$3:$I$875,3,FALSE)","v":"DÉBORA MOROZ MARTINS ABRÁSCIO"},{"$f":"VLOOKUP(A218,Itinerário!$A$3:$I$875,5,FALSE)","v":"OUTUBRO"},{"$f":"IF(VLOOKUP(A218,Itinerário!$A$3:$I$875,6,FALSE)=0,\"\",VLOOKUP(A218,Itinerário!$A$3:$I$875,6,FALSE))","v":17},"2018-10-17",{"$f":"IF(VLOOKUP(A218,Itinerário!$A$3:$I$875,7,FALSE)=0,\"\",VLOOKUP(A218,Itinerário!$A$3:$I$875,7,FALSE))","v":"PGESP Região Sul"},{"$f":"IF(VLOOKUP(A218,Itinerário!$A$3:$I$875,8,FALSE)=0,\"\",VLOOKUP(A218,Itinerário!$A$3:$I$875,8,FALSE))","v":"AC"},{"$f":"IF(VLOOKUP(A218,Itinerário!$A$3:$I$875,9,FALSE)=0,\"\",VLOOKUP(A218,Itinerário!$A$3:$I$875,9,FALSE))","v":"AC"}]
[216,{"$f":"VLOOKUP(A219,Itinerário!$A$3:$I$875,3,FALSE)","v":"DÉBORA MOROZ MARTINS ABRÁSCIO"},{"$f":"VLOOKUP(A219,Itinerário!$A$3:$I$875,5,FALSE)","v":"OUTUBRO"},{"$f":"IF(VLOOKUP(A219,Itinerário!$A$3:$I$875,6,FALSE)=0,\"\",VLOOKUP(A219,Itinerário!$A$3:$I$875,6,FALSE))","v":18},"2018-10-18",{"$f":"IF(VLOOKUP(A219,Itinerário!$A$3:$I$875,7,FALSE)=0,\"\",VLOOKUP(A219,Itinerário!$A$3:$I$875,7,FALSE))","v":"PGESP Região Norte"},{"$f":"IF(VLOOKUP(A219,Itinerário!$A$3:$I$875,8,FALSE)=0,\"\",VLOOKUP(A219,Itinerário!$A$3:$I$875,8,FALSE))","v":"AC"},{"$f":"IF(VLOOKUP(A219,Itinerário!$A$3:$I$875,9,FALSE)=0,\"\",VLOOKUP(A219,Itinerário!$A$3:$I$875,9,FALSE))","v":"AC"}]
[217,{"$f":"VLOOKUP(A220,Itinerário!$A$3:$I$875,3,FALSE)","v":"DÉBORA MOROZ MARTINS ABRÁSCIO"},{"$f":"VLOOKUP(A220,Itinerário!$A$3:$I$875,5,FALSE)","v":"OUTUBRO"},{"$f":"IF(VLOOKUP(A220,Itinerário!$A$3:$I$875,6,FALSE)=0,\"\",VLOOKUP(A220,Itinerário!$A$3:$I$875,6,FALSE))","v":20},"2018-10-20",{"$f":"IF(VLOOKUP(A220,Itinerário!$A$3:$I$875,7,FALSE)=0,\"\",VLOOKUP(A220,Itinerário!$A$3:$I$875,7,FALSE))","v":"Pregação"},{"$f":"IF(VLOOKUP(A220,Itinerário!$A$3:$I$875,8,FALSE)=0,\"\",VLOOKUP(A220,Itinerário!$A$3:$I$875,8,FALSE))","v":"Brilhante II"},{"$f":"IF(VLOOKUP(A220,Itinerário!$A$3:$I$875,9,FALSE)=0,\"\",VLOOKUP(A220,Itinerário!$A$3:$I$875,9,FALSE))","v":"Limoeiro"}]
[218,{"$f":"VLOOKUP(A221,Itinerário!$A$3:$I$875,3,FALSE)","v":"DÉBORA MOROZ MARTINS ABRÁSCIO"},{"$f":"VLOOKUP(A221,Itinerário!$A$3:$I$875,5,FALSE)","v":"OUTUBRO"},{"$f":"IF(VLOOKUP(A221,Itinerário!$A$3:$I$875,6,FALSE)=0,\"\",VLOOKUP(A221,Itinerário!$A$3:$I$875,6,FALSE))","v":20},"2018-10-20",{"$f":"IF(VLOOKUP(A221,Itinerário!$A$3:$I$875,7,FALSE)=0,\"\",VLOOKUP(A221,Itinerário!$A$3:$I$875,7,FALSE))","v":"Tarde Mulheres asunto modéstia cristã"},{"$f":"IF(VLOOKUP(A221,Itinerário!$A$3:$I$875,8,FALSE)=0,\"\",VLOOKUP(A221,Itinerário!$A$3:$I$875,8,FALSE))","v":"Limeira"},{"$f":"IF(VLOOKUP(A221,Itinerário!$A$3:$I$875,9,FALSE)=0,\"\",VLOOKUP(A221,Itinerário!$A$3:$I$875,9,FALSE))","v":"Limoeiro"}]
[219,{"$f":"VLOOKUP(A222,Itinerário!$A$3:$I$875,3,FALSE)","v":"DÉBORA MOROZ MARTINS ABRÁSCIO"},{"$f":"VLOOKUP(A222,Itinerário!$A$3:$I$875,5,FALSE)","v":"OUTUBRO"},{"$f":"IF(VLOOKUP(A222,Itinerário!$A$3:$I$875,6,FALSE)=0,\"\",VLOOKUP(A222,Itinerário!$A$3:$I$875,6,FALSE))","v":27},"2018-10-27",{"$f":"IF(VLOOKUP(A222,Itinerário!$A$3:$I$875,7,FALSE)=0,\"\",VLOOKUP(A222,Itinerário!$A$3:$I$875,7,FALSE))","v":"Atendimento distrital MM e AFAM"},{"$f":"IF(VLOOKUP(A222,Itinerário!$A$3:$I$875,8,FALSE)=0,\"\",VLOOKUP(A222,Itinerário!$A$3:$I$875,8,FALSE))","v":""},{"$f":"IF(VLOOKUP(A222,Itinerário!$A$3:$I$875,9,FALSE)=0,\"\",VLOOKUP(A222,Itinerário!$A$3:$I$875,9,FALSE))","v":"Içara"}]
[220,{"$f":"VLOOKUP(A223,Itinerário!$A$3:$I$875,3,FALSE)","v":"DÉBORA MOROZ MARTINS ABRÁSCIO"},{"$f":"VLOOKUP(A223,Itinerário!$A$3:$I$875,5,FALSE)","v":"OUTUBRO"},{"$f":"IF(VLOOKUP(A223,Itinerário!$A$3:$I$875,6,FALSE)=0,\"\",VLOOKUP(A223,Itinerário!$A$3:$I$875,6,FALSE))","v":""},"00:00:00",{"$f":"IF(VLOOKUP(A223,Itinerário!$A$3:$I$875,7,FALSE)=0,\"\",VLOOKUP(A223,Itinerário!$A$3:$I$875,7,FALSE))","v":""},{"$f":"IF(VLOOKUP(A223,Itinerário!$A$3:$I$875,8,FALSE)=0,\"\",VLOOKUP(A223,Itinerário!$A$3:$I$875,8,FALSE))","v":""},{"$f":"IF(VLOOKUP(A223,Itinerário!$A$3:$I$875,9,FALSE)=0,\"\",VLOOKUP(A223,Itinerário!$A$3:$I$875,9,FALSE))","v":""}]
[221,{"$f":"VLOOKUP(A224,Itinerário!$A$3:$I$875,3,FALSE)","v":"DÉBORA MOROZ MARTINS ABRÁSCIO"},{"$f":"VLOOKUP(A224,Itinerário!$A$3:$I$875,5,FALSE)","v":"NOVEMBRO"},{"$f":"IF(VLOOKUP(A224,Itinerário!$A$3:$I$875,6,FALSE)=0,\"\",VLOOKUP(A224,Itinerário!$A$3:$I$875,6,FALSE))","v":3},"2018-11-03",{"$f":"IF(VLOOKUP(A224,Itinerário!$A$3:$I$875,7,FALSE)=0,\"\",VLOOKUP(A224,Itinerário!$A$3:$I$875,7,FALSE))","v":"Atendimento Distrital"},{"$f":"IF(VLOOKUP(A224,Itinerário!$A$3:$I$875,8,FALSE)=0,\"\",VLOOKUP(A224,Itinerário!$A$3:$I$875,8,FALSE))","v":""},{"$f":"IF(VLOOKUP(A224,Itinerário!$A$3:$I$875,9,FALSE)=0,\"\",VLOOKUP(A224,Itinerário!$A$3:$I$875,9,FALSE))","v":"Camboriú"}]
[222,{"$f":"VLOOKUP(A225,Itinerário!$A$3:$I$875,3,FALSE)","v":"DÉBORA MOROZ MARTINS ABRÁSCIO"},{"$f":"VLOOKUP(A225,Itinerário!$A$3:$I$875,5,FALSE)","v":"NOVEMBRO"},{"$f":"IF(VLOOKUP(A225,Itinerário!$A$3:$I$875,6,FALSE)=0,\"\",VLOOKUP(A225,Itinerário!$A$3:$I$875,6,FALSE))","v":10},"2018-11-10",{"$f":"IF(VLOOKUP(A225,Itinerário!$A$3:$I$875,7,FALSE)=0,\"\",VLOOKUP(A225,Itinerário!$A$3:$I$875,7,FALSE))","v":"Impacto Criciúma"},{"$f":"IF(VLOOKUP(A225,Itinerário!$A$3:$I$875,8,FALSE)=0,\"\",VLOOKUP(A225,Itinerário!$A$3:$I$875,8,FALSE))","v":"AC"},{"$f":"IF(VLOOKUP(A225,Itinerário!$A$3:$I$875,9,FALSE)=0,\"\",VLOOKUP(A225,Itinerário!$A$3:$I$875,9,FALSE))","v":"AC"}]
[223,{"$f":"VLOOKUP(A226,Itinerário!$A$3:$I$875,3,FALSE)","v":"DÉBORA MOROZ MARTINS ABRÁSCIO"},{"$f":"VLOOKUP(A226,Itinerário!$A$3:$I$875,5,FALSE)","v":"NOVEMBRO"},{"$f":"IF(VLOOKUP(A226,Itinerário!$A$3:$I$875,6,FALSE)=0,\"\",VLOOKUP(A226,Itinerário!$A$3:$I$875,6,FALSE))","v":17},"2018-11-17",{"$f":"IF(VLOOKUP(A226,Itinerário!$A$3:$I$875,7,FALSE)=0,\"\",VLOOKUP(A226,Itinerário!$A$3:$I$875,7,FALSE))","v":"Campori de Jovens"},{"$f":"IF(VLOOKUP(A226,Itinerário!$A$3:$I$875,8,FALSE)=0,\"\",VLOOKUP(A226,Itinerário!$A$3:$I$875,8,FALSE))","v":"USB"},{"$f":"IF(VLOOKUP(A226,Itinerário!$A$3:$I$875,9,FALSE)=0,\"\",VLOOKUP(A226,Itinerário!$A$3:$I$875,9,FALSE))","v":"USB"}]
[224,{"$f":"VLOOKUP(A227,Itinerário!$A$3:$I$875,3,FALSE)","v":"DÉBORA MOROZ MARTINS ABRÁSCIO"},{"$f":"VLOOKUP(A227,Itinerário!$A$3:$I$875,5,FALSE)","v":"NOVEMBRO"},{"$f":"IF(VLOOKUP(A227,Itinerário!$A$3:$I$875,6,FALSE)=0,\"\",VLOOKUP(A227,Itinerário!$A$3:$I$875,6,FALSE))","v":19},"2018-11-19",{"$f":"IF(VLOOKUP(A227,Itinerário!$A$3:$I$875,7,FALSE)=0,\"\",VLOOKUP(A227,Itinerário!$A$3:$I$875,7,FALSE))","v":"PGCD junto com PGP  Região Serra 9h"},{"$f":"IF(VLOOKUP(A227,Itinerário!$A$3:$I$875,8,FALSE)=0,\"\",VLOOKUP(A227,Itinerário!$A$3:$I$875,8,FALSE))","v":"AC"},{"$f":"IF(VLOOKUP(A227,Itinerário!$A$3:$I$875,9,FALSE)=0,\"\",VLOOKUP(A227,Itinerário!$A$3:$I$875,9,FALSE))","v":"AC"}]
[225,{"$f":"VLOOKUP(A228,Itinerário!$A$3:$I$875,3,FALSE)","v":"DÉBORA MOROZ MARTINS ABRÁSCIO"},{"$f":"VLOOKUP(A228,Itinerário!$A$3:$I$875,5,FALSE)","v":"NOVEMBRO"},{"$f":"IF(VLOOKUP(A228,Itinerário!$A$3:$I$875,6,FALSE)=0,\"\",VLOOKUP(A228,Itinerário!$A$3:$I$875,6,FALSE))","v":20},"2018-11-20",{"$f":"IF(VLOOKUP(A228,Itinerário!$A$3:$I$875,7,FALSE)=0,\"\",VLOOKUP(A228,Itinerário!$A$3:$I$875,7,FALSE))","v":"PGCD junto com PGP Região Sul 9h"},{"$f":"IF(VLOOKUP(A228,Itinerário!$A$3:$I$875,8,FALSE)=0,\"\",VLOOKUP(A228,Itinerário!$A$3:$I$875,8,FALSE))","v":"AC"},{"$f":"IF(VLOOKUP(A228,Itinerário!$A$3:$I$875,9,FALSE)=0,\"\",VLOOKUP(A228,Itinerário!$A$3:$I$875,9,FALSE))","v":"AC"}]
[226,{"$f":"VLOOKUP(A229,Itinerário!$A$3:$I$875,3,FALSE)","v":"DÉBORA MOROZ MARTINS ABRÁSCIO"},{"$f":"VLOOKUP(A229,Itinerário!$A$3:$I$875,5,FALSE)","v":"NOVEMBRO"},{"$f":"IF(VLOOKUP(A229,Itinerário!$A$3:$I$875,6,FALSE)=0,\"\",VLOOKUP(A229,Itinerário!$A$3:$I$875,6,FALSE))","v":21},"2018-11-21",{"$f":"IF(VLOOKUP(A229,Itinerário!$A$3:$I$875,7,FALSE)=0,\"\",VLOOKUP(A229,Itinerário!$A$3:$I$875,7,FALSE))","v":"PGCD junto com PGP Região Norte 9h"},{"$f":"IF(VLOOKUP(A229,Itinerário!$A$3:$I$875,8,FALSE)=0,\"\",VLOOKUP(A229,Itinerário!$A$3:$I$875,8,FALSE))","v":"AC"},{"$f":"IF(VLOOKUP(A229,Itinerário!$A$3:$I$875,9,FALSE)=0,\"\",VLOOKUP(A229,Itinerário!$A$3:$I$875,9,FALSE))","v":"AC"}]
[227,{"$f":"VLOOKUP(A230,Itinerário!$A$3:$I$875,3,FALSE)","v":"DÉBORA MOROZ MARTINS ABRÁSCIO"},{"$f":"VLOOKUP(A230,Itinerário!$A$3:$I$875,5,FALSE)","v":"NOVEMBRO"},{"$f":"IF(VLOOKUP(A230,Itinerário!$A$3:$I$875,6,FALSE)=0,\"\",VLOOKUP(A230,Itinerário!$A$3:$I$875,6,FALSE))","v":22},"2018-11-22",{"$f":"IF(VLOOKUP(A230,Itinerário!$A$3:$I$875,7,FALSE)=0,\"\",VLOOKUP(A230,Itinerário!$A$3:$I$875,7,FALSE))","v":"PGCD junto com PGP  Região Capital 9h"},{"$f":"IF(VLOOKUP(A230,Itinerário!$A$3:$I$875,8,FALSE)=0,\"\",VLOOKUP(A230,Itinerário!$A$3:$I$875,8,FALSE))","v":"AC"},{"$f":"IF(VLOOKUP(A230,Itinerário!$A$3:$I$875,9,FALSE)=0,\"\",VLOOKUP(A230,Itinerário!$A$3:$I$875,9,FALSE))","v":"AC"}]
[228,{"$f":"VLOOKUP(A231,Itinerário!$A$3:$I$875,3,FALSE)","v":"DÉBORA MOROZ MARTINS ABRÁSCIO"},{"$f":"VLOOKUP(A231,Itinerário!$A$3:$I$875,5,FALSE)","v":"NOVEMBRO"},{"$f":"IF(VLOOKUP(A231,Itinerário!$A$3:$I$875,6,FALSE)=0,\"\",VLOOKUP(A231,Itinerário!$A$3:$I$875,6,FALSE))","v":24},"2018-11-24",{"$f":"IF(VLOOKUP(A231,Itinerário!$A$3:$I$875,7,FALSE)=0,\"\",VLOOKUP(A231,Itinerário!$A$3:$I$875,7,FALSE))","v":"Aventuri"},{"$f":"IF(VLOOKUP(A231,Itinerário!$A$3:$I$875,8,FALSE)=0,\"\",VLOOKUP(A231,Itinerário!$A$3:$I$875,8,FALSE))","v":"AC"},{"$f":"IF(VLOOKUP(A231,Itinerário!$A$3:$I$875,9,FALSE)=0,\"\",VLOOKUP(A231,Itinerário!$A$3:$I$875,9,FALSE))","v":"AC"}]
[229,{"$f":"VLOOKUP(A232,Itinerário!$A$3:$I$875,3,FALSE)","v":"DÉBORA MOROZ MARTINS ABRÁSCIO"},{"$f":"VLOOKUP(A232,Itinerário!$A$3:$I$875,5,FALSE)","v":"NOVEMBRO"},{"$f":"IF(VLOOKUP(A232,Itinerário!$A$3:$I$875,6,FALSE)=0,\"\",VLOOKUP(A232,Itinerário!$A$3:$I$875,6,FALSE))","v":""},"00:00:00",{"$f":"IF(VLOOKUP(A232,Itinerário!$A$3:$I$875,7,FALSE)=0,\"\",VLOOKUP(A232,Itinerário!$A$3:$I$875,7,FALSE))","v":""},{"$f":"IF(VLOOKUP(A232,Itinerário!$A$3:$I$875,8,FALSE)=0,\"\",VLOOKUP(A232,Itinerário!$A$3:$I$875,8,FALSE))","v":""},{"$f":"IF(VLOOKUP(A232,Itinerário!$A$3:$I$875,9,FALSE)=0,\"\",VLOOKUP(A232,Itinerário!$A$3:$I$875,9,FALSE))","v":""}]
[230,{"$f":"VLOOKUP(A233,Itinerário!$A$3:$I$875,3,FALSE)","v":"DÉBORA MOROZ MARTINS ABRÁSCIO"},{"$f":"VLOOKUP(A233,Itinerário!$A$3:$I$875,5,FALSE)","v":"NOVEMBRO"},{"$f":"IF(VLOOKUP(A233,Itinerário!$A$3:$I$875,6,FALSE)=0,\"\",VLOOKUP(A233,Itinerário!$A$3:$I$875,6,FALSE))","v":""},"00:00:00",{"$f":"IF(VLOOKUP(A233,Itinerário!$A$3:$I$875,7,FALSE)=0,\"\",VLOOKUP(A233,Itinerário!$A$3:$I$875,7,FALSE))","v":""},{"$f":"IF(VLOOKUP(A233,Itinerário!$A$3:$I$875,8,FALSE)=0,\"\",VLOOKUP(A233,Itinerário!$A$3:$I$875,8,FALSE))","v":""},{"$f":"IF(VLOOKUP(A233,Itinerário!$A$3:$I$875,9,FALSE)=0,\"\",VLOOKUP(A233,Itinerário!$A$3:$I$875,9,FALSE))","v":""}]
[231,{"$f":"VLOOKUP(A234,Itinerário!$A$3:$I$875,3,FALSE)","v":"DÉBORA MOROZ MARTINS ABRÁSCIO"},{"$f":"VLOOKUP(A234,Itinerário!$A$3:$I$875,5,FALSE)","v":"DEZEMBRO"},{"$f":"IF(VLOOKUP(A234,Itinerário!$A$3:$I$875,6,FALSE)=0,\"\",VLOOKUP(A234,Itinerário!$A$3:$I$875,6,FALSE))","v":1},"2018-12-01",{"$f":"IF(VLOOKUP(A234,Itinerário!$A$3:$I$875,7,FALSE)=0,\"\",VLOOKUP(A234,Itinerário!$A$3:$I$875,7,FALSE))","v":"Pregação"},{"$f":"IF(VLOOKUP(A234,Itinerário!$A$3:$I$875,8,FALSE)=0,\"\",VLOOKUP(A234,Itinerário!$A$3:$I$875,8,FALSE))","v":"Porto Belo"},{"$f":"IF(VLOOKUP(A234,Itinerário!$A$3:$I$875,9,FALSE)=0,\"\",VLOOKUP(A234,Itinerário!$A$3:$I$875,9,FALSE))","v":"Itapema"}]
[232,{"$f":"VLOOKUP(A235,Itinerário!$A$3:$I$875,3,FALSE)","v":"DÉBORA MOROZ MARTINS ABRÁSCIO"},{"$f":"VLOOKUP(A235,Itinerário!$A$3:$I$875,5,FALSE)","v":"DEZEMBRO"},{"$f":"IF(VLOOKUP(A235,Itinerário!$A$3:$I$875,6,FALSE)=0,\"\",VLOOKUP(A235,Itinerário!$A$3:$I$875,6,FALSE))","v":1},"2018-12-01",{"$f":"IF(VLOOKUP(A235,Itinerário!$A$3:$I$875,7,FALSE)=0,\"\",VLOOKUP(A235,Itinerário!$A$3:$I$875,7,FALSE))","v":"Atendimento distrital "},{"$f":"IF(VLOOKUP(A235,Itinerário!$A$3:$I$875,8,FALSE)=0,\"\",VLOOKUP(A235,Itinerário!$A$3:$I$875,8,FALSE))","v":""},{"$f":"IF(VLOOKUP(A235,Itinerário!$A$3:$I$875,9,FALSE)=0,\"\",VLOOKUP(A235,Itinerário!$A$3:$I$875,9,FALSE))","v":"Itapema"}]
[233,{"$f":"VLOOKUP(A236,Itinerário!$A$3:$I$875,3,FALSE)","v":"DÉBORA MOROZ MARTINS ABRÁSCIO"},{"$f":"VLOOKUP(A236,Itinerário!$A$3:$I$875,5,FALSE)","v":"DEZEMBRO"},{"$f":"IF(VLOOKUP(A236,Itinerário!$A$3:$I$875,6,FALSE)=0,\"\",VLOOKUP(A236,Itinerário!$A$3:$I$875,6,FALSE))","v":8},"2018-12-08",{"$f":"IF(VLOOKUP(A236,Itinerário!$A$3:$I$875,7,FALSE)=0,\"\",VLOOKUP(A236,Itinerário!$A$3:$I$875,7,FALSE))","v":"Pregação"},{"$f":"IF(VLOOKUP(A236,Itinerário!$A$3:$I$875,8,FALSE)=0,\"\",VLOOKUP(A236,Itinerário!$A$3:$I$875,8,FALSE))","v":"Jardim Eldorado"},{"$f":"IF(VLOOKUP(A236,Itinerário!$A$3:$I$875,9,FALSE)=0,\"\",VLOOKUP(A236,Itinerário!$A$3:$I$875,9,FALSE))","v":"Jardim Eldorado"}]
[234,{"$f":"VLOOKUP(A237,Itinerário!$A$3:$I$875,3,FALSE)","v":"DÉBORA MOROZ MARTINS ABRÁSCIO"},{"$f":"VLOOKUP(A237,Itinerário!$A$3:$I$875,5,FALSE)","v":"DEZEMBRO"},{"$f":"IF(VLOOKUP(A237,Itinerário!$A$3:$I$875,6,FALSE)=0,\"\",VLOOKUP(A237,Itinerário!$A$3:$I$875,6,FALSE))","v":15},"2018-12-15",{"$f":"IF(VLOOKUP(A237,Itinerário!$A$3:$I$875,7,FALSE)=0,\"\",VLOOKUP(A237,Itinerário!$A$3:$I$875,7,FALSE))","v":"Atendimento Distrital"},{"$f":"IF(VLOOKUP(A237,Itinerário!$A$3:$I$875,8,FALSE)=0,\"\",VLOOKUP(A237,Itinerário!$A$3:$I$875,8,FALSE))","v":"Campo Duna"},{"$f":"IF(VLOOKUP(A237,Itinerário!$A$3:$I$875,9,FALSE)=0,\"\",VLOOKUP(A237,Itinerário!$A$3:$I$875,9,FALSE))","v":"Garopaba"}]
[235,{"$f":"VLOOKUP(A238,Itinerário!$A$3:$I$875,3,FALSE)","v":"DÉBORA MOROZ MARTINS ABRÁSCIO"},{"$f":"VLOOKUP(A238,Itinerário!$A$3:$I$875,5,FALSE)","v":"DEZEMBRO"},{"$f":"IF(VLOOKUP(A238,Itinerário!$A$3:$I$875,6,FALSE)=0,\"\",VLOOKUP(A238,Itinerário!$A$3:$I$875,6,FALSE))","v":22},"2018-12-22",{"$f":"IF(VLOOKUP(A238,Itinerário!$A$3:$I$875,7,FALSE)=0,\"\",VLOOKUP(A238,Itinerário!$A$3:$I$875,7,FALSE))","v":"Férias"},{"$f":"IF(VLOOKUP(A238,Itinerário!$A$3:$I$875,8,FALSE)=0,\"\",VLOOKUP(A238,Itinerário!$A$3:$I$875,8,FALSE))","v":""},{"$f":"IF(VLOOKUP(A238,Itinerário!$A$3:$I$875,9,FALSE)=0,\"\",VLOOKUP(A238,Itinerário!$A$3:$I$875,9,FALSE))","v":""}]
[236,{"$f":"VLOOKUP(A239,Itinerário!$A$3:$I$875,3,FALSE)","v":"DÉBORA MOROZ MARTINS ABRÁSCIO"},{"$f":"VLOOKUP(A239,Itinerário!$A$3:$I$875,5,FALSE)","v":"DEZEMBRO"},{"$f":"IF(VLOOKUP(A239,Itinerário!$A$3:$I$875,6,FALSE)=0,\"\",VLOOKUP(A239,Itinerário!$A$3:$I$875,6,FALSE))","v":""},"00:00:00",{"$f":"IF(VLOOKUP(A239,Itinerário!$A$3:$I$875,7,FALSE)=0,\"\",VLOOKUP(A239,Itinerário!$A$3:$I$875,7,FALSE))","v":""},{"$f":"IF(VLOOKUP(A239,Itinerário!$A$3:$I$875,8,FALSE)=0,\"\",VLOOKUP(A239,Itinerário!$A$3:$I$875,8,FALSE))","v":""},{"$f":"IF(VLOOKUP(A239,Itinerário!$A$3:$I$875,9,FALSE)=0,\"\",VLOOKUP(A239,Itinerário!$A$3:$I$875,9,FALSE))","v":""}]
[237,{"$f":"VLOOKUP(A240,Itinerário!$A$3:$I$875,3,FALSE)","v":"DÉBORA MOROZ MARTINS ABRÁSCIO"},{"$f":"VLOOKUP(A240,Itinerário!$A$3:$I$875,5,FALSE)","v":"DEZEMBRO"},{"$f":"IF(VLOOKUP(A240,Itinerário!$A$3:$I$875,6,FALSE)=0,\"\",VLOOKUP(A240,Itinerário!$A$3:$I$875,6,FALSE))","v":""},"00:00:00",{"$f":"IF(VLOOKUP(A240,Itinerário!$A$3:$I$875,7,FALSE)=0,\"\",VLOOKUP(A240,Itinerário!$A$3:$I$875,7,FALSE))","v":""},{"$f":"IF(VLOOKUP(A240,Itinerário!$A$3:$I$875,8,FALSE)=0,\"\",VLOOKUP(A240,Itinerário!$A$3:$I$875,8,FALSE))","v":""},{"$f":"IF(VLOOKUP(A240,Itinerário!$A$3:$I$875,9,FALSE)=0,\"\",VLOOKUP(A240,Itinerário!$A$3:$I$875,9,FALSE))","v":""}]
[238,{"$f":"VLOOKUP(A241,Itinerário!$A$3:$I$875,3,FALSE)","v":"DÉBORA MOROZ MARTINS ABRÁSCIO"},{"$f":"VLOOKUP(A241,Itinerário!$A$3:$I$875,5,FALSE)","v":"DEZEMBRO"},{"$f":"IF(VLOOKUP(A241,Itinerário!$A$3:$I$875,6,FALSE)=0,\"\",VLOOKUP(A241,Itinerário!$A$3:$I$875,6,FALSE))","v":""},"00:00:00",{"$f":"IF(VLOOKUP(A241,Itinerário!$A$3:$I$875,7,FALSE)=0,\"\",VLOOKUP(A241,Itinerário!$A$3:$I$875,7,FALSE))","v":""},{"$f":"IF(VLOOKUP(A241,Itinerário!$A$3:$I$875,8,FALSE)=0,\"\",VLOOKUP(A241,Itinerário!$A$3:$I$875,8,FALSE))","v":""},{"$f":"IF(VLOOKUP(A241,Itinerário!$A$3:$I$875,9,FALSE)=0,\"\",VLOOKUP(A241,Itinerário!$A$3:$I$875,9,FALSE))","v":""}]
[239,{"$f":"VLOOKUP(A242,Itinerário!$A$3:$I$875,3,FALSE)","v":"DÉBORA MOROZ MARTINS ABRÁSCIO"},{"$f":"VLOOKUP(A242,Itinerário!$A$3:$I$875,5,FALSE)","v":"DEZEMBRO"},{"$f":"IF(VLOOKUP(A242,Itinerário!$A$3:$I$875,6,FALSE)=0,\"\",VLOOKUP(A242,Itinerário!$A$3:$I$875,6,FALSE))","v":""},"00:00:00",{"$f":"IF(VLOOKUP(A242,Itinerário!$A$3:$I$875,7,FALSE)=0,\"\",VLOOKUP(A242,Itinerário!$A$3:$I$875,7,FALSE))","v":""},{"$f":"IF(VLOOKUP(A242,Itinerário!$A$3:$I$875,8,FALSE)=0,\"\",VLOOKUP(A242,Itinerário!$A$3:$I$875,8,FALSE))","v":""},{"$f":"IF(VLOOKUP(A242,Itinerário!$A$3:$I$875,9,FALSE)=0,\"\",VLOOKUP(A242,Itinerário!$A$3:$I$875,9,FALSE))","v":""}]
[240,{"$f":"VLOOKUP(A243,Itinerário!$A$3:$I$875,3,FALSE)","v":"DÉBORA MOROZ MARTINS ABRÁSCIO"},{"$f":"VLOOKUP(A243,Itinerário!$A$3:$I$875,5,FALSE)","v":"DEZEMBRO"},{"$f":"IF(VLOOKUP(A243,Itinerário!$A$3:$I$875,6,FALSE)=0,\"\",VLOOKUP(A243,Itinerário!$A$3:$I$875,6,FALSE))","v":""},"00:00:00",{"$f":"IF(VLOOKUP(A243,Itinerário!$A$3:$I$875,7,FALSE)=0,\"\",VLOOKUP(A243,Itinerário!$A$3:$I$875,7,FALSE))","v":""},{"$f":"IF(VLOOKUP(A243,Itinerário!$A$3:$I$875,8,FALSE)=0,\"\",VLOOKUP(A243,Itinerário!$A$3:$I$875,8,FALSE))","v":""},{"$f":"IF(VLOOKUP(A243,Itinerário!$A$3:$I$875,9,FALSE)=0,\"\",VLOOKUP(A243,Itinerário!$A$3:$I$875,9,FALSE))","v":""}]
[241,{"$f":"VLOOKUP(A244,Itinerário!$A$3:$I$875,3,FALSE)","v":"EDVALDO MACIEL DA SILVA"},{"$f":"VLOOKUP(A244,Itinerário!$A$3:$I$875,5,FALSE)","v":"JULHO"},{"$f":"IF(VLOOKUP(A244,Itinerário!$A$3:$I$875,6,FALSE)=0,\"\",VLOOKUP(A244,Itinerário!$A$3:$I$875,6,FALSE))","v":"07 a 08"},"00:00:00",{"$f":"IF(VLOOKUP(A244,Itinerário!$A$3:$I$875,7,FALSE)=0,\"\",VLOOKUP(A244,Itinerário!$A$3:$I$875,7,FALSE))","v":"Escola de Evangelistas Voluntários"},{"$f":"IF(VLOOKUP(A244,Itinerário!$A$3:$I$875,8,FALSE)=0,\"\",VLOOKUP(A244,Itinerário!$A$3:$I$875,8,FALSE))","v":"CATRE"},{"$f":"IF(VLOOKUP(A244,Itinerário!$A$3:$I$875,9,FALSE)=0,\"\",VLOOKUP(A244,Itinerário!$A$3:$I$875,9,FALSE))","v":"CATRE"}]
[242,{"$f":"VLOOKUP(A245,Itinerário!$A$3:$I$875,3,FALSE)","v":"EDVALDO MACIEL DA SILVA"},{"$f":"VLOOKUP(A245,Itinerário!$A$3:$I$875,5,FALSE)","v":"JULHO"},{"$f":"IF(VLOOKUP(A245,Itinerário!$A$3:$I$875,6,FALSE)=0,\"\",VLOOKUP(A245,Itinerário!$A$3:$I$875,6,FALSE))","v":14},"2018-07-14",{"$f":"IF(VLOOKUP(A245,Itinerário!$A$3:$I$875,7,FALSE)=0,\"\",VLOOKUP(A245,Itinerário!$A$3:$I$875,7,FALSE))","v":"Colheita Navegantes"},{"$f":"IF(VLOOKUP(A245,Itinerário!$A$3:$I$875,8,FALSE)=0,\"\",VLOOKUP(A245,Itinerário!$A$3:$I$875,8,FALSE))","v":"Navegantes"},{"$f":"IF(VLOOKUP(A245,Itinerário!$A$3:$I$875,9,FALSE)=0,\"\",VLOOKUP(A245,Itinerário!$A$3:$I$875,9,FALSE))","v":"Navegantes"}]
[243,{"$f":"VLOOKUP(A246,Itinerário!$A$3:$I$875,3,FALSE)","v":"EDVALDO MACIEL DA SILVA"},{"$f":"VLOOKUP(A246,Itinerário!$A$3:$I$875,5,FALSE)","v":"JULHO"},{"$f":"IF(VLOOKUP(A246,Itinerário!$A$3:$I$875,6,FALSE)=0,\"\",VLOOKUP(A246,Itinerário!$A$3:$I$875,6,FALSE))","v":21},"2018-07-21",{"$f":"IF(VLOOKUP(A246,Itinerário!$A$3:$I$875,7,FALSE)=0,\"\",VLOOKUP(A246,Itinerário!$A$3:$I$875,7,FALSE))","v":"Pregação "},{"$f":"IF(VLOOKUP(A246,Itinerário!$A$3:$I$875,8,FALSE)=0,\"\",VLOOKUP(A246,Itinerário!$A$3:$I$875,8,FALSE))","v":"Primavera"},{"$f":"IF(VLOOKUP(A246,Itinerário!$A$3:$I$875,9,FALSE)=0,\"\",VLOOKUP(A246,Itinerário!$A$3:$I$875,9,FALSE))","v":"Universitario"}]
[244,{"$f":"VLOOKUP(A247,Itinerário!$A$3:$I$875,3,FALSE)","v":"EDVALDO MACIEL DA SILVA"},{"$f":"VLOOKUP(A247,Itinerário!$A$3:$I$875,5,FALSE)","v":"JULHO"},{"$f":"IF(VLOOKUP(A247,Itinerário!$A$3:$I$875,6,FALSE)=0,\"\",VLOOKUP(A247,Itinerário!$A$3:$I$875,6,FALSE))","v":""},"00:00:00",{"$f":"IF(VLOOKUP(A247,Itinerário!$A$3:$I$875,7,FALSE)=0,\"\",VLOOKUP(A247,Itinerário!$A$3:$I$875,7,FALSE))","v":""},{"$f":"IF(VLOOKUP(A247,Itinerário!$A$3:$I$875,8,FALSE)=0,\"\",VLOOKUP(A247,Itinerário!$A$3:$I$875,8,FALSE))","v":""},{"$f":"IF(VLOOKUP(A247,Itinerário!$A$3:$I$875,9,FALSE)=0,\"\",VLOOKUP(A247,Itinerário!$A$3:$I$875,9,FALSE))","v":""}]
[245,{"$f":"VLOOKUP(A248,Itinerário!$A$3:$I$875,3,FALSE)","v":"EDVALDO MACIEL DA SILVA"},{"$f":"VLOOKUP(A248,Itinerário!$A$3:$I$875,5,FALSE)","v":"JULHO"},{"$f":"IF(VLOOKUP(A248,Itinerário!$A$3:$I$875,6,FALSE)=0,\"\",VLOOKUP(A248,Itinerário!$A$3:$I$875,6,FALSE))","v":""},"00:00:00",{"$f":"IF(VLOOKUP(A248,Itinerário!$A$3:$I$875,7,FALSE)=0,\"\",VLOOKUP(A248,Itinerário!$A$3:$I$875,7,FALSE))","v":""},{"$f":"IF(VLOOKUP(A248,Itinerário!$A$3:$I$875,8,FALSE)=0,\"\",VLOOKUP(A248,Itinerário!$A$3:$I$875,8,FALSE))","v":""},{"$f":"IF(VLOOKUP(A248,Itinerário!$A$3:$I$875,9,FALSE)=0,\"\",VLOOKUP(A248,Itinerário!$A$3:$I$875,9,FALSE))","v":""}]
[246,{"$f":"VLOOKUP(A249,Itinerário!$A$3:$I$875,3,FALSE)","v":"EDVALDO MACIEL DA SILVA"},{"$f":"VLOOKUP(A249,Itinerário!$A$3:$I$875,5,FALSE)","v":"JULHO"},{"$f":"IF(VLOOKUP(A249,Itinerário!$A$3:$I$875,6,FALSE)=0,\"\",VLOOKUP(A249,Itinerário!$A$3:$I$875,6,FALSE))","v":""},"00:00:00",{"$f":"IF(VLOOKUP(A249,Itinerário!$A$3:$I$875,7,FALSE)=0,\"\",VLOOKUP(A249,Itinerário!$A$3:$I$875,7,FALSE))","v":""},{"$f":"IF(VLOOKUP(A249,Itinerário!$A$3:$I$875,8,FALSE)=0,\"\",VLOOKUP(A249,Itinerário!$A$3:$I$875,8,FALSE))","v":""},{"$f":"IF(VLOOKUP(A249,Itinerário!$A$3:$I$875,9,FALSE)=0,\"\",VLOOKUP(A249,Itinerário!$A$3:$I$875,9,FALSE))","v":""}]
[247,{"$f":"VLOOKUP(A250,Itinerário!$A$3:$I$875,3,FALSE)","v":"EDVALDO MACIEL DA SILVA"},{"$f":"VLOOKUP(A250,Itinerário!$A$3:$I$875,5,FALSE)","v":"JULHO"},{"$f":"IF(VLOOKUP(A250,Itinerário!$A$3:$I$875,6,FALSE)=0,\"\",VLOOKUP(A250,Itinerário!$A$3:$I$875,6,FALSE))","v":""},"00:00:00",{"$f":"IF(VLOOKUP(A250,Itinerário!$A$3:$I$875,7,FALSE)=0,\"\",VLOOKUP(A250,Itinerário!$A$3:$I$875,7,FALSE))","v":""},{"$f":"IF(VLOOKUP(A250,Itinerário!$A$3:$I$875,8,FALSE)=0,\"\",VLOOKUP(A250,Itinerário!$A$3:$I$875,8,FALSE))","v":""},{"$f":"IF(VLOOKUP(A250,Itinerário!$A$3:$I$875,9,FALSE)=0,\"\",VLOOKUP(A250,Itinerário!$A$3:$I$875,9,FALSE))","v":""}]
[248,{"$f":"VLOOKUP(A251,Itinerário!$A$3:$I$875,3,FALSE)","v":"EDVALDO MACIEL DA SILVA"},{"$f":"VLOOKUP(A251,Itinerário!$A$3:$I$875,5,FALSE)","v":"JULHO"},{"$f":"IF(VLOOKUP(A251,Itinerário!$A$3:$I$875,6,FALSE)=0,\"\",VLOOKUP(A251,Itinerário!$A$3:$I$875,6,FALSE))","v":""},"00:00:00",{"$f":"IF(VLOOKUP(A251,Itinerário!$A$3:$I$875,7,FALSE)=0,\"\",VLOOKUP(A251,Itinerário!$A$3:$I$875,7,FALSE))","v":""},{"$f":"IF(VLOOKUP(A251,Itinerário!$A$3:$I$875,8,FALSE)=0,\"\",VLOOKUP(A251,Itinerário!$A$3:$I$875,8,FALSE))","v":""},{"$f":"IF(VLOOKUP(A251,Itinerário!$A$3:$I$875,9,FALSE)=0,\"\",VLOOKUP(A251,Itinerário!$A$3:$I$875,9,FALSE))","v":""}]
[249,{"$f":"VLOOKUP(A252,Itinerário!$A$3:$I$875,3,FALSE)","v":"EDVALDO MACIEL DA SILVA"},{"$f":"VLOOKUP(A252,Itinerário!$A$3:$I$875,5,FALSE)","v":"JULHO"},{"$f":"IF(VLOOKUP(A252,Itinerário!$A$3:$I$875,6,FALSE)=0,\"\",VLOOKUP(A252,Itinerário!$A$3:$I$875,6,FALSE))","v":""},"00:00:00",{"$f":"IF(VLOOKUP(A252,Itinerário!$A$3:$I$875,7,FALSE)=0,\"\",VLOOKUP(A252,Itinerário!$A$3:$I$875,7,FALSE))","v":""},{"$f":"IF(VLOOKUP(A252,Itinerário!$A$3:$I$875,8,FALSE)=0,\"\",VLOOKUP(A252,Itinerário!$A$3:$I$875,8,FALSE))","v":""},{"$f":"IF(VLOOKUP(A252,Itinerário!$A$3:$I$875,9,FALSE)=0,\"\",VLOOKUP(A252,Itinerário!$A$3:$I$875,9,FALSE))","v":""}]
[250,{"$f":"VLOOKUP(A253,Itinerário!$A$3:$I$875,3,FALSE)","v":"EDVALDO MACIEL DA SILVA"},{"$f":"VLOOKUP(A253,Itinerário!$A$3:$I$875,5,FALSE)","v":"JULHO"},{"$f":"IF(VLOOKUP(A253,Itinerário!$A$3:$I$875,6,FALSE)=0,\"\",VLOOKUP(A253,Itinerário!$A$3:$I$875,6,FALSE))","v":""},"00:00:00",{"$f":"IF(VLOOKUP(A253,Itinerário!$A$3:$I$875,7,FALSE)=0,\"\",VLOOKUP(A253,Itinerário!$A$3:$I$875,7,FALSE))","v":""},{"$f":"IF(VLOOKUP(A253,Itinerário!$A$3:$I$875,8,FALSE)=0,\"\",VLOOKUP(A253,Itinerário!$A$3:$I$875,8,FALSE))","v":""},{"$f":"IF(VLOOKUP(A253,Itinerário!$A$3:$I$875,9,FALSE)=0,\"\",VLOOKUP(A253,Itinerário!$A$3:$I$875,9,FALSE))","v":""}]
[251,{"$f":"VLOOKUP(A254,Itinerário!$A$3:$I$875,3,FALSE)","v":"EDVALDO MACIEL DA SILVA"},{"$f":"VLOOKUP(A254,Itinerário!$A$3:$I$875,5,FALSE)","v":"AGOSTO"},{"$f":"IF(VLOOKUP(A254,Itinerário!$A$3:$I$875,6,FALSE)=0,\"\",VLOOKUP(A254,Itinerário!$A$3:$I$875,6,FALSE))","v":4},"2018-08-04",{"$f":"IF(VLOOKUP(A254,Itinerário!$A$3:$I$875,7,FALSE)=0,\"\",VLOOKUP(A254,Itinerário!$A$3:$I$875,7,FALSE))","v":"Lançamento da Colheita"},{"$f":"IF(VLOOKUP(A254,Itinerário!$A$3:$I$875,8,FALSE)=0,\"\",VLOOKUP(A254,Itinerário!$A$3:$I$875,8,FALSE))","v":"Balneário Camboriú"},{"$f":"IF(VLOOKUP(A254,Itinerário!$A$3:$I$875,9,FALSE)=0,\"\",VLOOKUP(A254,Itinerário!$A$3:$I$875,9,FALSE))","v":"Balneário Camboriú"}]
[252,{"$f":"VLOOKUP(A255,Itinerário!$A$3:$I$875,3,FALSE)","v":"EDVALDO MACIEL DA SILVA"},{"$f":"VLOOKUP(A255,Itinerário!$A$3:$I$875,5,FALSE)","v":"AGOSTO"},{"$f":"IF(VLOOKUP(A255,Itinerário!$A$3:$I$875,6,FALSE)=0,\"\",VLOOKUP(A255,Itinerário!$A$3:$I$875,6,FALSE))","v":11},"2018-08-11",{"$f":"IF(VLOOKUP(A255,Itinerário!$A$3:$I$875,7,FALSE)=0,\"\",VLOOKUP(A255,Itinerário!$A$3:$I$875,7,FALSE))","v":"Colheita Universitário"},{"$f":"IF(VLOOKUP(A255,Itinerário!$A$3:$I$875,8,FALSE)=0,\"\",VLOOKUP(A255,Itinerário!$A$3:$I$875,8,FALSE))","v":"Primavera"},{"$f":"IF(VLOOKUP(A255,Itinerário!$A$3:$I$875,9,FALSE)=0,\"\",VLOOKUP(A255,Itinerário!$A$3:$I$875,9,FALSE))","v":"Universitario"}]
[253,{"$f":"VLOOKUP(A256,Itinerário!$A$3:$I$875,3,FALSE)","v":"EDVALDO MACIEL DA SILVA"},{"$f":"VLOOKUP(A256,Itinerário!$A$3:$I$875,5,FALSE)","v":"AGOSTO"},{"$f":"IF(VLOOKUP(A256,Itinerário!$A$3:$I$875,6,FALSE)=0,\"\",VLOOKUP(A256,Itinerário!$A$3:$I$875,6,FALSE))","v":18},"2018-08-18",{"$f":"IF(VLOOKUP(A256,Itinerário!$A$3:$I$875,7,FALSE)=0,\"\",VLOOKUP(A256,Itinerário!$A$3:$I$875,7,FALSE))","v":"Colheita/Plantio Universitário"},{"$f":"IF(VLOOKUP(A256,Itinerário!$A$3:$I$875,8,FALSE)=0,\"\",VLOOKUP(A256,Itinerário!$A$3:$I$875,8,FALSE))","v":"Universitária"},{"$f":"IF(VLOOKUP(A256,Itinerário!$A$3:$I$875,9,FALSE)=0,\"\",VLOOKUP(A256,Itinerário!$A$3:$I$875,9,FALSE))","v":"Universitario"}]
[254,{"$f":"VLOOKUP(A257,Itinerário!$A$3:$I$875,3,FALSE)","v":"EDVALDO MACIEL DA SILVA"},{"$f":"VLOOKUP(A257,Itinerário!$A$3:$I$875,5,FALSE)","v":"AGOSTO"},{"$f":"IF(VLOOKUP(A257,Itinerário!$A$3:$I$875,6,FALSE)=0,\"\",VLOOKUP(A257,Itinerário!$A$3:$I$875,6,FALSE))","v":25},"2018-08-25",{"$f":"IF(VLOOKUP(A257,Itinerário!$A$3:$I$875,7,FALSE)=0,\"\",VLOOKUP(A257,Itinerário!$A$3:$I$875,7,FALSE))","v":"Lançamento da Colheita"},{"$f":"IF(VLOOKUP(A257,Itinerário!$A$3:$I$875,8,FALSE)=0,\"\",VLOOKUP(A257,Itinerário!$A$3:$I$875,8,FALSE))","v":"Lages"},{"$f":"IF(VLOOKUP(A257,Itinerário!$A$3:$I$875,9,FALSE)=0,\"\",VLOOKUP(A257,Itinerário!$A$3:$I$875,9,FALSE))","v":""}]
[255,{"$f":"VLOOKUP(A258,Itinerário!$A$3:$I$875,3,FALSE)","v":"EDVALDO MACIEL DA SILVA"},{"$f":"VLOOKUP(A258,Itinerário!$A$3:$I$875,5,FALSE)","v":"AGOSTO"},{"$f":"IF(VLOOKUP(A258,Itinerário!$A$3:$I$875,6,FALSE)=0,\"\",VLOOKUP(A258,Itinerário!$A$3:$I$875,6,FALSE))","v":""},"00:00:00",{"$f":"IF(VLOOKUP(A258,Itinerário!$A$3:$I$875,7,FALSE)=0,\"\",VLOOKUP(A258,Itinerário!$A$3:$I$875,7,FALSE))","v":""},{"$f":"IF(VLOOKUP(A258,Itinerário!$A$3:$I$875,8,FALSE)=0,\"\",VLOOKUP(A258,Itinerário!$A$3:$I$875,8,FALSE))","v":""},{"$f":"IF(VLOOKUP(A258,Itinerário!$A$3:$I$875,9,FALSE)=0,\"\",VLOOKUP(A258,Itinerário!$A$3:$I$875,9,FALSE))","v":""}]
[256,{"$f":"VLOOKUP(A259,Itinerário!$A$3:$I$875,3,FALSE)","v":"EDVALDO MACIEL DA SILVA"},{"$f":"VLOOKUP(A259,Itinerário!$A$3:$I$875,5,FALSE)","v":"AGOSTO"},{"$f":"IF(VLOOKUP(A259,Itinerário!$A$3:$I$875,6,FALSE)=0,\"\",VLOOKUP(A259,Itinerário!$A$3:$I$875,6,FALSE))","v":""},"00:00:00",{"$f":"IF(VLOOKUP(A259,Itinerário!$A$3:$I$875,7,FALSE)=0,\"\",VLOOKUP(A259,Itinerário!$A$3:$I$875,7,FALSE))","v":""},{"$f":"IF(VLOOKUP(A259,Itinerário!$A$3:$I$875,8,FALSE)=0,\"\",VLOOKUP(A259,Itinerário!$A$3:$I$875,8,FALSE))","v":""},{"$f":"IF(VLOOKUP(A259,Itinerário!$A$3:$I$875,9,FALSE)=0,\"\",VLOOKUP(A259,Itinerário!$A$3:$I$875,9,FALSE))","v":""}]
[257,{"$f":"VLOOKUP(A260,Itinerário!$A$3:$I$875,3,FALSE)","v":"EDVALDO MACIEL DA SILVA"},{"$f":"VLOOKUP(A260,Itinerário!$A$3:$I$875,5,FALSE)","v":"AGOSTO"},{"$f":"IF(VLOOKUP(A260,Itinerário!$A$3:$I$875,6,FALSE)=0,\"\",VLOOKUP(A260,Itinerário!$A$3:$I$875,6,FALSE))","v":""},{"$f":"IFERROR(DATE(RIGHT($B$2,4),VLOOKUP(C260,$J$4:$K$15,2,FALSE),D260),0)","v":"00:00:00"},{"$f":"IF(VLOOKUP(A260,Itinerário!$A$3:$I$875,7,FALSE)=0,\"\",VLOOKUP(A260,Itinerário!$A$3:$I$875,7,FALSE))","v":""},{"$f":"IF(VLOOKUP(A260,Itinerário!$A$3:$I$875,8,FALSE)=0,\"\",VLOOKUP(A260,Itinerário!$A$3:$I$875,8,FALSE))","v":""},{"$f":"IF(VLOOKUP(A260,Itinerário!$A$3:$I$875,9,FALSE)=0,\"\",VLOOKUP(A260,Itinerário!$A$3:$I$875,9,FALSE))","v":""}]
[258,{"$f":"VLOOKUP(A261,Itinerário!$A$3:$I$875,3,FALSE)","v":"EDVALDO MACIEL DA SILVA"},{"$f":"VLOOKUP(A261,Itinerário!$A$3:$I$875,5,FALSE)","v":"AGOSTO"},{"$f":"IF(VLOOKUP(A261,Itinerário!$A$3:$I$875,6,FALSE)=0,\"\",VLOOKUP(A261,Itinerário!$A$3:$I$875,6,FALSE))","v":""},"00:00:00",{"$f":"IF(VLOOKUP(A261,Itinerário!$A$3:$I$875,7,FALSE)=0,\"\",VLOOKUP(A261,Itinerário!$A$3:$I$875,7,FALSE))","v":""},{"$f":"IF(VLOOKUP(A261,Itinerário!$A$3:$I$875,8,FALSE)=0,\"\",VLOOKUP(A261,Itinerário!$A$3:$I$875,8,FALSE))","v":""},{"$f":"IF(VLOOKUP(A261,Itinerário!$A$3:$I$875,9,FALSE)=0,\"\",VLOOKUP(A261,Itinerário!$A$3:$I$875,9,FALSE))","v":""}]
[259,{"$f":"VLOOKUP(A262,Itinerário!$A$3:$I$875,3,FALSE)","v":"EDVALDO MACIEL DA SILVA"},{"$f":"VLOOKUP(A262,Itinerário!$A$3:$I$875,5,FALSE)","v":"AGOSTO"},{"$f":"IF(VLOOKUP(A262,Itinerário!$A$3:$I$875,6,FALSE)=0,\"\",VLOOKUP(A262,Itinerário!$A$3:$I$875,6,FALSE))","v":""},"00:00:00",{"$f":"IF(VLOOKUP(A262,Itinerário!$A$3:$I$875,7,FALSE)=0,\"\",VLOOKUP(A262,Itinerário!$A$3:$I$875,7,FALSE))","v":""},{"$f":"IF(VLOOKUP(A262,Itinerário!$A$3:$I$875,8,FALSE)=0,\"\",VLOOKUP(A262,Itinerário!$A$3:$I$875,8,FALSE))","v":""},{"$f":"IF(VLOOKUP(A262,Itinerário!$A$3:$I$875,9,FALSE)=0,\"\",VLOOKUP(A262,Itinerário!$A$3:$I$875,9,FALSE))","v":""}]
[260,{"$f":"VLOOKUP(A263,Itinerário!$A$3:$I$875,3,FALSE)","v":"EDVALDO MACIEL DA SILVA"},{"$f":"VLOOKUP(A263,Itinerário!$A$3:$I$875,5,FALSE)","v":"AGOSTO"},{"$f":"IF(VLOOKUP(A263,Itinerário!$A$3:$I$875,6,FALSE)=0,\"\",VLOOKUP(A263,Itinerário!$A$3:$I$875,6,FALSE))","v":""},"00:00:00",{"$f":"IF(VLOOKUP(A263,Itinerário!$A$3:$I$875,7,FALSE)=0,\"\",VLOOKUP(A263,Itinerário!$A$3:$I$875,7,FALSE))","v":""},{"$f":"IF(VLOOKUP(A263,Itinerário!$A$3:$I$875,8,FALSE)=0,\"\",VLOOKUP(A263,Itinerário!$A$3:$I$875,8,FALSE))","v":""},{"$f":"IF(VLOOKUP(A263,Itinerário!$A$3:$I$875,9,FALSE)=0,\"\",VLOOKUP(A263,Itinerário!$A$3:$I$875,9,FALSE))","v":""}]
[261,{"$f":"VLOOKUP(A264,Itinerário!$A$3:$I$875,3,FALSE)","v":"EDVALDO MACIEL DA SILVA"},{"$f":"VLOOKUP(A264,Itinerário!$A$3:$I$875,5,FALSE)","v":"SETEMBRO"},{"$f":"IF(VLOOKUP(A264,Itinerário!$A$3:$I$875,6,FALSE)=0,\"\",VLOOKUP(A264,Itinerário!$A$3:$I$875,6,FALSE))","v":1},"2018-09-01",{"$f":"IF(VLOOKUP(A264,Itinerário!$A$3:$I$875,7,FALSE)=0,\"\",VLOOKUP(A264,Itinerário!$A$3:$I$875,7,FALSE))","v":"Colheita Balneário Camboriú"},{"$f":"IF(VLOOKUP(A264,Itinerário!$A$3:$I$875,8,FALSE)=0,\"\",VLOOKUP(A264,Itinerário!$A$3:$I$875,8,FALSE))","v":"Balneário Camboriú"},{"$f":"IF(VLOOKUP(A264,Itinerário!$A$3:$I$875,9,FALSE)=0,\"\",VLOOKUP(A264,Itinerário!$A$3:$I$875,9,FALSE))","v":"Balneário Camboriú"}]
[262,{"$f":"VLOOKUP(A265,Itinerário!$A$3:$I$875,3,FALSE)","v":"EDVALDO MACIEL DA SILVA"},{"$f":"VLOOKUP(A265,Itinerário!$A$3:$I$875,5,FALSE)","v":"SETEMBRO"},{"$f":"IF(VLOOKUP(A265,Itinerário!$A$3:$I$875,6,FALSE)=0,\"\",VLOOKUP(A265,Itinerário!$A$3:$I$875,6,FALSE))","v":8},"2018-09-08",{"$f":"IF(VLOOKUP(A265,Itinerário!$A$3:$I$875,7,FALSE)=0,\"\",VLOOKUP(A265,Itinerário!$A$3:$I$875,7,FALSE))","v":"Pregação "},{"$f":"IF(VLOOKUP(A265,Itinerário!$A$3:$I$875,8,FALSE)=0,\"\",VLOOKUP(A265,Itinerário!$A$3:$I$875,8,FALSE))","v":"Ingleses"},{"$f":"IF(VLOOKUP(A265,Itinerário!$A$3:$I$875,9,FALSE)=0,\"\",VLOOKUP(A265,Itinerário!$A$3:$I$875,9,FALSE))","v":"Ingleses"}]
[263,{"$f":"VLOOKUP(A266,Itinerário!$A$3:$I$875,3,FALSE)","v":"EDVALDO MACIEL DA SILVA"},{"$f":"VLOOKUP(A266,Itinerário!$A$3:$I$875,5,FALSE)","v":"SETEMBRO"},{"$f":"IF(VLOOKUP(A266,Itinerário!$A$3:$I$875,6,FALSE)=0,\"\",VLOOKUP(A266,Itinerário!$A$3:$I$875,6,FALSE))","v":15},"2018-09-15",{"$f":"IF(VLOOKUP(A266,Itinerário!$A$3:$I$875,7,FALSE)=0,\"\",VLOOKUP(A266,Itinerário!$A$3:$I$875,7,FALSE))","v":"Colheita Jardim Eldorado"},{"$f":"IF(VLOOKUP(A266,Itinerário!$A$3:$I$875,8,FALSE)=0,\"\",VLOOKUP(A266,Itinerário!$A$3:$I$875,8,FALSE))","v":"Jardim Eldorado"},{"$f":"IF(VLOOKUP(A266,Itinerário!$A$3:$I$875,9,FALSE)=0,\"\",VLOOKUP(A266,Itinerário!$A$3:$I$875,9,FALSE))","v":"Jardim Eldorado"}]
[264,{"$f":"VLOOKUP(A267,Itinerário!$A$3:$I$875,3,FALSE)","v":"EDVALDO MACIEL DA SILVA"},{"$f":"VLOOKUP(A267,Itinerário!$A$3:$I$875,5,FALSE)","v":"SETEMBRO"},{"$f":"IF(VLOOKUP(A267,Itinerário!$A$3:$I$875,6,FALSE)=0,\"\",VLOOKUP(A267,Itinerário!$A$3:$I$875,6,FALSE))","v":22},"2018-09-22",{"$f":"IF(VLOOKUP(A267,Itinerário!$A$3:$I$875,7,FALSE)=0,\"\",VLOOKUP(A267,Itinerário!$A$3:$I$875,7,FALSE))","v":"Pregação "},{"$f":"IF(VLOOKUP(A267,Itinerário!$A$3:$I$875,8,FALSE)=0,\"\",VLOOKUP(A267,Itinerário!$A$3:$I$875,8,FALSE))","v":"São Sebastião"},{"$f":"IF(VLOOKUP(A267,Itinerário!$A$3:$I$875,9,FALSE)=0,\"\",VLOOKUP(A267,Itinerário!$A$3:$I$875,9,FALSE))","v":"Jardim Eldorado"}]
[265,{"$f":"VLOOKUP(A268,Itinerário!$A$3:$I$875,3,FALSE)","v":"EDVALDO MACIEL DA SILVA"},{"$f":"VLOOKUP(A268,Itinerário!$A$3:$I$875,5,FALSE)","v":"SETEMBRO"},{"$f":"IF(VLOOKUP(A268,Itinerário!$A$3:$I$875,6,FALSE)=0,\"\",VLOOKUP(A268,Itinerário!$A$3:$I$875,6,FALSE))","v":29},"2018-09-29",{"$f":"IF(VLOOKUP(A268,Itinerário!$A$3:$I$875,7,FALSE)=0,\"\",VLOOKUP(A268,Itinerário!$A$3:$I$875,7,FALSE))","v":"Colheita Zimbros"},{"$f":"IF(VLOOKUP(A268,Itinerário!$A$3:$I$875,8,FALSE)=0,\"\",VLOOKUP(A268,Itinerário!$A$3:$I$875,8,FALSE))","v":"Zimbros"},{"$f":"IF(VLOOKUP(A268,Itinerário!$A$3:$I$875,9,FALSE)=0,\"\",VLOOKUP(A268,Itinerário!$A$3:$I$875,9,FALSE))","v":"Itapema"}]
[266,{"$f":"VLOOKUP(A269,Itinerário!$A$3:$I$875,3,FALSE)","v":"EDVALDO MACIEL DA SILVA"},{"$f":"VLOOKUP(A269,Itinerário!$A$3:$I$875,5,FALSE)","v":"SETEMBRO"},{"$f":"IF(VLOOKUP(A269,Itinerário!$A$3:$I$875,6,FALSE)=0,\"\",VLOOKUP(A269,Itinerário!$A$3:$I$875,6,FALSE))","v":""},"00:00:00",{"$f":"IF(VLOOKUP(A269,Itinerário!$A$3:$I$875,7,FALSE)=0,\"\",VLOOKUP(A269,Itinerário!$A$3:$I$875,7,FALSE))","v":""},{"$f":"IF(VLOOKUP(A269,Itinerário!$A$3:$I$875,8,FALSE)=0,\"\",VLOOKUP(A269,Itinerário!$A$3:$I$875,8,FALSE))","v":""},{"$f":"IF(VLOOKUP(A269,Itinerário!$A$3:$I$875,9,FALSE)=0,\"\",VLOOKUP(A269,Itinerário!$A$3:$I$875,9,FALSE))","v":""}]
[267,{"$f":"VLOOKUP(A270,Itinerário!$A$3:$I$875,3,FALSE)","v":"EDVALDO MACIEL DA SILVA"},{"$f":"VLOOKUP(A270,Itinerário!$A$3:$I$875,5,FALSE)","v":"SETEMBRO"},{"$f":"IF(VLOOKUP(A270,Itinerário!$A$3:$I$875,6,FALSE)=0,\"\",VLOOKUP(A270,Itinerário!$A$3:$I$875,6,FALSE))","v":""},"00:00:00",{"$f":"IF(VLOOKUP(A270,Itinerário!$A$3:$I$875,7,FALSE)=0,\"\",VLOOKUP(A270,Itinerário!$A$3:$I$875,7,FALSE))","v":""},{"$f":"IF(VLOOKUP(A270,Itinerário!$A$3:$I$875,8,FALSE)=0,\"\",VLOOKUP(A270,Itinerário!$A$3:$I$875,8,FALSE))","v":""},{"$f":"IF(VLOOKUP(A270,Itinerário!$A$3:$I$875,9,FALSE)=0,\"\",VLOOKUP(A270,Itinerário!$A$3:$I$875,9,FALSE))","v":""}]
[268,{"$f":"VLOOKUP(A271,Itinerário!$A$3:$I$875,3,FALSE)","v":"EDVALDO MACIEL DA SILVA"},{"$f":"VLOOKUP(A271,Itinerário!$A$3:$I$875,5,FALSE)","v":"SETEMBRO"},{"$f":"IF(VLOOKUP(A271,Itinerário!$A$3:$I$875,6,FALSE)=0,\"\",VLOOKUP(A271,Itinerário!$A$3:$I$875,6,FALSE))","v":""},"00:00:00",{"$f":"IF(VLOOKUP(A271,Itinerário!$A$3:$I$875,7,FALSE)=0,\"\",VLOOKUP(A271,Itinerário!$A$3:$I$875,7,FALSE))","v":""},{"$f":"IF(VLOOKUP(A271,Itinerário!$A$3:$I$875,8,FALSE)=0,\"\",VLOOKUP(A271,Itinerário!$A$3:$I$875,8,FALSE))","v":""},{"$f":"IF(VLOOKUP(A271,Itinerário!$A$3:$I$875,9,FALSE)=0,\"\",VLOOKUP(A271,Itinerário!$A$3:$I$875,9,FALSE))","v":""}]
[269,{"$f":"VLOOKUP(A272,Itinerário!$A$3:$I$875,3,FALSE)","v":"EDVALDO MACIEL DA SILVA"},{"$f":"VLOOKUP(A272,Itinerário!$A$3:$I$875,5,FALSE)","v":"SETEMBRO"},{"$f":"IF(VLOOKUP(A272,Itinerário!$A$3:$I$875,6,FALSE)=0,\"\",VLOOKUP(A272,Itinerário!$A$3:$I$875,6,FALSE))","v":""},"00:00:00",{"$f":"IF(VLOOKUP(A272,Itinerário!$A$3:$I$875,7,FALSE)=0,\"\",VLOOKUP(A272,Itinerário!$A$3:$I$875,7,FALSE))","v":""},{"$f":"IF(VLOOKUP(A272,Itinerário!$A$3:$I$875,8,FALSE)=0,\"\",VLOOKUP(A272,Itinerário!$A$3:$I$875,8,FALSE))","v":""},{"$f":"IF(VLOOKUP(A272,Itinerário!$A$3:$I$875,9,FALSE)=0,\"\",VLOOKUP(A272,Itinerário!$A$3:$I$875,9,FALSE))","v":""}]
[270,{"$f":"VLOOKUP(A273,Itinerário!$A$3:$I$875,3,FALSE)","v":"EDVALDO MACIEL DA SILVA"},{"$f":"VLOOKUP(A273,Itinerário!$A$3:$I$875,5,FALSE)","v":"SETEMBRO"},{"$f":"IF(VLOOKUP(A273,Itinerário!$A$3:$I$875,6,FALSE)=0,\"\",VLOOKUP(A273,Itinerário!$A$3:$I$875,6,FALSE))","v":""},"00:00:00",{"$f":"IF(VLOOKUP(A273,Itinerário!$A$3:$I$875,7,FALSE)=0,\"\",VLOOKUP(A273,Itinerário!$A$3:$I$875,7,FALSE))","v":""},{"$f":"IF(VLOOKUP(A273,Itinerário!$A$3:$I$875,8,FALSE)=0,\"\",VLOOKUP(A273,Itinerário!$A$3:$I$875,8,FALSE))","v":""},{"$f":"IF(VLOOKUP(A273,Itinerário!$A$3:$I$875,9,FALSE)=0,\"\",VLOOKUP(A273,Itinerário!$A$3:$I$875,9,FALSE))","v":""}]
[271,{"$f":"VLOOKUP(A274,Itinerário!$A$3:$I$875,3,FALSE)","v":"EDVALDO MACIEL DA SILVA"},{"$f":"VLOOKUP(A274,Itinerário!$A$3:$I$875,5,FALSE)","v":"OUTUBRO"},{"$f":"IF(VLOOKUP(A274,Itinerário!$A$3:$I$875,6,FALSE)=0,\"\",VLOOKUP(A274,Itinerário!$A$3:$I$875,6,FALSE))","v":6},"2018-10-06",{"$f":"IF(VLOOKUP(A274,Itinerário!$A$3:$I$875,7,FALSE)=0,\"\",VLOOKUP(A274,Itinerário!$A$3:$I$875,7,FALSE))","v":"Pregação "},{"$f":"IF(VLOOKUP(A274,Itinerário!$A$3:$I$875,8,FALSE)=0,\"\",VLOOKUP(A274,Itinerário!$A$3:$I$875,8,FALSE))","v":"Tijucas"},{"$f":"IF(VLOOKUP(A274,Itinerário!$A$3:$I$875,9,FALSE)=0,\"\",VLOOKUP(A274,Itinerário!$A$3:$I$875,9,FALSE))","v":"Tijucas"}]
[272,{"$f":"VLOOKUP(A275,Itinerário!$A$3:$I$875,3,FALSE)","v":"EDVALDO MACIEL DA SILVA"},{"$f":"VLOOKUP(A275,Itinerário!$A$3:$I$875,5,FALSE)","v":"OUTUBRO"},{"$f":"IF(VLOOKUP(A275,Itinerário!$A$3:$I$875,6,FALSE)=0,\"\",VLOOKUP(A275,Itinerário!$A$3:$I$875,6,FALSE))","v":13},"2018-10-13",{"$f":"IF(VLOOKUP(A275,Itinerário!$A$3:$I$875,7,FALSE)=0,\"\",VLOOKUP(A275,Itinerário!$A$3:$I$875,7,FALSE))","v":"Lançamento da Colheita"},{"$f":"IF(VLOOKUP(A275,Itinerário!$A$3:$I$875,8,FALSE)=0,\"\",VLOOKUP(A275,Itinerário!$A$3:$I$875,8,FALSE))","v":"Alfredo Wagner"},{"$f":"IF(VLOOKUP(A275,Itinerário!$A$3:$I$875,9,FALSE)=0,\"\",VLOOKUP(A275,Itinerário!$A$3:$I$875,9,FALSE))","v":"Bom Retiro"}]
[273,{"$f":"VLOOKUP(A276,Itinerário!$A$3:$I$875,3,FALSE)","v":"EDVALDO MACIEL DA SILVA"},{"$f":"VLOOKUP(A276,Itinerário!$A$3:$I$875,5,FALSE)","v":"OUTUBRO"},{"$f":"IF(VLOOKUP(A276,Itinerário!$A$3:$I$875,6,FALSE)=0,\"\",VLOOKUP(A276,Itinerário!$A$3:$I$875,6,FALSE))","v":20},"2018-10-20",{"$f":"IF(VLOOKUP(A276,Itinerário!$A$3:$I$875,7,FALSE)=0,\"\",VLOOKUP(A276,Itinerário!$A$3:$I$875,7,FALSE))","v":"Colheita Lages"},{"$f":"IF(VLOOKUP(A276,Itinerário!$A$3:$I$875,8,FALSE)=0,\"\",VLOOKUP(A276,Itinerário!$A$3:$I$875,8,FALSE))","v":"Lages"},{"$f":"IF(VLOOKUP(A276,Itinerário!$A$3:$I$875,9,FALSE)=0,\"\",VLOOKUP(A276,Itinerário!$A$3:$I$875,9,FALSE))","v":"Lages"}]
[274,{"$f":"VLOOKUP(A277,Itinerário!$A$3:$I$875,3,FALSE)","v":"EDVALDO MACIEL DA SILVA"},{"$f":"VLOOKUP(A277,Itinerário!$A$3:$I$875,5,FALSE)","v":"OUTUBRO"},{"$f":"IF(VLOOKUP(A277,Itinerário!$A$3:$I$875,6,FALSE)=0,\"\",VLOOKUP(A277,Itinerário!$A$3:$I$875,6,FALSE))","v":27},"2018-10-27",{"$f":"IF(VLOOKUP(A277,Itinerário!$A$3:$I$875,7,FALSE)=0,\"\",VLOOKUP(A277,Itinerário!$A$3:$I$875,7,FALSE))","v":"Pregação "},{"$f":"IF(VLOOKUP(A277,Itinerário!$A$3:$I$875,8,FALSE)=0,\"\",VLOOKUP(A277,Itinerário!$A$3:$I$875,8,FALSE))","v":"Santa Helena"},{"$f":"IF(VLOOKUP(A277,Itinerário!$A$3:$I$875,9,FALSE)=0,\"\",VLOOKUP(A277,Itinerário!$A$3:$I$875,9,FALSE))","v":"Santa Helena"}]
[275,{"$f":"VLOOKUP(A278,Itinerário!$A$3:$I$875,3,FALSE)","v":"EDVALDO MACIEL DA SILVA"},{"$f":"VLOOKUP(A278,Itinerário!$A$3:$I$875,5,FALSE)","v":"OUTUBRO"},{"$f":"IF(VLOOKUP(A278,Itinerário!$A$3:$I$875,6,FALSE)=0,\"\",VLOOKUP(A278,Itinerário!$A$3:$I$875,6,FALSE))","v":""},"00:00:00",{"$f":"IF(VLOOKUP(A278,Itinerário!$A$3:$I$875,7,FALSE)=0,\"\",VLOOKUP(A278,Itinerário!$A$3:$I$875,7,FALSE))","v":""},{"$f":"IF(VLOOKUP(A278,Itinerário!$A$3:$I$875,8,FALSE)=0,\"\",VLOOKUP(A278,Itinerário!$A$3:$I$875,8,FALSE))","v":""},{"$f":"IF(VLOOKUP(A278,Itinerário!$A$3:$I$875,9,FALSE)=0,\"\",VLOOKUP(A278,Itinerário!$A$3:$I$875,9,FALSE))","v":""}]
[276,{"$f":"VLOOKUP(A279,Itinerário!$A$3:$I$875,3,FALSE)","v":"EDVALDO MACIEL DA SILVA"},{"$f":"VLOOKUP(A279,Itinerário!$A$3:$I$875,5,FALSE)","v":"OUTUBRO"},{"$f":"IF(VLOOKUP(A279,Itinerário!$A$3:$I$875,6,FALSE)=0,\"\",VLOOKUP(A279,Itinerário!$A$3:$I$875,6,FALSE))","v":""},"00:00:00",{"$f":"IF(VLOOKUP(A279,Itinerário!$A$3:$I$875,7,FALSE)=0,\"\",VLOOKUP(A279,Itinerário!$A$3:$I$875,7,FALSE))","v":""},{"$f":"IF(VLOOKUP(A279,Itinerário!$A$3:$I$875,8,FALSE)=0,\"\",VLOOKUP(A279,Itinerário!$A$3:$I$875,8,FALSE))","v":""},{"$f":"IF(VLOOKUP(A279,Itinerário!$A$3:$I$875,9,FALSE)=0,\"\",VLOOKUP(A279,Itinerário!$A$3:$I$875,9,FALSE))","v":""}]
[277,{"$f":"VLOOKUP(A280,Itinerário!$A$3:$I$875,3,FALSE)","v":"EDVALDO MACIEL DA SILVA"},{"$f":"VLOOKUP(A280,Itinerário!$A$3:$I$875,5,FALSE)","v":"OUTUBRO"},{"$f":"IF(VLOOKUP(A280,Itinerário!$A$3:$I$875,6,FALSE)=0,\"\",VLOOKUP(A280,Itinerário!$A$3:$I$875,6,FALSE))","v":""},"00:00:00",{"$f":"IF(VLOOKUP(A280,Itinerário!$A$3:$I$875,7,FALSE)=0,\"\",VLOOKUP(A280,Itinerário!$A$3:$I$875,7,FALSE))","v":""},{"$f":"IF(VLOOKUP(A280,Itinerário!$A$3:$I$875,8,FALSE)=0,\"\",VLOOKUP(A280,Itinerário!$A$3:$I$875,8,FALSE))","v":""},{"$f":"IF(VLOOKUP(A280,Itinerário!$A$3:$I$875,9,FALSE)=0,\"\",VLOOKUP(A280,Itinerário!$A$3:$I$875,9,FALSE))","v":""}]
[278,{"$f":"VLOOKUP(A281,Itinerário!$A$3:$I$875,3,FALSE)","v":"EDVALDO MACIEL DA SILVA"},{"$f":"VLOOKUP(A281,Itinerário!$A$3:$I$875,5,FALSE)","v":"OUTUBRO"},{"$f":"IF(VLOOKUP(A281,Itinerário!$A$3:$I$875,6,FALSE)=0,\"\",VLOOKUP(A281,Itinerário!$A$3:$I$875,6,FALSE))","v":""},"00:00:00",{"$f":"IF(VLOOKUP(A281,Itinerário!$A$3:$I$875,7,FALSE)=0,\"\",VLOOKUP(A281,Itinerário!$A$3:$I$875,7,FALSE))","v":""},{"$f":"IF(VLOOKUP(A281,Itinerário!$A$3:$I$875,8,FALSE)=0,\"\",VLOOKUP(A281,Itinerário!$A$3:$I$875,8,FALSE))","v":""},{"$f":"IF(VLOOKUP(A281,Itinerário!$A$3:$I$875,9,FALSE)=0,\"\",VLOOKUP(A281,Itinerário!$A$3:$I$875,9,FALSE))","v":""}]
[279,{"$f":"VLOOKUP(A282,Itinerário!$A$3:$I$875,3,FALSE)","v":"EDVALDO MACIEL DA SILVA"},{"$f":"VLOOKUP(A282,Itinerário!$A$3:$I$875,5,FALSE)","v":"OUTUBRO"},{"$f":"IF(VLOOKUP(A282,Itinerário!$A$3:$I$875,6,FALSE)=0,\"\",VLOOKUP(A282,Itinerário!$A$3:$I$875,6,FALSE))","v":""},"00:00:00",{"$f":"IF(VLOOKUP(A282,Itinerário!$A$3:$I$875,7,FALSE)=0,\"\",VLOOKUP(A282,Itinerário!$A$3:$I$875,7,FALSE))","v":""},{"$f":"IF(VLOOKUP(A282,Itinerário!$A$3:$I$875,8,FALSE)=0,\"\",VLOOKUP(A282,Itinerário!$A$3:$I$875,8,FALSE))","v":""},{"$f":"IF(VLOOKUP(A282,Itinerário!$A$3:$I$875,9,FALSE)=0,\"\",VLOOKUP(A282,Itinerário!$A$3:$I$875,9,FALSE))","v":""}]
[280,{"$f":"VLOOKUP(A283,Itinerário!$A$3:$I$875,3,FALSE)","v":"EDVALDO MACIEL DA SILVA"},{"$f":"VLOOKUP(A283,Itinerário!$A$3:$I$875,5,FALSE)","v":"OUTUBRO"},{"$f":"IF(VLOOKUP(A283,Itinerário!$A$3:$I$875,6,FALSE)=0,\"\",VLOOKUP(A283,Itinerário!$A$3:$I$875,6,FALSE))","v":""},"00:00:00",{"$f":"IF(VLOOKUP(A283,Itinerário!$A$3:$I$875,7,FALSE)=0,\"\",VLOOKUP(A283,Itinerário!$A$3:$I$875,7,FALSE))","v":""},{"$f":"IF(VLOOKUP(A283,Itinerário!$A$3:$I$875,8,FALSE)=0,\"\",VLOOKUP(A283,Itinerário!$A$3:$I$875,8,FALSE))","v":""},{"$f":"IF(VLOOKUP(A283,Itinerário!$A$3:$I$875,9,FALSE)=0,\"\",VLOOKUP(A283,Itinerário!$A$3:$I$875,9,FALSE))","v":""}]
[281,{"$f":"VLOOKUP(A284,Itinerário!$A$3:$I$875,3,FALSE)","v":"EDVALDO MACIEL DA SILVA"},{"$f":"VLOOKUP(A284,Itinerário!$A$3:$I$875,5,FALSE)","v":"NOVEMBRO"},{"$f":"IF(VLOOKUP(A284,Itinerário!$A$3:$I$875,6,FALSE)=0,\"\",VLOOKUP(A284,Itinerário!$A$3:$I$875,6,FALSE))","v":"03 a 10"},"00:00:00",{"$f":"IF(VLOOKUP(A284,Itinerário!$A$3:$I$875,7,FALSE)=0,\"\",VLOOKUP(A284,Itinerário!$A$3:$I$875,7,FALSE))","v":"Impacto Cricíuma"},{"$f":"IF(VLOOKUP(A284,Itinerário!$A$3:$I$875,8,FALSE)=0,\"\",VLOOKUP(A284,Itinerário!$A$3:$I$875,8,FALSE))","v":"AC"},{"$f":"IF(VLOOKUP(A284,Itinerário!$A$3:$I$875,9,FALSE)=0,\"\",VLOOKUP(A284,Itinerário!$A$3:$I$875,9,FALSE))","v":"AC"}]
[282,{"$f":"VLOOKUP(A285,Itinerário!$A$3:$I$875,3,FALSE)","v":"EDVALDO MACIEL DA SILVA"},{"$f":"VLOOKUP(A285,Itinerário!$A$3:$I$875,5,FALSE)","v":"NOVEMBRO"},{"$f":"IF(VLOOKUP(A285,Itinerário!$A$3:$I$875,6,FALSE)=0,\"\",VLOOKUP(A285,Itinerário!$A$3:$I$875,6,FALSE))","v":17},"2018-11-17",{"$f":"IF(VLOOKUP(A285,Itinerário!$A$3:$I$875,7,FALSE)=0,\"\",VLOOKUP(A285,Itinerário!$A$3:$I$875,7,FALSE))","v":"Pregação "},{"$f":"IF(VLOOKUP(A285,Itinerário!$A$3:$I$875,8,FALSE)=0,\"\",VLOOKUP(A285,Itinerário!$A$3:$I$875,8,FALSE))","v":"Jardim Atlântico"},{"$f":"IF(VLOOKUP(A285,Itinerário!$A$3:$I$875,9,FALSE)=0,\"\",VLOOKUP(A285,Itinerário!$A$3:$I$875,9,FALSE))","v":"Jardim Atlântico"}]
[283,{"$f":"VLOOKUP(A286,Itinerário!$A$3:$I$875,3,FALSE)","v":"EDVALDO MACIEL DA SILVA"},{"$f":"VLOOKUP(A286,Itinerário!$A$3:$I$875,5,FALSE)","v":"NOVEMBRO"},{"$f":"IF(VLOOKUP(A286,Itinerário!$A$3:$I$875,6,FALSE)=0,\"\",VLOOKUP(A286,Itinerário!$A$3:$I$875,6,FALSE))","v":24},"2018-11-24",{"$f":"IF(VLOOKUP(A286,Itinerário!$A$3:$I$875,7,FALSE)=0,\"\",VLOOKUP(A286,Itinerário!$A$3:$I$875,7,FALSE))","v":"Colheita Bom Retiro"},{"$f":"IF(VLOOKUP(A286,Itinerário!$A$3:$I$875,8,FALSE)=0,\"\",VLOOKUP(A286,Itinerário!$A$3:$I$875,8,FALSE))","v":"Bom Retiro"},{"$f":"IF(VLOOKUP(A286,Itinerário!$A$3:$I$875,9,FALSE)=0,\"\",VLOOKUP(A286,Itinerário!$A$3:$I$875,9,FALSE))","v":"Bom Retiro"}]
[284,{"$f":"VLOOKUP(A287,Itinerário!$A$3:$I$875,3,FALSE)","v":"EDVALDO MACIEL DA SILVA"},{"$f":"VLOOKUP(A287,Itinerário!$A$3:$I$875,5,FALSE)","v":"NOVEMBRO"},{"$f":"IF(VLOOKUP(A287,Itinerário!$A$3:$I$875,6,FALSE)=0,\"\",VLOOKUP(A287,Itinerário!$A$3:$I$875,6,FALSE))","v":""},"00:00:00",{"$f":"IF(VLOOKUP(A287,Itinerário!$A$3:$I$875,7,FALSE)=0,\"\",VLOOKUP(A287,Itinerário!$A$3:$I$875,7,FALSE))","v":""},{"$f":"IF(VLOOKUP(A287,Itinerário!$A$3:$I$875,8,FALSE)=0,\"\",VLOOKUP(A287,Itinerário!$A$3:$I$875,8,FALSE))","v":""},{"$f":"IF(VLOOKUP(A287,Itinerário!$A$3:$I$875,9,FALSE)=0,\"\",VLOOKUP(A287,Itinerário!$A$3:$I$875,9,FALSE))","v":""}]
[285,{"$f":"VLOOKUP(A288,Itinerário!$A$3:$I$875,3,FALSE)","v":"EDVALDO MACIEL DA SILVA"},{"$f":"VLOOKUP(A288,Itinerário!$A$3:$I$875,5,FALSE)","v":"NOVEMBRO"},{"$f":"IF(VLOOKUP(A288,Itinerário!$A$3:$I$875,6,FALSE)=0,\"\",VLOOKUP(A288,Itinerário!$A$3:$I$875,6,FALSE))","v":""},"00:00:00",{"$f":"IF(VLOOKUP(A288,Itinerário!$A$3:$I$875,7,FALSE)=0,\"\",VLOOKUP(A288,Itinerário!$A$3:$I$875,7,FALSE))","v":""},{"$f":"IF(VLOOKUP(A288,Itinerário!$A$3:$I$875,8,FALSE)=0,\"\",VLOOKUP(A288,Itinerário!$A$3:$I$875,8,FALSE))","v":""},{"$f":"IF(VLOOKUP(A288,Itinerário!$A$3:$I$875,9,FALSE)=0,\"\",VLOOKUP(A288,Itinerário!$A$3:$I$875,9,FALSE))","v":""}]
[286,{"$f":"VLOOKUP(A289,Itinerário!$A$3:$I$875,3,FALSE)","v":"EDVALDO MACIEL DA SILVA"},{"$f":"VLOOKUP(A289,Itinerário!$A$3:$I$875,5,FALSE)","v":"NOVEMBRO"},{"$f":"IF(VLOOKUP(A289,Itinerário!$A$3:$I$875,6,FALSE)=0,\"\",VLOOKUP(A289,Itinerário!$A$3:$I$875,6,FALSE))","v":""},"00:00:00",{"$f":"IF(VLOOKUP(A289,Itinerário!$A$3:$I$875,7,FALSE)=0,\"\",VLOOKUP(A289,Itinerário!$A$3:$I$875,7,FALSE))","v":""},{"$f":"IF(VLOOKUP(A289,Itinerário!$A$3:$I$875,8,FALSE)=0,\"\",VLOOKUP(A289,Itinerário!$A$3:$I$875,8,FALSE))","v":""},{"$f":"IF(VLOOKUP(A289,Itinerário!$A$3:$I$875,9,FALSE)=0,\"\",VLOOKUP(A289,Itinerário!$A$3:$I$875,9,FALSE))","v":""}]
[287,{"$f":"VLOOKUP(A290,Itinerário!$A$3:$I$875,3,FALSE)","v":"EDVALDO MACIEL DA SILVA"},{"$f":"VLOOKUP(A290,Itinerário!$A$3:$I$875,5,FALSE)","v":"NOVEMBRO"},{"$f":"IF(VLOOKUP(A290,Itinerário!$A$3:$I$875,6,FALSE)=0,\"\",VLOOKUP(A290,Itinerário!$A$3:$I$875,6,FALSE))","v":""},"00:00:00",{"$f":"IF(VLOOKUP(A290,Itinerário!$A$3:$I$875,7,FALSE)=0,\"\",VLOOKUP(A290,Itinerário!$A$3:$I$875,7,FALSE))","v":""},{"$f":"IF(VLOOKUP(A290,Itinerário!$A$3:$I$875,8,FALSE)=0,\"\",VLOOKUP(A290,Itinerário!$A$3:$I$875,8,FALSE))","v":""},{"$f":"IF(VLOOKUP(A290,Itinerário!$A$3:$I$875,9,FALSE)=0,\"\",VLOOKUP(A290,Itinerário!$A$3:$I$875,9,FALSE))","v":""}]
[288,{"$f":"VLOOKUP(A291,Itinerário!$A$3:$I$875,3,FALSE)","v":"EDVALDO MACIEL DA SILVA"},{"$f":"VLOOKUP(A291,Itinerário!$A$3:$I$875,5,FALSE)","v":"NOVEMBRO"},{"$f":"IF(VLOOKUP(A291,Itinerário!$A$3:$I$875,6,FALSE)=0,\"\",VLOOKUP(A291,Itinerário!$A$3:$I$875,6,FALSE))","v":""},"00:00:00",{"$f":"IF(VLOOKUP(A291,Itinerário!$A$3:$I$875,7,FALSE)=0,\"\",VLOOKUP(A291,Itinerário!$A$3:$I$875,7,FALSE))","v":""},{"$f":"IF(VLOOKUP(A291,Itinerário!$A$3:$I$875,8,FALSE)=0,\"\",VLOOKUP(A291,Itinerário!$A$3:$I$875,8,FALSE))","v":""},{"$f":"IF(VLOOKUP(A291,Itinerário!$A$3:$I$875,9,FALSE)=0,\"\",VLOOKUP(A291,Itinerário!$A$3:$I$875,9,FALSE))","v":""}]
[289,{"$f":"VLOOKUP(A292,Itinerário!$A$3:$I$875,3,FALSE)","v":"EDVALDO MACIEL DA SILVA"},{"$f":"VLOOKUP(A292,Itinerário!$A$3:$I$875,5,FALSE)","v":"NOVEMBRO"},{"$f":"IF(VLOOKUP(A292,Itinerário!$A$3:$I$875,6,FALSE)=0,\"\",VLOOKUP(A292,Itinerário!$A$3:$I$875,6,FALSE))","v":""},"00:00:00",{"$f":"IF(VLOOKUP(A292,Itinerário!$A$3:$I$875,7,FALSE)=0,\"\",VLOOKUP(A292,Itinerário!$A$3:$I$875,7,FALSE))","v":""},{"$f":"IF(VLOOKUP(A292,Itinerário!$A$3:$I$875,8,FALSE)=0,\"\",VLOOKUP(A292,Itinerário!$A$3:$I$875,8,FALSE))","v":""},{"$f":"IF(VLOOKUP(A292,Itinerário!$A$3:$I$875,9,FALSE)=0,\"\",VLOOKUP(A292,Itinerário!$A$3:$I$875,9,FALSE))","v":""}]
[290,{"$f":"VLOOKUP(A293,Itinerário!$A$3:$I$875,3,FALSE)","v":"EDVALDO MACIEL DA SILVA"},{"$f":"VLOOKUP(A293,Itinerário!$A$3:$I$875,5,FALSE)","v":"NOVEMBRO"},{"$f":"IF(VLOOKUP(A293,Itinerário!$A$3:$I$875,6,FALSE)=0,\"\",VLOOKUP(A293,Itinerário!$A$3:$I$875,6,FALSE))","v":""},"00:00:00",{"$f":"IF(VLOOKUP(A293,Itinerário!$A$3:$I$875,7,FALSE)=0,\"\",VLOOKUP(A293,Itinerário!$A$3:$I$875,7,FALSE))","v":""},{"$f":"IF(VLOOKUP(A293,Itinerário!$A$3:$I$875,8,FALSE)=0,\"\",VLOOKUP(A293,Itinerário!$A$3:$I$875,8,FALSE))","v":""},{"$f":"IF(VLOOKUP(A293,Itinerário!$A$3:$I$875,9,FALSE)=0,\"\",VLOOKUP(A293,Itinerário!$A$3:$I$875,9,FALSE))","v":""}]
[291,{"$f":"VLOOKUP(A294,Itinerário!$A$3:$I$875,3,FALSE)","v":"EDVALDO MACIEL DA SILVA"},{"$f":"VLOOKUP(A294,Itinerário!$A$3:$I$875,5,FALSE)","v":"DEZEMBRO"},{"$f":"IF(VLOOKUP(A294,Itinerário!$A$3:$I$875,6,FALSE)=0,\"\",VLOOKUP(A294,Itinerário!$A$3:$I$875,6,FALSE))","v":1},"2018-12-01",{"$f":"IF(VLOOKUP(A294,Itinerário!$A$3:$I$875,7,FALSE)=0,\"\",VLOOKUP(A294,Itinerário!$A$3:$I$875,7,FALSE))","v":"Colheita/Plantio Bom Retiro"},{"$f":"IF(VLOOKUP(A294,Itinerário!$A$3:$I$875,8,FALSE)=0,\"\",VLOOKUP(A294,Itinerário!$A$3:$I$875,8,FALSE))","v":"Bom Retiro"},{"$f":"IF(VLOOKUP(A294,Itinerário!$A$3:$I$875,9,FALSE)=0,\"\",VLOOKUP(A294,Itinerário!$A$3:$I$875,9,FALSE))","v":"Bom Retiro"}]
[292,{"$f":"VLOOKUP(A295,Itinerário!$A$3:$I$875,3,FALSE)","v":"EDVALDO MACIEL DA SILVA"},{"$f":"VLOOKUP(A295,Itinerário!$A$3:$I$875,5,FALSE)","v":"DEZEMBRO"},{"$f":"IF(VLOOKUP(A295,Itinerário!$A$3:$I$875,6,FALSE)=0,\"\",VLOOKUP(A295,Itinerário!$A$3:$I$875,6,FALSE))","v":""},"00:00:00",{"$f":"IF(VLOOKUP(A295,Itinerário!$A$3:$I$875,7,FALSE)=0,\"\",VLOOKUP(A295,Itinerário!$A$3:$I$875,7,FALSE))","v":""},{"$f":"IF(VLOOKUP(A295,Itinerário!$A$3:$I$875,8,FALSE)=0,\"\",VLOOKUP(A295,Itinerário!$A$3:$I$875,8,FALSE))","v":""},{"$f":"IF(VLOOKUP(A295,Itinerário!$A$3:$I$875,9,FALSE)=0,\"\",VLOOKUP(A295,Itinerário!$A$3:$I$875,9,FALSE))","v":""}]
[293,{"$f":"VLOOKUP(A296,Itinerário!$A$3:$I$875,3,FALSE)","v":"EDVALDO MACIEL DA SILVA"},{"$f":"VLOOKUP(A296,Itinerário!$A$3:$I$875,5,FALSE)","v":"DEZEMBRO"},{"$f":"IF(VLOOKUP(A296,Itinerário!$A$3:$I$875,6,FALSE)=0,\"\",VLOOKUP(A296,Itinerário!$A$3:$I$875,6,FALSE))","v":""},"00:00:00",{"$f":"IF(VLOOKUP(A296,Itinerário!$A$3:$I$875,7,FALSE)=0,\"\",VLOOKUP(A296,Itinerário!$A$3:$I$875,7,FALSE))","v":""},{"$f":"IF(VLOOKUP(A296,Itinerário!$A$3:$I$875,8,FALSE)=0,\"\",VLOOKUP(A296,Itinerário!$A$3:$I$875,8,FALSE))","v":""},{"$f":"IF(VLOOKUP(A296,Itinerário!$A$3:$I$875,9,FALSE)=0,\"\",VLOOKUP(A296,Itinerário!$A$3:$I$875,9,FALSE))","v":""}]
[294,{"$f":"VLOOKUP(A297,Itinerário!$A$3:$I$875,3,FALSE)","v":"EDVALDO MACIEL DA SILVA"},{"$f":"VLOOKUP(A297,Itinerário!$A$3:$I$875,5,FALSE)","v":"DEZEMBRO"},{"$f":"IF(VLOOKUP(A297,Itinerário!$A$3:$I$875,6,FALSE)=0,\"\",VLOOKUP(A297,Itinerário!$A$3:$I$875,6,FALSE))","v":""},"00:00:00",{"$f":"IF(VLOOKUP(A297,Itinerário!$A$3:$I$875,7,FALSE)=0,\"\",VLOOKUP(A297,Itinerário!$A$3:$I$875,7,FALSE))","v":""},{"$f":"IF(VLOOKUP(A297,Itinerário!$A$3:$I$875,8,FALSE)=0,\"\",VLOOKUP(A297,Itinerário!$A$3:$I$875,8,FALSE))","v":""},{"$f":"IF(VLOOKUP(A297,Itinerário!$A$3:$I$875,9,FALSE)=0,\"\",VLOOKUP(A297,Itinerário!$A$3:$I$875,9,FALSE))","v":""}]
[295,{"$f":"VLOOKUP(A298,Itinerário!$A$3:$I$875,3,FALSE)","v":"EDVALDO MACIEL DA SILVA"},{"$f":"VLOOKUP(A298,Itinerário!$A$3:$I$875,5,FALSE)","v":"DEZEMBRO"},{"$f":"IF(VLOOKUP(A298,Itinerário!$A$3:$I$875,6,FALSE)=0,\"\",VLOOKUP(A298,Itinerário!$A$3:$I$875,6,FALSE))","v":""},"00:00:00",{"$f":"IF(VLOOKUP(A298,Itinerário!$A$3:$I$875,7,FALSE)=0,\"\",VLOOKUP(A298,Itinerário!$A$3:$I$875,7,FALSE))","v":""},{"$f":"IF(VLOOKUP(A298,Itinerário!$A$3:$I$875,8,FALSE)=0,\"\",VLOOKUP(A298,Itinerário!$A$3:$I$875,8,FALSE))","v":""},{"$f":"IF(VLOOKUP(A298,Itinerário!$A$3:$I$875,9,FALSE)=0,\"\",VLOOKUP(A298,Itinerário!$A$3:$I$875,9,FALSE))","v":""}]
[296,{"$f":"VLOOKUP(A299,Itinerário!$A$3:$I$875,3,FALSE)","v":"EDVALDO MACIEL DA SILVA"},{"$f":"VLOOKUP(A299,Itinerário!$A$3:$I$875,5,FALSE)","v":"DEZEMBRO"},{"$f":"IF(VLOOKUP(A299,Itinerário!$A$3:$I$875,6,FALSE)=0,\"\",VLOOKUP(A299,Itinerário!$A$3:$I$875,6,FALSE))","v":""},"00:00:00",{"$f":"IF(VLOOKUP(A299,Itinerário!$A$3:$I$875,7,FALSE)=0,\"\",VLOOKUP(A299,Itinerário!$A$3:$I$875,7,FALSE))","v":""},{"$f":"IF(VLOOKUP(A299,Itinerário!$A$3:$I$875,8,FALSE)=0,\"\",VLOOKUP(A299,Itinerário!$A$3:$I$875,8,FALSE))","v":""},{"$f":"IF(VLOOKUP(A299,Itinerário!$A$3:$I$875,9,FALSE)=0,\"\",VLOOKUP(A299,Itinerário!$A$3:$I$875,9,FALSE))","v":""}]
[297,{"$f":"VLOOKUP(A300,Itinerário!$A$3:$I$875,3,FALSE)","v":"EDVALDO MACIEL DA SILVA"},{"$f":"VLOOKUP(A300,Itinerário!$A$3:$I$875,5,FALSE)","v":"DEZEMBRO"},{"$f":"IF(VLOOKUP(A300,Itinerário!$A$3:$I$875,6,FALSE)=0,\"\",VLOOKUP(A300,Itinerário!$A$3:$I$875,6,FALSE))","v":""},"00:00:00",{"$f":"IF(VLOOKUP(A300,Itinerário!$A$3:$I$875,7,FALSE)=0,\"\",VLOOKUP(A300,Itinerário!$A$3:$I$875,7,FALSE))","v":""},{"$f":"IF(VLOOKUP(A300,Itinerário!$A$3:$I$875,8,FALSE)=0,\"\",VLOOKUP(A300,Itinerário!$A$3:$I$875,8,FALSE))","v":""},{"$f":"IF(VLOOKUP(A300,Itinerário!$A$3:$I$875,9,FALSE)=0,\"\",VLOOKUP(A300,Itinerário!$A$3:$I$875,9,FALSE))","v":""}]
[298,{"$f":"VLOOKUP(A301,Itinerário!$A$3:$I$875,3,FALSE)","v":"EDVALDO MACIEL DA SILVA"},{"$f":"VLOOKUP(A301,Itinerário!$A$3:$I$875,5,FALSE)","v":"DEZEMBRO"},{"$f":"IF(VLOOKUP(A301,Itinerário!$A$3:$I$875,6,FALSE)=0,\"\",VLOOKUP(A301,Itinerário!$A$3:$I$875,6,FALSE))","v":""},"00:00:00",{"$f":"IF(VLOOKUP(A301,Itinerário!$A$3:$I$875,7,FALSE)=0,\"\",VLOOKUP(A301,Itinerário!$A$3:$I$875,7,FALSE))","v":""},{"$f":"IF(VLOOKUP(A301,Itinerário!$A$3:$I$875,8,FALSE)=0,\"\",VLOOKUP(A301,Itinerário!$A$3:$I$875,8,FALSE))","v":""},{"$f":"IF(VLOOKUP(A301,Itinerário!$A$3:$I$875,9,FALSE)=0,\"\",VLOOKUP(A301,Itinerário!$A$3:$I$875,9,FALSE))","v":""}]
[299,{"$f":"VLOOKUP(A302,Itinerário!$A$3:$I$875,3,FALSE)","v":"EDVALDO MACIEL DA SILVA"},{"$f":"VLOOKUP(A302,Itinerário!$A$3:$I$875,5,FALSE)","v":"DEZEMBRO"},{"$f":"IF(VLOOKUP(A302,Itinerário!$A$3:$I$875,6,FALSE)=0,\"\",VLOOKUP(A302,Itinerário!$A$3:$I$875,6,FALSE))","v":""},"00:00:00",{"$f":"IF(VLOOKUP(A302,Itinerário!$A$3:$I$875,7,FALSE)=0,\"\",VLOOKUP(A302,Itinerário!$A$3:$I$875,7,FALSE))","v":""},{"$f":"IF(VLOOKUP(A302,Itinerário!$A$3:$I$875,8,FALSE)=0,\"\",VLOOKUP(A302,Itinerário!$A$3:$I$875,8,FALSE))","v":""},{"$f":"IF(VLOOKUP(A302,Itinerário!$A$3:$I$875,9,FALSE)=0,\"\",VLOOKUP(A302,Itinerário!$A$3:$I$875,9,FALSE))","v":""}]
[300,{"$f":"VLOOKUP(A303,Itinerário!$A$3:$I$875,3,FALSE)","v":"EDVALDO MACIEL DA SILVA"},{"$f":"VLOOKUP(A303,Itinerário!$A$3:$I$875,5,FALSE)","v":"DEZEMBRO"},{"$f":"IF(VLOOKUP(A303,Itinerário!$A$3:$I$875,6,FALSE)=0,\"\",VLOOKUP(A303,Itinerário!$A$3:$I$875,6,FALSE))","v":""},"00:00:00",{"$f":"IF(VLOOKUP(A303,Itinerário!$A$3:$I$875,7,FALSE)=0,\"\",VLOOKUP(A303,Itinerário!$A$3:$I$875,7,FALSE))","v":""},{"$f":"IF(VLOOKUP(A303,Itinerário!$A$3:$I$875,8,FALSE)=0,\"\",VLOOKUP(A303,Itinerário!$A$3:$I$875,8,FALSE))","v":""},{"$f":"IF(VLOOKUP(A303,Itinerário!$A$3:$I$875,9,FALSE)=0,\"\",VLOOKUP(A303,Itinerário!$A$3:$I$875,9,FALSE))","v":""}]
[301,{"$f":"VLOOKUP(A304,Itinerário!$A$3:$I$875,3,FALSE)","v":"EVANDRO PEREIRA DE VARGAS"},{"$f":"VLOOKUP(A304,Itinerário!$A$3:$I$875,5,FALSE)","v":"JULHO"},{"$f":"IF(VLOOKUP(A304,Itinerário!$A$3:$I$875,6,FALSE)=0,\"\",VLOOKUP(A304,Itinerário!$A$3:$I$875,6,FALSE))","v":7},"2018-07-07",{"$f":"IF(VLOOKUP(A304,Itinerário!$A$3:$I$875,7,FALSE)=0,\"\",VLOOKUP(A304,Itinerário!$A$3:$I$875,7,FALSE))","v":"Pregação "},{"$f":"IF(VLOOKUP(A304,Itinerário!$A$3:$I$875,8,FALSE)=0,\"\",VLOOKUP(A304,Itinerário!$A$3:$I$875,8,FALSE))","v":"Capinzal"},{"$f":"IF(VLOOKUP(A304,Itinerário!$A$3:$I$875,9,FALSE)=0,\"\",VLOOKUP(A304,Itinerário!$A$3:$I$875,9,FALSE))","v":"Joaçaba"}]
[302,{"$f":"VLOOKUP(A305,Itinerário!$A$3:$I$875,3,FALSE)","v":"EVANDRO PEREIRA DE VARGAS"},{"$f":"VLOOKUP(A305,Itinerário!$A$3:$I$875,5,FALSE)","v":"JULHO"},{"$f":"IF(VLOOKUP(A305,Itinerário!$A$3:$I$875,6,FALSE)=0,\"\",VLOOKUP(A305,Itinerário!$A$3:$I$875,6,FALSE))","v":"14-21"},"00:00:00",{"$f":"IF(VLOOKUP(A305,Itinerário!$A$3:$I$875,7,FALSE)=0,\"\",VLOOKUP(A305,Itinerário!$A$3:$I$875,7,FALSE))","v":"Férias"},{"$f":"IF(VLOOKUP(A305,Itinerário!$A$3:$I$875,8,FALSE)=0,\"\",VLOOKUP(A305,Itinerário!$A$3:$I$875,8,FALSE))","v":""},{"$f":"IF(VLOOKUP(A305,Itinerário!$A$3:$I$875,9,FALSE)=0,\"\",VLOOKUP(A305,Itinerário!$A$3:$I$875,9,FALSE))","v":""}]
[303,{"$f":"VLOOKUP(A306,Itinerário!$A$3:$I$875,3,FALSE)","v":"EVANDRO PEREIRA DE VARGAS"},{"$f":"VLOOKUP(A306,Itinerário!$A$3:$I$875,5,FALSE)","v":"JULHO"},{"$f":"IF(VLOOKUP(A306,Itinerário!$A$3:$I$875,6,FALSE)=0,\"\",VLOOKUP(A306,Itinerário!$A$3:$I$875,6,FALSE))","v":28},"2018-07-28",{"$f":"IF(VLOOKUP(A306,Itinerário!$A$3:$I$875,7,FALSE)=0,\"\",VLOOKUP(A306,Itinerário!$A$3:$I$875,7,FALSE))","v":"Pregação (programa Colportagem)"},{"$f":"IF(VLOOKUP(A306,Itinerário!$A$3:$I$875,8,FALSE)=0,\"\",VLOOKUP(A306,Itinerário!$A$3:$I$875,8,FALSE))","v":"Navegantes"},{"$f":"IF(VLOOKUP(A306,Itinerário!$A$3:$I$875,9,FALSE)=0,\"\",VLOOKUP(A306,Itinerário!$A$3:$I$875,9,FALSE))","v":"Navegantes"}]
[304,{"$f":"VLOOKUP(A307,Itinerário!$A$3:$I$875,3,FALSE)","v":"EVANDRO PEREIRA DE VARGAS"},{"$f":"VLOOKUP(A307,Itinerário!$A$3:$I$875,5,FALSE)","v":"JULHO"},{"$f":"IF(VLOOKUP(A307,Itinerário!$A$3:$I$875,6,FALSE)=0,\"\",VLOOKUP(A307,Itinerário!$A$3:$I$875,6,FALSE))","v":""},"00:00:00",{"$f":"IF(VLOOKUP(A307,Itinerário!$A$3:$I$875,7,FALSE)=0,\"\",VLOOKUP(A307,Itinerário!$A$3:$I$875,7,FALSE))","v":""},{"$f":"IF(VLOOKUP(A307,Itinerário!$A$3:$I$875,8,FALSE)=0,\"\",VLOOKUP(A307,Itinerário!$A$3:$I$875,8,FALSE))","v":""},{"$f":"IF(VLOOKUP(A307,Itinerário!$A$3:$I$875,9,FALSE)=0,\"\",VLOOKUP(A307,Itinerário!$A$3:$I$875,9,FALSE))","v":""}]
[305,{"$f":"VLOOKUP(A308,Itinerário!$A$3:$I$875,3,FALSE)","v":"EVANDRO PEREIRA DE VARGAS"},{"$f":"VLOOKUP(A308,Itinerário!$A$3:$I$875,5,FALSE)","v":"JULHO"},{"$f":"IF(VLOOKUP(A308,Itinerário!$A$3:$I$875,6,FALSE)=0,\"\",VLOOKUP(A308,Itinerário!$A$3:$I$875,6,FALSE))","v":""},"00:00:00",{"$f":"IF(VLOOKUP(A308,Itinerário!$A$3:$I$875,7,FALSE)=0,\"\",VLOOKUP(A308,Itinerário!$A$3:$I$875,7,FALSE))","v":""},{"$f":"IF(VLOOKUP(A308,Itinerário!$A$3:$I$875,8,FALSE)=0,\"\",VLOOKUP(A308,Itinerário!$A$3:$I$875,8,FALSE))","v":""},{"$f":"IF(VLOOKUP(A308,Itinerário!$A$3:$I$875,9,FALSE)=0,\"\",VLOOKUP(A308,Itinerário!$A$3:$I$875,9,FALSE))","v":""}]
[306,{"$f":"VLOOKUP(A309,Itinerário!$A$3:$I$875,3,FALSE)","v":"EVANDRO PEREIRA DE VARGAS"},{"$f":"VLOOKUP(A309,Itinerário!$A$3:$I$875,5,FALSE)","v":"JULHO"},{"$f":"IF(VLOOKUP(A309,Itinerário!$A$3:$I$875,6,FALSE)=0,\"\",VLOOKUP(A309,Itinerário!$A$3:$I$875,6,FALSE))","v":""},"00:00:00",{"$f":"IF(VLOOKUP(A309,Itinerário!$A$3:$I$875,7,FALSE)=0,\"\",VLOOKUP(A309,Itinerário!$A$3:$I$875,7,FALSE))","v":""},{"$f":"IF(VLOOKUP(A309,Itinerário!$A$3:$I$875,8,FALSE)=0,\"\",VLOOKUP(A309,Itinerário!$A$3:$I$875,8,FALSE))","v":""},{"$f":"IF(VLOOKUP(A309,Itinerário!$A$3:$I$875,9,FALSE)=0,\"\",VLOOKUP(A309,Itinerário!$A$3:$I$875,9,FALSE))","v":""}]
[307,{"$f":"VLOOKUP(A310,Itinerário!$A$3:$I$875,3,FALSE)","v":"EVANDRO PEREIRA DE VARGAS"},{"$f":"VLOOKUP(A310,Itinerário!$A$3:$I$875,5,FALSE)","v":"JULHO"},{"$f":"IF(VLOOKUP(A310,Itinerário!$A$3:$I$875,6,FALSE)=0,\"\",VLOOKUP(A310,Itinerário!$A$3:$I$875,6,FALSE))","v":""},"00:00:00",{"$f":"IF(VLOOKUP(A310,Itinerário!$A$3:$I$875,7,FALSE)=0,\"\",VLOOKUP(A310,Itinerário!$A$3:$I$875,7,FALSE))","v":""},{"$f":"IF(VLOOKUP(A310,Itinerário!$A$3:$I$875,8,FALSE)=0,\"\",VLOOKUP(A310,Itinerário!$A$3:$I$875,8,FALSE))","v":""},{"$f":"IF(VLOOKUP(A310,Itinerário!$A$3:$I$875,9,FALSE)=0,\"\",VLOOKUP(A310,Itinerário!$A$3:$I$875,9,FALSE))","v":""}]
[308,{"$f":"VLOOKUP(A311,Itinerário!$A$3:$I$875,3,FALSE)","v":"EVANDRO PEREIRA DE VARGAS"},{"$f":"VLOOKUP(A311,Itinerário!$A$3:$I$875,5,FALSE)","v":"JULHO"},{"$f":"IF(VLOOKUP(A311,Itinerário!$A$3:$I$875,6,FALSE)=0,\"\",VLOOKUP(A311,Itinerário!$A$3:$I$875,6,FALSE))","v":""},"00:00:00",{"$f":"IF(VLOOKUP(A311,Itinerário!$A$3:$I$875,7,FALSE)=0,\"\",VLOOKUP(A311,Itinerário!$A$3:$I$875,7,FALSE))","v":""},{"$f":"IF(VLOOKUP(A311,Itinerário!$A$3:$I$875,8,FALSE)=0,\"\",VLOOKUP(A311,Itinerário!$A$3:$I$875,8,FALSE))","v":""},{"$f":"IF(VLOOKUP(A311,Itinerário!$A$3:$I$875,9,FALSE)=0,\"\",VLOOKUP(A311,Itinerário!$A$3:$I$875,9,FALSE))","v":""}]
[309,{"$f":"VLOOKUP(A312,Itinerário!$A$3:$I$875,3,FALSE)","v":"EVANDRO PEREIRA DE VARGAS"},{"$f":"VLOOKUP(A312,Itinerário!$A$3:$I$875,5,FALSE)","v":"JULHO"},{"$f":"IF(VLOOKUP(A312,Itinerário!$A$3:$I$875,6,FALSE)=0,\"\",VLOOKUP(A312,Itinerário!$A$3:$I$875,6,FALSE))","v":""},"00:00:00",{"$f":"IF(VLOOKUP(A312,Itinerário!$A$3:$I$875,7,FALSE)=0,\"\",VLOOKUP(A312,Itinerário!$A$3:$I$875,7,FALSE))","v":""},{"$f":"IF(VLOOKUP(A312,Itinerário!$A$3:$I$875,8,FALSE)=0,\"\",VLOOKUP(A312,Itinerário!$A$3:$I$875,8,FALSE))","v":""},{"$f":"IF(VLOOKUP(A312,Itinerário!$A$3:$I$875,9,FALSE)=0,\"\",VLOOKUP(A312,Itinerário!$A$3:$I$875,9,FALSE))","v":""}]
[310,{"$f":"VLOOKUP(A313,Itinerário!$A$3:$I$875,3,FALSE)","v":"EVANDRO PEREIRA DE VARGAS"},{"$f":"VLOOKUP(A313,Itinerário!$A$3:$I$875,5,FALSE)","v":"JULHO"},{"$f":"IF(VLOOKUP(A313,Itinerário!$A$3:$I$875,6,FALSE)=0,\"\",VLOOKUP(A313,Itinerário!$A$3:$I$875,6,FALSE))","v":""},"00:00:00",{"$f":"IF(VLOOKUP(A313,Itinerário!$A$3:$I$875,7,FALSE)=0,\"\",VLOOKUP(A313,Itinerário!$A$3:$I$875,7,FALSE))","v":""},{"$f":"IF(VLOOKUP(A313,Itinerário!$A$3:$I$875,8,FALSE)=0,\"\",VLOOKUP(A313,Itinerário!$A$3:$I$875,8,FALSE))","v":""},{"$f":"IF(VLOOKUP(A313,Itinerário!$A$3:$I$875,9,FALSE)=0,\"\",VLOOKUP(A313,Itinerário!$A$3:$I$875,9,FALSE))","v":""}]
[311,{"$f":"VLOOKUP(A314,Itinerário!$A$3:$I$875,3,FALSE)","v":"EVANDRO PEREIRA DE VARGAS"},{"$f":"VLOOKUP(A314,Itinerário!$A$3:$I$875,5,FALSE)","v":"AGOSTO"},{"$f":"IF(VLOOKUP(A314,Itinerário!$A$3:$I$875,6,FALSE)=0,\"\",VLOOKUP(A314,Itinerário!$A$3:$I$875,6,FALSE))","v":4},"2018-08-04",{"$f":"IF(VLOOKUP(A314,Itinerário!$A$3:$I$875,7,FALSE)=0,\"\",VLOOKUP(A314,Itinerário!$A$3:$I$875,7,FALSE))","v":"Pregação (Dia do Espirito de Profecia)"},{"$f":"IF(VLOOKUP(A314,Itinerário!$A$3:$I$875,8,FALSE)=0,\"\",VLOOKUP(A314,Itinerário!$A$3:$I$875,8,FALSE))","v":"Estreito"},{"$f":"IF(VLOOKUP(A314,Itinerário!$A$3:$I$875,9,FALSE)=0,\"\",VLOOKUP(A314,Itinerário!$A$3:$I$875,9,FALSE))","v":"Estreito"}]
[312,{"$f":"VLOOKUP(A315,Itinerário!$A$3:$I$875,3,FALSE)","v":"EVANDRO PEREIRA DE VARGAS"},{"$f":"VLOOKUP(A315,Itinerário!$A$3:$I$875,5,FALSE)","v":"AGOSTO"},{"$f":"IF(VLOOKUP(A315,Itinerário!$A$3:$I$875,6,FALSE)=0,\"\",VLOOKUP(A315,Itinerário!$A$3:$I$875,6,FALSE))","v":11},{"$f":"IFERROR(DATE(RIGHT($B$2,4),VLOOKUP(C315,$J$4:$K$15,2,FALSE),D315),0)","v":"2018-08-11"},{"$f":"IF(VLOOKUP(A315,Itinerário!$A$3:$I$875,7,FALSE)=0,\"\",VLOOKUP(A315,Itinerário!$A$3:$I$875,7,FALSE))","v":"Pregação (programa Colportagem)"},{"$f":"IF(VLOOKUP(A315,Itinerário!$A$3:$I$875,8,FALSE)=0,\"\",VLOOKUP(A315,Itinerário!$A$3:$I$875,8,FALSE))","v":"Santo Amaro da Imperatriz"},{"$f":"IF(VLOOKUP(A315,Itinerário!$A$3:$I$875,9,FALSE)=0,\"\",VLOOKUP(A315,Itinerário!$A$3:$I$875,9,FALSE))","v":"Caminho Novo"}]
[313,{"$f":"VLOOKUP(A316,Itinerário!$A$3:$I$875,3,FALSE)","v":"EVANDRO PEREIRA DE VARGAS"},{"$f":"VLOOKUP(A316,Itinerário!$A$3:$I$875,5,FALSE)","v":"AGOSTO"},{"$f":"IF(VLOOKUP(A316,Itinerário!$A$3:$I$875,6,FALSE)=0,\"\",VLOOKUP(A316,Itinerário!$A$3:$I$875,6,FALSE))","v":18},"2018-08-18",{"$f":"IF(VLOOKUP(A316,Itinerário!$A$3:$I$875,7,FALSE)=0,\"\",VLOOKUP(A316,Itinerário!$A$3:$I$875,7,FALSE))","v":"Pregação (programa Colportagem)"},{"$f":"IF(VLOOKUP(A316,Itinerário!$A$3:$I$875,8,FALSE)=0,\"\",VLOOKUP(A316,Itinerário!$A$3:$I$875,8,FALSE))","v":"Próspera"},{"$f":"IF(VLOOKUP(A316,Itinerário!$A$3:$I$875,9,FALSE)=0,\"\",VLOOKUP(A316,Itinerário!$A$3:$I$875,9,FALSE))","v":"Próspera"}]
[314,{"$f":"VLOOKUP(A317,Itinerário!$A$3:$I$875,3,FALSE)","v":"EVANDRO PEREIRA DE VARGAS"},{"$f":"VLOOKUP(A317,Itinerário!$A$3:$I$875,5,FALSE)","v":"AGOSTO"},{"$f":"IF(VLOOKUP(A317,Itinerário!$A$3:$I$875,6,FALSE)=0,\"\",VLOOKUP(A317,Itinerário!$A$3:$I$875,6,FALSE))","v":25},"2018-08-25",{"$f":"IF(VLOOKUP(A317,Itinerário!$A$3:$I$875,7,FALSE)=0,\"\",VLOOKUP(A317,Itinerário!$A$3:$I$875,7,FALSE))","v":"Pregação (programa Colportagem)"},{"$f":"IF(VLOOKUP(A317,Itinerário!$A$3:$I$875,8,FALSE)=0,\"\",VLOOKUP(A317,Itinerário!$A$3:$I$875,8,FALSE))","v":"Forquilhinhas"},{"$f":"IF(VLOOKUP(A317,Itinerário!$A$3:$I$875,9,FALSE)=0,\"\",VLOOKUP(A317,Itinerário!$A$3:$I$875,9,FALSE))","v":"Parque Lisboa"}]
[315,{"$f":"VLOOKUP(A318,Itinerário!$A$3:$I$875,3,FALSE)","v":"EVANDRO PEREIRA DE VARGAS"},{"$f":"VLOOKUP(A318,Itinerário!$A$3:$I$875,5,FALSE)","v":"AGOSTO"},{"$f":"IF(VLOOKUP(A318,Itinerário!$A$3:$I$875,6,FALSE)=0,\"\",VLOOKUP(A318,Itinerário!$A$3:$I$875,6,FALSE))","v":""},"00:00:00",{"$f":"IF(VLOOKUP(A318,Itinerário!$A$3:$I$875,7,FALSE)=0,\"\",VLOOKUP(A318,Itinerário!$A$3:$I$875,7,FALSE))","v":""},{"$f":"IF(VLOOKUP(A318,Itinerário!$A$3:$I$875,8,FALSE)=0,\"\",VLOOKUP(A318,Itinerário!$A$3:$I$875,8,FALSE))","v":""},{"$f":"IF(VLOOKUP(A318,Itinerário!$A$3:$I$875,9,FALSE)=0,\"\",VLOOKUP(A318,Itinerário!$A$3:$I$875,9,FALSE))","v":""}]
[316,{"$f":"VLOOKUP(A319,Itinerário!$A$3:$I$875,3,FALSE)","v":"EVANDRO PEREIRA DE VARGAS"},{"$f":"VLOOKUP(A319,Itinerário!$A$3:$I$875,5,FALSE)","v":"AGOSTO"},{"$f":"IF(VLOOKUP(A319,Itinerário!$A$3:$I$875,6,FALSE)=0,\"\",VLOOKUP(A319,Itinerário!$A$3:$I$875,6,FALSE))","v":""},"00:00:00",{"$f":"IF(VLOOKUP(A319,Itinerário!$A$3:$I$875,7,FALSE)=0,\"\",VLOOKUP(A319,Itinerário!$A$3:$I$875,7,FALSE))","v":""},{"$f":"IF(VLOOKUP(A319,Itinerário!$A$3:$I$875,8,FALSE)=0,\"\",VLOOKUP(A319,Itinerário!$A$3:$I$875,8,FALSE))","v":""},{"$f":"IF(VLOOKUP(A319,Itinerário!$A$3:$I$875,9,FALSE)=0,\"\",VLOOKUP(A319,Itinerário!$A$3:$I$875,9,FALSE))","v":""}]
[317,{"$f":"VLOOKUP(A320,Itinerário!$A$3:$I$875,3,FALSE)","v":"EVANDRO PEREIRA DE VARGAS"},{"$f":"VLOOKUP(A320,Itinerário!$A$3:$I$875,5,FALSE)","v":"AGOSTO"},{"$f":"IF(VLOOKUP(A320,Itinerário!$A$3:$I$875,6,FALSE)=0,\"\",VLOOKUP(A320,Itinerário!$A$3:$I$875,6,FALSE))","v":""},"00:00:00",{"$f":"IF(VLOOKUP(A320,Itinerário!$A$3:$I$875,7,FALSE)=0,\"\",VLOOKUP(A320,Itinerário!$A$3:$I$875,7,FALSE))","v":""},{"$f":"IF(VLOOKUP(A320,Itinerário!$A$3:$I$875,8,FALSE)=0,\"\",VLOOKUP(A320,Itinerário!$A$3:$I$875,8,FALSE))","v":""},{"$f":"IF(VLOOKUP(A320,Itinerário!$A$3:$I$875,9,FALSE)=0,\"\",VLOOKUP(A320,Itinerário!$A$3:$I$875,9,FALSE))","v":""}]
[318,{"$f":"VLOOKUP(A321,Itinerário!$A$3:$I$875,3,FALSE)","v":"EVANDRO PEREIRA DE VARGAS"},{"$f":"VLOOKUP(A321,Itinerário!$A$3:$I$875,5,FALSE)","v":"AGOSTO"},{"$f":"IF(VLOOKUP(A321,Itinerário!$A$3:$I$875,6,FALSE)=0,\"\",VLOOKUP(A321,Itinerário!$A$3:$I$875,6,FALSE))","v":""},"00:00:00",{"$f":"IF(VLOOKUP(A321,Itinerário!$A$3:$I$875,7,FALSE)=0,\"\",VLOOKUP(A321,Itinerário!$A$3:$I$875,7,FALSE))","v":""},{"$f":"IF(VLOOKUP(A321,Itinerário!$A$3:$I$875,8,FALSE)=0,\"\",VLOOKUP(A321,Itinerário!$A$3:$I$875,8,FALSE))","v":""},{"$f":"IF(VLOOKUP(A321,Itinerário!$A$3:$I$875,9,FALSE)=0,\"\",VLOOKUP(A321,Itinerário!$A$3:$I$875,9,FALSE))","v":""}]
[319,{"$f":"VLOOKUP(A322,Itinerário!$A$3:$I$875,3,FALSE)","v":"EVANDRO PEREIRA DE VARGAS"},{"$f":"VLOOKUP(A322,Itinerário!$A$3:$I$875,5,FALSE)","v":"AGOSTO"},{"$f":"IF(VLOOKUP(A322,Itinerário!$A$3:$I$875,6,FALSE)=0,\"\",VLOOKUP(A322,Itinerário!$A$3:$I$875,6,FALSE))","v":""},"00:00:00",{"$f":"IF(VLOOKUP(A322,Itinerário!$A$3:$I$875,7,FALSE)=0,\"\",VLOOKUP(A322,Itinerário!$A$3:$I$875,7,FALSE))","v":""},{"$f":"IF(VLOOKUP(A322,Itinerário!$A$3:$I$875,8,FALSE)=0,\"\",VLOOKUP(A322,Itinerário!$A$3:$I$875,8,FALSE))","v":""},{"$f":"IF(VLOOKUP(A322,Itinerário!$A$3:$I$875,9,FALSE)=0,\"\",VLOOKUP(A322,Itinerário!$A$3:$I$875,9,FALSE))","v":""}]
[320,{"$f":"VLOOKUP(A323,Itinerário!$A$3:$I$875,3,FALSE)","v":"EVANDRO PEREIRA DE VARGAS"},{"$f":"VLOOKUP(A323,Itinerário!$A$3:$I$875,5,FALSE)","v":"AGOSTO"},{"$f":"IF(VLOOKUP(A323,Itinerário!$A$3:$I$875,6,FALSE)=0,\"\",VLOOKUP(A323,Itinerário!$A$3:$I$875,6,FALSE))","v":""},"00:00:00",{"$f":"IF(VLOOKUP(A323,Itinerário!$A$3:$I$875,7,FALSE)=0,\"\",VLOOKUP(A323,Itinerário!$A$3:$I$875,7,FALSE))","v":""},{"$f":"IF(VLOOKUP(A323,Itinerário!$A$3:$I$875,8,FALSE)=0,\"\",VLOOKUP(A323,Itinerário!$A$3:$I$875,8,FALSE))","v":""},{"$f":"IF(VLOOKUP(A323,Itinerário!$A$3:$I$875,9,FALSE)=0,\"\",VLOOKUP(A323,Itinerário!$A$3:$I$875,9,FALSE))","v":""}]
[321,{"$f":"VLOOKUP(A324,Itinerário!$A$3:$I$875,3,FALSE)","v":"EVANDRO PEREIRA DE VARGAS"},{"$f":"VLOOKUP(A324,Itinerário!$A$3:$I$875,5,FALSE)","v":"SETEMBRO"},{"$f":"IF(VLOOKUP(A324,Itinerário!$A$3:$I$875,6,FALSE)=0,\"\",VLOOKUP(A324,Itinerário!$A$3:$I$875,6,FALSE))","v":1},{"$f":"IFERROR(DATE(RIGHT($B$2,4),VLOOKUP(C324,$J$4:$K$15,2,FALSE),D324),0)","v":"2018-09-01"},{"$f":"IF(VLOOKUP(A324,Itinerário!$A$3:$I$875,7,FALSE)=0,\"\",VLOOKUP(A324,Itinerário!$A$3:$I$875,7,FALSE))","v":"Pregação (programa Colportagem)"},{"$f":"IF(VLOOKUP(A324,Itinerário!$A$3:$I$875,8,FALSE)=0,\"\",VLOOKUP(A324,Itinerário!$A$3:$I$875,8,FALSE))","v":"Zimbros"},{"$f":"IF(VLOOKUP(A324,Itinerário!$A$3:$I$875,9,FALSE)=0,\"\",VLOOKUP(A324,Itinerário!$A$3:$I$875,9,FALSE))","v":"Itapema"}]
[322,{"$f":"VLOOKUP(A325,Itinerário!$A$3:$I$875,3,FALSE)","v":"EVANDRO PEREIRA DE VARGAS"},{"$f":"VLOOKUP(A325,Itinerário!$A$3:$I$875,5,FALSE)","v":"SETEMBRO"},{"$f":"IF(VLOOKUP(A325,Itinerário!$A$3:$I$875,6,FALSE)=0,\"\",VLOOKUP(A325,Itinerário!$A$3:$I$875,6,FALSE))","v":15},"2018-09-15",{"$f":"IF(VLOOKUP(A325,Itinerário!$A$3:$I$875,7,FALSE)=0,\"\",VLOOKUP(A325,Itinerário!$A$3:$I$875,7,FALSE))","v":"Encontro de Líderes"},{"$f":"IF(VLOOKUP(A325,Itinerário!$A$3:$I$875,8,FALSE)=0,\"\",VLOOKUP(A325,Itinerário!$A$3:$I$875,8,FALSE))","v":"UNASP"},{"$f":"IF(VLOOKUP(A325,Itinerário!$A$3:$I$875,9,FALSE)=0,\"\",VLOOKUP(A325,Itinerário!$A$3:$I$875,9,FALSE))","v":"UNASP"}]
[323,{"$f":"VLOOKUP(A326,Itinerário!$A$3:$I$875,3,FALSE)","v":"EVANDRO PEREIRA DE VARGAS"},{"$f":"VLOOKUP(A326,Itinerário!$A$3:$I$875,5,FALSE)","v":"SETEMBRO"},{"$f":"IF(VLOOKUP(A326,Itinerário!$A$3:$I$875,6,FALSE)=0,\"\",VLOOKUP(A326,Itinerário!$A$3:$I$875,6,FALSE))","v":22},"2018-09-22",{"$f":"IF(VLOOKUP(A326,Itinerário!$A$3:$I$875,7,FALSE)=0,\"\",VLOOKUP(A326,Itinerário!$A$3:$I$875,7,FALSE))","v":"Pregação - Recrutamento"},{"$f":"IF(VLOOKUP(A326,Itinerário!$A$3:$I$875,8,FALSE)=0,\"\",VLOOKUP(A326,Itinerário!$A$3:$I$875,8,FALSE))","v":"São Vicente"},{"$f":"IF(VLOOKUP(A326,Itinerário!$A$3:$I$875,9,FALSE)=0,\"\",VLOOKUP(A326,Itinerário!$A$3:$I$875,9,FALSE))","v":"São Vicente"}]
[324,{"$f":"VLOOKUP(A327,Itinerário!$A$3:$I$875,3,FALSE)","v":"EVANDRO PEREIRA DE VARGAS"},{"$f":"VLOOKUP(A327,Itinerário!$A$3:$I$875,5,FALSE)","v":"SETEMBRO"},{"$f":"IF(VLOOKUP(A327,Itinerário!$A$3:$I$875,6,FALSE)=0,\"\",VLOOKUP(A327,Itinerário!$A$3:$I$875,6,FALSE))","v":29},"2018-09-29",{"$f":"IF(VLOOKUP(A327,Itinerário!$A$3:$I$875,7,FALSE)=0,\"\",VLOOKUP(A327,Itinerário!$A$3:$I$875,7,FALSE))","v":"Pregação (programa Colportagem)"},{"$f":"IF(VLOOKUP(A327,Itinerário!$A$3:$I$875,8,FALSE)=0,\"\",VLOOKUP(A327,Itinerário!$A$3:$I$875,8,FALSE))","v":"Ingleses"},{"$f":"IF(VLOOKUP(A327,Itinerário!$A$3:$I$875,9,FALSE)=0,\"\",VLOOKUP(A327,Itinerário!$A$3:$I$875,9,FALSE))","v":"Ingleses"}]
[325,{"$f":"VLOOKUP(A328,Itinerário!$A$3:$I$875,3,FALSE)","v":"EVANDRO PEREIRA DE VARGAS"},{"$f":"VLOOKUP(A328,Itinerário!$A$3:$I$875,5,FALSE)","v":"SETEMBRO"},{"$f":"IF(VLOOKUP(A328,Itinerário!$A$3:$I$875,6,FALSE)=0,\"\",VLOOKUP(A328,Itinerário!$A$3:$I$875,6,FALSE))","v":""},"00:00:00",{"$f":"IF(VLOOKUP(A328,Itinerário!$A$3:$I$875,7,FALSE)=0,\"\",VLOOKUP(A328,Itinerário!$A$3:$I$875,7,FALSE))","v":""},{"$f":"IF(VLOOKUP(A328,Itinerário!$A$3:$I$875,8,FALSE)=0,\"\",VLOOKUP(A328,Itinerário!$A$3:$I$875,8,FALSE))","v":""},{"$f":"IF(VLOOKUP(A328,Itinerário!$A$3:$I$875,9,FALSE)=0,\"\",VLOOKUP(A328,Itinerário!$A$3:$I$875,9,FALSE))","v":""}]
[326,{"$f":"VLOOKUP(A329,Itinerário!$A$3:$I$875,3,FALSE)","v":"EVANDRO PEREIRA DE VARGAS"},{"$f":"VLOOKUP(A329,Itinerário!$A$3:$I$875,5,FALSE)","v":"SETEMBRO"},{"$f":"IF(VLOOKUP(A329,Itinerário!$A$3:$I$875,6,FALSE)=0,\"\",VLOOKUP(A329,Itinerário!$A$3:$I$875,6,FALSE))","v":""},"00:00:00",{"$f":"IF(VLOOKUP(A329,Itinerário!$A$3:$I$875,7,FALSE)=0,\"\",VLOOKUP(A329,Itinerário!$A$3:$I$875,7,FALSE))","v":""},{"$f":"IF(VLOOKUP(A329,Itinerário!$A$3:$I$875,8,FALSE)=0,\"\",VLOOKUP(A329,Itinerário!$A$3:$I$875,8,FALSE))","v":""},{"$f":"IF(VLOOKUP(A329,Itinerário!$A$3:$I$875,9,FALSE)=0,\"\",VLOOKUP(A329,Itinerário!$A$3:$I$875,9,FALSE))","v":""}]
[327,{"$f":"VLOOKUP(A330,Itinerário!$A$3:$I$875,3,FALSE)","v":"EVANDRO PEREIRA DE VARGAS"},{"$f":"VLOOKUP(A330,Itinerário!$A$3:$I$875,5,FALSE)","v":"SETEMBRO"},{"$f":"IF(VLOOKUP(A330,Itinerário!$A$3:$I$875,6,FALSE)=0,\"\",VLOOKUP(A330,Itinerário!$A$3:$I$875,6,FALSE))","v":""},"00:00:00",{"$f":"IF(VLOOKUP(A330,Itinerário!$A$3:$I$875,7,FALSE)=0,\"\",VLOOKUP(A330,Itinerário!$A$3:$I$875,7,FALSE))","v":""},{"$f":"IF(VLOOKUP(A330,Itinerário!$A$3:$I$875,8,FALSE)=0,\"\",VLOOKUP(A330,Itinerário!$A$3:$I$875,8,FALSE))","v":""},{"$f":"IF(VLOOKUP(A330,Itinerário!$A$3:$I$875,9,FALSE)=0,\"\",VLOOKUP(A330,Itinerário!$A$3:$I$875,9,FALSE))","v":""}]
[328,{"$f":"VLOOKUP(A331,Itinerário!$A$3:$I$875,3,FALSE)","v":"EVANDRO PEREIRA DE VARGAS"},{"$f":"VLOOKUP(A331,Itinerário!$A$3:$I$875,5,FALSE)","v":"SETEMBRO"},{"$f":"IF(VLOOKUP(A331,Itinerário!$A$3:$I$875,6,FALSE)=0,\"\",VLOOKUP(A331,Itinerário!$A$3:$I$875,6,FALSE))","v":""},"00:00:00",{"$f":"IF(VLOOKUP(A331,Itinerário!$A$3:$I$875,7,FALSE)=0,\"\",VLOOKUP(A331,Itinerário!$A$3:$I$875,7,FALSE))","v":""},{"$f":"IF(VLOOKUP(A331,Itinerário!$A$3:$I$875,8,FALSE)=0,\"\",VLOOKUP(A331,Itinerário!$A$3:$I$875,8,FALSE))","v":""},{"$f":"IF(VLOOKUP(A331,Itinerário!$A$3:$I$875,9,FALSE)=0,\"\",VLOOKUP(A331,Itinerário!$A$3:$I$875,9,FALSE))","v":""}]
[329,{"$f":"VLOOKUP(A332,Itinerário!$A$3:$I$875,3,FALSE)","v":"EVANDRO PEREIRA DE VARGAS"},{"$f":"VLOOKUP(A332,Itinerário!$A$3:$I$875,5,FALSE)","v":"SETEMBRO"},{"$f":"IF(VLOOKUP(A332,Itinerário!$A$3:$I$875,6,FALSE)=0,\"\",VLOOKUP(A332,Itinerário!$A$3:$I$875,6,FALSE))","v":""},"00:00:00",{"$f":"IF(VLOOKUP(A332,Itinerário!$A$3:$I$875,7,FALSE)=0,\"\",VLOOKUP(A332,Itinerário!$A$3:$I$875,7,FALSE))","v":""},{"$f":"IF(VLOOKUP(A332,Itinerário!$A$3:$I$875,8,FALSE)=0,\"\",VLOOKUP(A332,Itinerário!$A$3:$I$875,8,FALSE))","v":""},{"$f":"IF(VLOOKUP(A332,Itinerário!$A$3:$I$875,9,FALSE)=0,\"\",VLOOKUP(A332,Itinerário!$A$3:$I$875,9,FALSE))","v":""}]
[330,{"$f":"VLOOKUP(A333,Itinerário!$A$3:$I$875,3,FALSE)","v":"EVANDRO PEREIRA DE VARGAS"},{"$f":"VLOOKUP(A333,Itinerário!$A$3:$I$875,5,FALSE)","v":"SETEMBRO"},{"$f":"IF(VLOOKUP(A333,Itinerário!$A$3:$I$875,6,FALSE)=0,\"\",VLOOKUP(A333,Itinerário!$A$3:$I$875,6,FALSE))","v":""},"00:00:00",{"$f":"IF(VLOOKUP(A333,Itinerário!$A$3:$I$875,7,FALSE)=0,\"\",VLOOKUP(A333,Itinerário!$A$3:$I$875,7,FALSE))","v":""},{"$f":"IF(VLOOKUP(A333,Itinerário!$A$3:$I$875,8,FALSE)=0,\"\",VLOOKUP(A333,Itinerário!$A$3:$I$875,8,FALSE))","v":""},{"$f":"IF(VLOOKUP(A333,Itinerário!$A$3:$I$875,9,FALSE)=0,\"\",VLOOKUP(A333,Itinerário!$A$3:$I$875,9,FALSE))","v":""}]
[331,{"$f":"VLOOKUP(A334,Itinerário!$A$3:$I$875,3,FALSE)","v":"EVANDRO PEREIRA DE VARGAS"},{"$f":"VLOOKUP(A334,Itinerário!$A$3:$I$875,5,FALSE)","v":"OUTUBRO"},{"$f":"IF(VLOOKUP(A334,Itinerário!$A$3:$I$875,6,FALSE)=0,\"\",VLOOKUP(A334,Itinerário!$A$3:$I$875,6,FALSE))","v":6},"2018-10-06",{"$f":"IF(VLOOKUP(A334,Itinerário!$A$3:$I$875,7,FALSE)=0,\"\",VLOOKUP(A334,Itinerário!$A$3:$I$875,7,FALSE))","v":"Semana de Colportagem "},{"$f":"IF(VLOOKUP(A334,Itinerário!$A$3:$I$875,8,FALSE)=0,\"\",VLOOKUP(A334,Itinerário!$A$3:$I$875,8,FALSE))","v":"IAP"},{"$f":"IF(VLOOKUP(A334,Itinerário!$A$3:$I$875,9,FALSE)=0,\"\",VLOOKUP(A334,Itinerário!$A$3:$I$875,9,FALSE))","v":"IAP"}]
[332,{"$f":"VLOOKUP(A335,Itinerário!$A$3:$I$875,3,FALSE)","v":"EVANDRO PEREIRA DE VARGAS"},{"$f":"VLOOKUP(A335,Itinerário!$A$3:$I$875,5,FALSE)","v":"OUTUBRO"},{"$f":"IF(VLOOKUP(A335,Itinerário!$A$3:$I$875,6,FALSE)=0,\"\",VLOOKUP(A335,Itinerário!$A$3:$I$875,6,FALSE))","v":20},"2018-10-20",{"$f":"IF(VLOOKUP(A335,Itinerário!$A$3:$I$875,7,FALSE)=0,\"\",VLOOKUP(A335,Itinerário!$A$3:$I$875,7,FALSE))","v":"Pregação (programa Colportagem)"},{"$f":"IF(VLOOKUP(A335,Itinerário!$A$3:$I$875,8,FALSE)=0,\"\",VLOOKUP(A335,Itinerário!$A$3:$I$875,8,FALSE))","v":"Itapema"},{"$f":"IF(VLOOKUP(A335,Itinerário!$A$3:$I$875,9,FALSE)=0,\"\",VLOOKUP(A335,Itinerário!$A$3:$I$875,9,FALSE))","v":"Itapema"}]
[333,{"$f":"VLOOKUP(A336,Itinerário!$A$3:$I$875,3,FALSE)","v":"EVANDRO PEREIRA DE VARGAS"},{"$f":"VLOOKUP(A336,Itinerário!$A$3:$I$875,5,FALSE)","v":"OUTUBRO"},{"$f":"IF(VLOOKUP(A336,Itinerário!$A$3:$I$875,6,FALSE)=0,\"\",VLOOKUP(A336,Itinerário!$A$3:$I$875,6,FALSE))","v":27},"2018-10-27",{"$f":"IF(VLOOKUP(A336,Itinerário!$A$3:$I$875,7,FALSE)=0,\"\",VLOOKUP(A336,Itinerário!$A$3:$I$875,7,FALSE))","v":"Semana de Colportagem "},{"$f":"IF(VLOOKUP(A336,Itinerário!$A$3:$I$875,8,FALSE)=0,\"\",VLOOKUP(A336,Itinerário!$A$3:$I$875,8,FALSE))","v":"UNASP"},{"$f":"IF(VLOOKUP(A336,Itinerário!$A$3:$I$875,9,FALSE)=0,\"\",VLOOKUP(A336,Itinerário!$A$3:$I$875,9,FALSE))","v":"UNASP"}]
[334,{"$f":"VLOOKUP(A337,Itinerário!$A$3:$I$875,3,FALSE)","v":"EVANDRO PEREIRA DE VARGAS"},{"$f":"VLOOKUP(A337,Itinerário!$A$3:$I$875,5,FALSE)","v":"OUTUBRO"},{"$f":"IF(VLOOKUP(A337,Itinerário!$A$3:$I$875,6,FALSE)=0,\"\",VLOOKUP(A337,Itinerário!$A$3:$I$875,6,FALSE))","v":""},"00:00:00",{"$f":"IF(VLOOKUP(A337,Itinerário!$A$3:$I$875,7,FALSE)=0,\"\",VLOOKUP(A337,Itinerário!$A$3:$I$875,7,FALSE))","v":""},{"$f":"IF(VLOOKUP(A337,Itinerário!$A$3:$I$875,8,FALSE)=0,\"\",VLOOKUP(A337,Itinerário!$A$3:$I$875,8,FALSE))","v":""},{"$f":"IF(VLOOKUP(A337,Itinerário!$A$3:$I$875,9,FALSE)=0,\"\",VLOOKUP(A337,Itinerário!$A$3:$I$875,9,FALSE))","v":""}]
[335,{"$f":"VLOOKUP(A338,Itinerário!$A$3:$I$875,3,FALSE)","v":"EVANDRO PEREIRA DE VARGAS"},{"$f":"VLOOKUP(A338,Itinerário!$A$3:$I$875,5,FALSE)","v":"OUTUBRO"},{"$f":"IF(VLOOKUP(A338,Itinerário!$A$3:$I$875,6,FALSE)=0,\"\",VLOOKUP(A338,Itinerário!$A$3:$I$875,6,FALSE))","v":""},"00:00:00",{"$f":"IF(VLOOKUP(A338,Itinerário!$A$3:$I$875,7,FALSE)=0,\"\",VLOOKUP(A338,Itinerário!$A$3:$I$875,7,FALSE))","v":""},{"$f":"IF(VLOOKUP(A338,Itinerário!$A$3:$I$875,8,FALSE)=0,\"\",VLOOKUP(A338,Itinerário!$A$3:$I$875,8,FALSE))","v":""},{"$f":"IF(VLOOKUP(A338,Itinerário!$A$3:$I$875,9,FALSE)=0,\"\",VLOOKUP(A338,Itinerário!$A$3:$I$875,9,FALSE))","v":""}]
[336,{"$f":"VLOOKUP(A339,Itinerário!$A$3:$I$875,3,FALSE)","v":"EVANDRO PEREIRA DE VARGAS"},{"$f":"VLOOKUP(A339,Itinerário!$A$3:$I$875,5,FALSE)","v":"OUTUBRO"},{"$f":"IF(VLOOKUP(A339,Itinerário!$A$3:$I$875,6,FALSE)=0,\"\",VLOOKUP(A339,Itinerário!$A$3:$I$875,6,FALSE))","v":""},"00:00:00",{"$f":"IF(VLOOKUP(A339,Itinerário!$A$3:$I$875,7,FALSE)=0,\"\",VLOOKUP(A339,Itinerário!$A$3:$I$875,7,FALSE))","v":""},{"$f":"IF(VLOOKUP(A339,Itinerário!$A$3:$I$875,8,FALSE)=0,\"\",VLOOKUP(A339,Itinerário!$A$3:$I$875,8,FALSE))","v":""},{"$f":"IF(VLOOKUP(A339,Itinerário!$A$3:$I$875,9,FALSE)=0,\"\",VLOOKUP(A339,Itinerário!$A$3:$I$875,9,FALSE))","v":""}]
[337,{"$f":"VLOOKUP(A340,Itinerário!$A$3:$I$875,3,FALSE)","v":"EVANDRO PEREIRA DE VARGAS"},{"$f":"VLOOKUP(A340,Itinerário!$A$3:$I$875,5,FALSE)","v":"OUTUBRO"},{"$f":"IF(VLOOKUP(A340,Itinerário!$A$3:$I$875,6,FALSE)=0,\"\",VLOOKUP(A340,Itinerário!$A$3:$I$875,6,FALSE))","v":""},"00:00:00",{"$f":"IF(VLOOKUP(A340,Itinerário!$A$3:$I$875,7,FALSE)=0,\"\",VLOOKUP(A340,Itinerário!$A$3:$I$875,7,FALSE))","v":""},{"$f":"IF(VLOOKUP(A340,Itinerário!$A$3:$I$875,8,FALSE)=0,\"\",VLOOKUP(A340,Itinerário!$A$3:$I$875,8,FALSE))","v":""},{"$f":"IF(VLOOKUP(A340,Itinerário!$A$3:$I$875,9,FALSE)=0,\"\",VLOOKUP(A340,Itinerário!$A$3:$I$875,9,FALSE))","v":""}]
[338,{"$f":"VLOOKUP(A341,Itinerário!$A$3:$I$875,3,FALSE)","v":"EVANDRO PEREIRA DE VARGAS"},{"$f":"VLOOKUP(A341,Itinerário!$A$3:$I$875,5,FALSE)","v":"OUTUBRO"},{"$f":"IF(VLOOKUP(A341,Itinerário!$A$3:$I$875,6,FALSE)=0,\"\",VLOOKUP(A341,Itinerário!$A$3:$I$875,6,FALSE))","v":""},"00:00:00",{"$f":"IF(VLOOKUP(A341,Itinerário!$A$3:$I$875,7,FALSE)=0,\"\",VLOOKUP(A341,Itinerário!$A$3:$I$875,7,FALSE))","v":""},{"$f":"IF(VLOOKUP(A341,Itinerário!$A$3:$I$875,8,FALSE)=0,\"\",VLOOKUP(A341,Itinerário!$A$3:$I$875,8,FALSE))","v":""},{"$f":"IF(VLOOKUP(A341,Itinerário!$A$3:$I$875,9,FALSE)=0,\"\",VLOOKUP(A341,Itinerário!$A$3:$I$875,9,FALSE))","v":""}]
[339,{"$f":"VLOOKUP(A342,Itinerário!$A$3:$I$875,3,FALSE)","v":"EVANDRO PEREIRA DE VARGAS"},{"$f":"VLOOKUP(A342,Itinerário!$A$3:$I$875,5,FALSE)","v":"OUTUBRO"},{"$f":"IF(VLOOKUP(A342,Itinerário!$A$3:$I$875,6,FALSE)=0,\"\",VLOOKUP(A342,Itinerário!$A$3:$I$875,6,FALSE))","v":""},"00:00:00",{"$f":"IF(VLOOKUP(A342,Itinerário!$A$3:$I$875,7,FALSE)=0,\"\",VLOOKUP(A342,Itinerário!$A$3:$I$875,7,FALSE))","v":""},{"$f":"IF(VLOOKUP(A342,Itinerário!$A$3:$I$875,8,FALSE)=0,\"\",VLOOKUP(A342,Itinerário!$A$3:$I$875,8,FALSE))","v":""},{"$f":"IF(VLOOKUP(A342,Itinerário!$A$3:$I$875,9,FALSE)=0,\"\",VLOOKUP(A342,Itinerário!$A$3:$I$875,9,FALSE))","v":""}]
[340,{"$f":"VLOOKUP(A343,Itinerário!$A$3:$I$875,3,FALSE)","v":"EVANDRO PEREIRA DE VARGAS"},{"$f":"VLOOKUP(A343,Itinerário!$A$3:$I$875,5,FALSE)","v":"OUTUBRO"},{"$f":"IF(VLOOKUP(A343,Itinerário!$A$3:$I$875,6,FALSE)=0,\"\",VLOOKUP(A343,Itinerário!$A$3:$I$875,6,FALSE))","v":""},"00:00:00",{"$f":"IF(VLOOKUP(A343,Itinerário!$A$3:$I$875,7,FALSE)=0,\"\",VLOOKUP(A343,Itinerário!$A$3:$I$875,7,FALSE))","v":""},{"$f":"IF(VLOOKUP(A343,Itinerário!$A$3:$I$875,8,FALSE)=0,\"\",VLOOKUP(A343,Itinerário!$A$3:$I$875,8,FALSE))","v":""},{"$f":"IF(VLOOKUP(A343,Itinerário!$A$3:$I$875,9,FALSE)=0,\"\",VLOOKUP(A343,Itinerário!$A$3:$I$875,9,FALSE))","v":""}]
[341,{"$f":"VLOOKUP(A344,Itinerário!$A$3:$I$875,3,FALSE)","v":"EVANDRO PEREIRA DE VARGAS"},{"$f":"VLOOKUP(A344,Itinerário!$A$3:$I$875,5,FALSE)","v":"NOVEMBRO"},{"$f":"IF(VLOOKUP(A344,Itinerário!$A$3:$I$875,6,FALSE)=0,\"\",VLOOKUP(A344,Itinerário!$A$3:$I$875,6,FALSE))","v":3},"2018-11-03",{"$f":"IF(VLOOKUP(A344,Itinerário!$A$3:$I$875,7,FALSE)=0,\"\",VLOOKUP(A344,Itinerário!$A$3:$I$875,7,FALSE))","v":"Pregação (programa Colportagem)"},{"$f":"IF(VLOOKUP(A344,Itinerário!$A$3:$I$875,8,FALSE)=0,\"\",VLOOKUP(A344,Itinerário!$A$3:$I$875,8,FALSE))","v":"São João Batista"},{"$f":"IF(VLOOKUP(A344,Itinerário!$A$3:$I$875,9,FALSE)=0,\"\",VLOOKUP(A344,Itinerário!$A$3:$I$875,9,FALSE))","v":"Tijucas"}]
[342,{"$f":"VLOOKUP(A345,Itinerário!$A$3:$I$875,3,FALSE)","v":"EVANDRO PEREIRA DE VARGAS"},{"$f":"VLOOKUP(A345,Itinerário!$A$3:$I$875,5,FALSE)","v":"NOVEMBRO"},{"$f":"IF(VLOOKUP(A345,Itinerário!$A$3:$I$875,6,FALSE)=0,\"\",VLOOKUP(A345,Itinerário!$A$3:$I$875,6,FALSE))","v":10},"2018-11-10",{"$f":"IF(VLOOKUP(A345,Itinerário!$A$3:$I$875,7,FALSE)=0,\"\",VLOOKUP(A345,Itinerário!$A$3:$I$875,7,FALSE))","v":"Pregação (programa Colportagem)"},{"$f":"IF(VLOOKUP(A345,Itinerário!$A$3:$I$875,8,FALSE)=0,\"\",VLOOKUP(A345,Itinerário!$A$3:$I$875,8,FALSE))","v":"Nova Brasília"},{"$f":"IF(VLOOKUP(A345,Itinerário!$A$3:$I$875,9,FALSE)=0,\"\",VLOOKUP(A345,Itinerário!$A$3:$I$875,9,FALSE))","v":"Nova Brasília"}]
[343,{"$f":"VLOOKUP(A346,Itinerário!$A$3:$I$875,3,FALSE)","v":"EVANDRO PEREIRA DE VARGAS"},{"$f":"VLOOKUP(A346,Itinerário!$A$3:$I$875,5,FALSE)","v":"NOVEMBRO"},{"$f":"IF(VLOOKUP(A346,Itinerário!$A$3:$I$875,6,FALSE)=0,\"\",VLOOKUP(A346,Itinerário!$A$3:$I$875,6,FALSE))","v":17},"2018-11-17",{"$f":"IF(VLOOKUP(A346,Itinerário!$A$3:$I$875,7,FALSE)=0,\"\",VLOOKUP(A346,Itinerário!$A$3:$I$875,7,FALSE))","v":"Pregação (programa Colportagem)"},{"$f":"IF(VLOOKUP(A346,Itinerário!$A$3:$I$875,8,FALSE)=0,\"\",VLOOKUP(A346,Itinerário!$A$3:$I$875,8,FALSE))","v":"Garopaba"},{"$f":"IF(VLOOKUP(A346,Itinerário!$A$3:$I$875,9,FALSE)=0,\"\",VLOOKUP(A346,Itinerário!$A$3:$I$875,9,FALSE))","v":"Garopaba"}]
[344,{"$f":"VLOOKUP(A347,Itinerário!$A$3:$I$875,3,FALSE)","v":"EVANDRO PEREIRA DE VARGAS"},{"$f":"VLOOKUP(A347,Itinerário!$A$3:$I$875,5,FALSE)","v":"NOVEMBRO"},{"$f":"IF(VLOOKUP(A347,Itinerário!$A$3:$I$875,6,FALSE)=0,\"\",VLOOKUP(A347,Itinerário!$A$3:$I$875,6,FALSE))","v":24},"2018-11-24",{"$f":"IF(VLOOKUP(A347,Itinerário!$A$3:$I$875,7,FALSE)=0,\"\",VLOOKUP(A347,Itinerário!$A$3:$I$875,7,FALSE))","v":"Evangelismo"},{"$f":"IF(VLOOKUP(A347,Itinerário!$A$3:$I$875,8,FALSE)=0,\"\",VLOOKUP(A347,Itinerário!$A$3:$I$875,8,FALSE))","v":""},{"$f":"IF(VLOOKUP(A347,Itinerário!$A$3:$I$875,9,FALSE)=0,\"\",VLOOKUP(A347,Itinerário!$A$3:$I$875,9,FALSE))","v":""}]
[345,{"$f":"VLOOKUP(A348,Itinerário!$A$3:$I$875,3,FALSE)","v":"EVANDRO PEREIRA DE VARGAS"},{"$f":"VLOOKUP(A348,Itinerário!$A$3:$I$875,5,FALSE)","v":"NOVEMBRO"},{"$f":"IF(VLOOKUP(A348,Itinerário!$A$3:$I$875,6,FALSE)=0,\"\",VLOOKUP(A348,Itinerário!$A$3:$I$875,6,FALSE))","v":""},"00:00:00",{"$f":"IF(VLOOKUP(A348,Itinerário!$A$3:$I$875,7,FALSE)=0,\"\",VLOOKUP(A348,Itinerário!$A$3:$I$875,7,FALSE))","v":""},{"$f":"IF(VLOOKUP(A348,Itinerário!$A$3:$I$875,8,FALSE)=0,\"\",VLOOKUP(A348,Itinerário!$A$3:$I$875,8,FALSE))","v":""},{"$f":"IF(VLOOKUP(A348,Itinerário!$A$3:$I$875,9,FALSE)=0,\"\",VLOOKUP(A348,Itinerário!$A$3:$I$875,9,FALSE))","v":""}]
[346,{"$f":"VLOOKUP(A349,Itinerário!$A$3:$I$875,3,FALSE)","v":"EVANDRO PEREIRA DE VARGAS"},{"$f":"VLOOKUP(A349,Itinerário!$A$3:$I$875,5,FALSE)","v":"NOVEMBRO"},{"$f":"IF(VLOOKUP(A349,Itinerário!$A$3:$I$875,6,FALSE)=0,\"\",VLOOKUP(A349,Itinerário!$A$3:$I$875,6,FALSE))","v":""},"00:00:00",{"$f":"IF(VLOOKUP(A349,Itinerário!$A$3:$I$875,7,FALSE)=0,\"\",VLOOKUP(A349,Itinerário!$A$3:$I$875,7,FALSE))","v":""},{"$f":"IF(VLOOKUP(A349,Itinerário!$A$3:$I$875,8,FALSE)=0,\"\",VLOOKUP(A349,Itinerário!$A$3:$I$875,8,FALSE))","v":""},{"$f":"IF(VLOOKUP(A349,Itinerário!$A$3:$I$875,9,FALSE)=0,\"\",VLOOKUP(A349,Itinerário!$A$3:$I$875,9,FALSE))","v":""}]
[347,{"$f":"VLOOKUP(A350,Itinerário!$A$3:$I$875,3,FALSE)","v":"EVANDRO PEREIRA DE VARGAS"},{"$f":"VLOOKUP(A350,Itinerário!$A$3:$I$875,5,FALSE)","v":"NOVEMBRO"},{"$f":"IF(VLOOKUP(A350,Itinerário!$A$3:$I$875,6,FALSE)=0,\"\",VLOOKUP(A350,Itinerário!$A$3:$I$875,6,FALSE))","v":""},"00:00:00",{"$f":"IF(VLOOKUP(A350,Itinerário!$A$3:$I$875,7,FALSE)=0,\"\",VLOOKUP(A350,Itinerário!$A$3:$I$875,7,FALSE))","v":""},{"$f":"IF(VLOOKUP(A350,Itinerário!$A$3:$I$875,8,FALSE)=0,\"\",VLOOKUP(A350,Itinerário!$A$3:$I$875,8,FALSE))","v":""},{"$f":"IF(VLOOKUP(A350,Itinerário!$A$3:$I$875,9,FALSE)=0,\"\",VLOOKUP(A350,Itinerário!$A$3:$I$875,9,FALSE))","v":""}]
[348,{"$f":"VLOOKUP(A351,Itinerário!$A$3:$I$875,3,FALSE)","v":"EVANDRO PEREIRA DE VARGAS"},{"$f":"VLOOKUP(A351,Itinerário!$A$3:$I$875,5,FALSE)","v":"NOVEMBRO"},{"$f":"IF(VLOOKUP(A351,Itinerário!$A$3:$I$875,6,FALSE)=0,\"\",VLOOKUP(A351,Itinerário!$A$3:$I$875,6,FALSE))","v":""},"00:00:00",{"$f":"IF(VLOOKUP(A351,Itinerário!$A$3:$I$875,7,FALSE)=0,\"\",VLOOKUP(A351,Itinerário!$A$3:$I$875,7,FALSE))","v":""},{"$f":"IF(VLOOKUP(A351,Itinerário!$A$3:$I$875,8,FALSE)=0,\"\",VLOOKUP(A351,Itinerário!$A$3:$I$875,8,FALSE))","v":""},{"$f":"IF(VLOOKUP(A351,Itinerário!$A$3:$I$875,9,FALSE)=0,\"\",VLOOKUP(A351,Itinerário!$A$3:$I$875,9,FALSE))","v":""}]
[349,{"$f":"VLOOKUP(A352,Itinerário!$A$3:$I$875,3,FALSE)","v":"EVANDRO PEREIRA DE VARGAS"},{"$f":"VLOOKUP(A352,Itinerário!$A$3:$I$875,5,FALSE)","v":"NOVEMBRO"},{"$f":"IF(VLOOKUP(A352,Itinerário!$A$3:$I$875,6,FALSE)=0,\"\",VLOOKUP(A352,Itinerário!$A$3:$I$875,6,FALSE))","v":""},"00:00:00",{"$f":"IF(VLOOKUP(A352,Itinerário!$A$3:$I$875,7,FALSE)=0,\"\",VLOOKUP(A352,Itinerário!$A$3:$I$875,7,FALSE))","v":""},{"$f":"IF(VLOOKUP(A352,Itinerário!$A$3:$I$875,8,FALSE)=0,\"\",VLOOKUP(A352,Itinerário!$A$3:$I$875,8,FALSE))","v":""},{"$f":"IF(VLOOKUP(A352,Itinerário!$A$3:$I$875,9,FALSE)=0,\"\",VLOOKUP(A352,Itinerário!$A$3:$I$875,9,FALSE))","v":""}]
[350,{"$f":"VLOOKUP(A353,Itinerário!$A$3:$I$875,3,FALSE)","v":"EVANDRO PEREIRA DE VARGAS"},{"$f":"VLOOKUP(A353,Itinerário!$A$3:$I$875,5,FALSE)","v":"NOVEMBRO"},{"$f":"IF(VLOOKUP(A353,Itinerário!$A$3:$I$875,6,FALSE)=0,\"\",VLOOKUP(A353,Itinerário!$A$3:$I$875,6,FALSE))","v":""},"00:00:00",{"$f":"IF(VLOOKUP(A353,Itinerário!$A$3:$I$875,7,FALSE)=0,\"\",VLOOKUP(A353,Itinerário!$A$3:$I$875,7,FALSE))","v":""},{"$f":"IF(VLOOKUP(A353,Itinerário!$A$3:$I$875,8,FALSE)=0,\"\",VLOOKUP(A353,Itinerário!$A$3:$I$875,8,FALSE))","v":""},{"$f":"IF(VLOOKUP(A353,Itinerário!$A$3:$I$875,9,FALSE)=0,\"\",VLOOKUP(A353,Itinerário!$A$3:$I$875,9,FALSE))","v":""}]
[351,{"$f":"VLOOKUP(A354,Itinerário!$A$3:$I$875,3,FALSE)","v":"EVANDRO PEREIRA DE VARGAS"},{"$f":"VLOOKUP(A354,Itinerário!$A$3:$I$875,5,FALSE)","v":"DEZEMBRO"},{"$f":"IF(VLOOKUP(A354,Itinerário!$A$3:$I$875,6,FALSE)=0,\"\",VLOOKUP(A354,Itinerário!$A$3:$I$875,6,FALSE))","v":1},"2018-12-01",{"$f":"IF(VLOOKUP(A354,Itinerário!$A$3:$I$875,7,FALSE)=0,\"\",VLOOKUP(A354,Itinerário!$A$3:$I$875,7,FALSE))","v":"Pregação (programa Colportagem)"},{"$f":"IF(VLOOKUP(A354,Itinerário!$A$3:$I$875,8,FALSE)=0,\"\",VLOOKUP(A354,Itinerário!$A$3:$I$875,8,FALSE))","v":"Campeche"},{"$f":"IF(VLOOKUP(A354,Itinerário!$A$3:$I$875,9,FALSE)=0,\"\",VLOOKUP(A354,Itinerário!$A$3:$I$875,9,FALSE))","v":"Rio Tavares"}]
[352,{"$f":"VLOOKUP(A355,Itinerário!$A$3:$I$875,3,FALSE)","v":"EVANDRO PEREIRA DE VARGAS"},{"$f":"VLOOKUP(A355,Itinerário!$A$3:$I$875,5,FALSE)","v":"DEZEMBRO"},{"$f":"IF(VLOOKUP(A355,Itinerário!$A$3:$I$875,6,FALSE)=0,\"\",VLOOKUP(A355,Itinerário!$A$3:$I$875,6,FALSE))","v":7},"2018-12-07",{"$f":"IF(VLOOKUP(A355,Itinerário!$A$3:$I$875,7,FALSE)=0,\"\",VLOOKUP(A355,Itinerário!$A$3:$I$875,7,FALSE))","v":"Pregação (programa Colportagem)"},{"$f":"IF(VLOOKUP(A355,Itinerário!$A$3:$I$875,8,FALSE)=0,\"\",VLOOKUP(A355,Itinerário!$A$3:$I$875,8,FALSE))","v":"Palhoça"},{"$f":"IF(VLOOKUP(A355,Itinerário!$A$3:$I$875,9,FALSE)=0,\"\",VLOOKUP(A355,Itinerário!$A$3:$I$875,9,FALSE))","v":"Palhoça"}]
[353,{"$f":"VLOOKUP(A356,Itinerário!$A$3:$I$875,3,FALSE)","v":"EVANDRO PEREIRA DE VARGAS"},{"$f":"VLOOKUP(A356,Itinerário!$A$3:$I$875,5,FALSE)","v":"DEZEMBRO"},{"$f":"IF(VLOOKUP(A356,Itinerário!$A$3:$I$875,6,FALSE)=0,\"\",VLOOKUP(A356,Itinerário!$A$3:$I$875,6,FALSE))","v":15},"2018-12-15",{"$f":"IF(VLOOKUP(A356,Itinerário!$A$3:$I$875,7,FALSE)=0,\"\",VLOOKUP(A356,Itinerário!$A$3:$I$875,7,FALSE))","v":"Pregação (programa Colportagem)"},{"$f":"IF(VLOOKUP(A356,Itinerário!$A$3:$I$875,8,FALSE)=0,\"\",VLOOKUP(A356,Itinerário!$A$3:$I$875,8,FALSE))","v":"Imbituba"},{"$f":"IF(VLOOKUP(A356,Itinerário!$A$3:$I$875,9,FALSE)=0,\"\",VLOOKUP(A356,Itinerário!$A$3:$I$875,9,FALSE))","v":"Imbituba"}]
[354,{"$f":"VLOOKUP(A357,Itinerário!$A$3:$I$875,3,FALSE)","v":"EVANDRO PEREIRA DE VARGAS"},{"$f":"VLOOKUP(A357,Itinerário!$A$3:$I$875,5,FALSE)","v":"DEZEMBRO"},{"$f":"IF(VLOOKUP(A357,Itinerário!$A$3:$I$875,6,FALSE)=0,\"\",VLOOKUP(A357,Itinerário!$A$3:$I$875,6,FALSE))","v":"22-29"},"00:00:00",{"$f":"IF(VLOOKUP(A357,Itinerário!$A$3:$I$875,7,FALSE)=0,\"\",VLOOKUP(A357,Itinerário!$A$3:$I$875,7,FALSE))","v":"Equipe Estudantes"},{"$f":"IF(VLOOKUP(A357,Itinerário!$A$3:$I$875,8,FALSE)=0,\"\",VLOOKUP(A357,Itinerário!$A$3:$I$875,8,FALSE))","v":"AC"},{"$f":"IF(VLOOKUP(A357,Itinerário!$A$3:$I$875,9,FALSE)=0,\"\",VLOOKUP(A357,Itinerário!$A$3:$I$875,9,FALSE))","v":"AC"}]
[355,{"$f":"VLOOKUP(A358,Itinerário!$A$3:$I$875,3,FALSE)","v":"EVANDRO PEREIRA DE VARGAS"},{"$f":"VLOOKUP(A358,Itinerário!$A$3:$I$875,5,FALSE)","v":"DEZEMBRO"},{"$f":"IF(VLOOKUP(A358,Itinerário!$A$3:$I$875,6,FALSE)=0,\"\",VLOOKUP(A358,Itinerário!$A$3:$I$875,6,FALSE))","v":""},"00:00:00",{"$f":"IF(VLOOKUP(A358,Itinerário!$A$3:$I$875,7,FALSE)=0,\"\",VLOOKUP(A358,Itinerário!$A$3:$I$875,7,FALSE))","v":""},{"$f":"IF(VLOOKUP(A358,Itinerário!$A$3:$I$875,8,FALSE)=0,\"\",VLOOKUP(A358,Itinerário!$A$3:$I$875,8,FALSE))","v":""},{"$f":"IF(VLOOKUP(A358,Itinerário!$A$3:$I$875,9,FALSE)=0,\"\",VLOOKUP(A358,Itinerário!$A$3:$I$875,9,FALSE))","v":""}]
[356,{"$f":"VLOOKUP(A359,Itinerário!$A$3:$I$875,3,FALSE)","v":"EVANDRO PEREIRA DE VARGAS"},{"$f":"VLOOKUP(A359,Itinerário!$A$3:$I$875,5,FALSE)","v":"DEZEMBRO"},{"$f":"IF(VLOOKUP(A359,Itinerário!$A$3:$I$875,6,FALSE)=0,\"\",VLOOKUP(A359,Itinerário!$A$3:$I$875,6,FALSE))","v":""},"00:00:00",{"$f":"IF(VLOOKUP(A359,Itinerário!$A$3:$I$875,7,FALSE)=0,\"\",VLOOKUP(A359,Itinerário!$A$3:$I$875,7,FALSE))","v":""},{"$f":"IF(VLOOKUP(A359,Itinerário!$A$3:$I$875,8,FALSE)=0,\"\",VLOOKUP(A359,Itinerário!$A$3:$I$875,8,FALSE))","v":""},{"$f":"IF(VLOOKUP(A359,Itinerário!$A$3:$I$875,9,FALSE)=0,\"\",VLOOKUP(A359,Itinerário!$A$3:$I$875,9,FALSE))","v":""}]
[357,{"$f":"VLOOKUP(A360,Itinerário!$A$3:$I$875,3,FALSE)","v":"EVANDRO PEREIRA DE VARGAS"},{"$f":"VLOOKUP(A360,Itinerário!$A$3:$I$875,5,FALSE)","v":"DEZEMBRO"},{"$f":"IF(VLOOKUP(A360,Itinerário!$A$3:$I$875,6,FALSE)=0,\"\",VLOOKUP(A360,Itinerário!$A$3:$I$875,6,FALSE))","v":""},"00:00:00",{"$f":"IF(VLOOKUP(A360,Itinerário!$A$3:$I$875,7,FALSE)=0,\"\",VLOOKUP(A360,Itinerário!$A$3:$I$875,7,FALSE))","v":""},{"$f":"IF(VLOOKUP(A360,Itinerário!$A$3:$I$875,8,FALSE)=0,\"\",VLOOKUP(A360,Itinerário!$A$3:$I$875,8,FALSE))","v":""},{"$f":"IF(VLOOKUP(A360,Itinerário!$A$3:$I$875,9,FALSE)=0,\"\",VLOOKUP(A360,Itinerário!$A$3:$I$875,9,FALSE))","v":""}]
[358,{"$f":"VLOOKUP(A361,Itinerário!$A$3:$I$875,3,FALSE)","v":"EVANDRO PEREIRA DE VARGAS"},{"$f":"VLOOKUP(A361,Itinerário!$A$3:$I$875,5,FALSE)","v":"DEZEMBRO"},{"$f":"IF(VLOOKUP(A361,Itinerário!$A$3:$I$875,6,FALSE)=0,\"\",VLOOKUP(A361,Itinerário!$A$3:$I$875,6,FALSE))","v":""},"00:00:00",{"$f":"IF(VLOOKUP(A361,Itinerário!$A$3:$I$875,7,FALSE)=0,\"\",VLOOKUP(A361,Itinerário!$A$3:$I$875,7,FALSE))","v":""},{"$f":"IF(VLOOKUP(A361,Itinerário!$A$3:$I$875,8,FALSE)=0,\"\",VLOOKUP(A361,Itinerário!$A$3:$I$875,8,FALSE))","v":""},{"$f":"IF(VLOOKUP(A361,Itinerário!$A$3:$I$875,9,FALSE)=0,\"\",VLOOKUP(A361,Itinerário!$A$3:$I$875,9,FALSE))","v":""}]
[359,{"$f":"VLOOKUP(A362,Itinerário!$A$3:$I$875,3,FALSE)","v":"EVANDRO PEREIRA DE VARGAS"},{"$f":"VLOOKUP(A362,Itinerário!$A$3:$I$875,5,FALSE)","v":"DEZEMBRO"},{"$f":"IF(VLOOKUP(A362,Itinerário!$A$3:$I$875,6,FALSE)=0,\"\",VLOOKUP(A362,Itinerário!$A$3:$I$875,6,FALSE))","v":""},"00:00:00",{"$f":"IF(VLOOKUP(A362,Itinerário!$A$3:$I$875,7,FALSE)=0,\"\",VLOOKUP(A362,Itinerário!$A$3:$I$875,7,FALSE))","v":""},{"$f":"IF(VLOOKUP(A362,Itinerário!$A$3:$I$875,8,FALSE)=0,\"\",VLOOKUP(A362,Itinerário!$A$3:$I$875,8,FALSE))","v":""},{"$f":"IF(VLOOKUP(A362,Itinerário!$A$3:$I$875,9,FALSE)=0,\"\",VLOOKUP(A362,Itinerário!$A$3:$I$875,9,FALSE))","v":""}]
[360,{"$f":"VLOOKUP(A363,Itinerário!$A$3:$I$875,3,FALSE)","v":"EVANDRO PEREIRA DE VARGAS"},{"$f":"VLOOKUP(A363,Itinerário!$A$3:$I$875,5,FALSE)","v":"DEZEMBRO"},{"$f":"IF(VLOOKUP(A363,Itinerário!$A$3:$I$875,6,FALSE)=0,\"\",VLOOKUP(A363,Itinerário!$A$3:$I$875,6,FALSE))","v":""},"00:00:00",{"$f":"IF(VLOOKUP(A363,Itinerário!$A$3:$I$875,7,FALSE)=0,\"\",VLOOKUP(A363,Itinerário!$A$3:$I$875,7,FALSE))","v":""},{"$f":"IF(VLOOKUP(A363,Itinerário!$A$3:$I$875,8,FALSE)=0,\"\",VLOOKUP(A363,Itinerário!$A$3:$I$875,8,FALSE))","v":""},{"$f":"IF(VLOOKUP(A363,Itinerário!$A$3:$I$875,9,FALSE)=0,\"\",VLOOKUP(A363,Itinerário!$A$3:$I$875,9,FALSE))","v":""}]
[361,{"$f":"VLOOKUP(A364,Itinerário!$A$3:$I$875,3,FALSE)","v":"FRANCISCO FRANCIEUDO FONSECA"},{"$f":"VLOOKUP(A364,Itinerário!$A$3:$I$875,5,FALSE)","v":"JULHO"},{"$f":"IF(VLOOKUP(A364,Itinerário!$A$3:$I$875,6,FALSE)=0,\"\",VLOOKUP(A364,Itinerário!$A$3:$I$875,6,FALSE))","v":7},"2018-07-07",{"$f":"IF(VLOOKUP(A364,Itinerário!$A$3:$I$875,7,FALSE)=0,\"\",VLOOKUP(A364,Itinerário!$A$3:$I$875,7,FALSE))","v":"Aliança de Fé"},{"$f":"IF(VLOOKUP(A364,Itinerário!$A$3:$I$875,8,FALSE)=0,\"\",VLOOKUP(A364,Itinerário!$A$3:$I$875,8,FALSE))","v":"Nova Brasília"},{"$f":"IF(VLOOKUP(A364,Itinerário!$A$3:$I$875,9,FALSE)=0,\"\",VLOOKUP(A364,Itinerário!$A$3:$I$875,9,FALSE))","v":"Nova Brasília"}]
[362,{"$f":"VLOOKUP(A365,Itinerário!$A$3:$I$875,3,FALSE)","v":"FRANCISCO FRANCIEUDO FONSECA"},{"$f":"VLOOKUP(A365,Itinerário!$A$3:$I$875,5,FALSE)","v":"JULHO"},{"$f":"IF(VLOOKUP(A365,Itinerário!$A$3:$I$875,6,FALSE)=0,\"\",VLOOKUP(A365,Itinerário!$A$3:$I$875,6,FALSE))","v":14},"2018-07-14",{"$f":"IF(VLOOKUP(A365,Itinerário!$A$3:$I$875,7,FALSE)=0,\"\",VLOOKUP(A365,Itinerário!$A$3:$I$875,7,FALSE))","v":"Aliança de Fé"},{"$f":"IF(VLOOKUP(A365,Itinerário!$A$3:$I$875,8,FALSE)=0,\"\",VLOOKUP(A365,Itinerário!$A$3:$I$875,8,FALSE))","v":"Itapema"},{"$f":"IF(VLOOKUP(A365,Itinerário!$A$3:$I$875,9,FALSE)=0,\"\",VLOOKUP(A365,Itinerário!$A$3:$I$875,9,FALSE))","v":"Itapema"}]
[363,{"$f":"VLOOKUP(A366,Itinerário!$A$3:$I$875,3,FALSE)","v":"FRANCISCO FRANCIEUDO FONSECA"},{"$f":"VLOOKUP(A366,Itinerário!$A$3:$I$875,5,FALSE)","v":"JULHO"},{"$f":"IF(VLOOKUP(A366,Itinerário!$A$3:$I$875,6,FALSE)=0,\"\",VLOOKUP(A366,Itinerário!$A$3:$I$875,6,FALSE))","v":16},"2018-07-16",{"$f":"IF(VLOOKUP(A366,Itinerário!$A$3:$I$875,7,FALSE)=0,\"\",VLOOKUP(A366,Itinerário!$A$3:$I$875,7,FALSE))","v":"Aliança de Fé"},{"$f":"IF(VLOOKUP(A366,Itinerário!$A$3:$I$875,8,FALSE)=0,\"\",VLOOKUP(A366,Itinerário!$A$3:$I$875,8,FALSE))","v":"Araranguá"},{"$f":"IF(VLOOKUP(A366,Itinerário!$A$3:$I$875,9,FALSE)=0,\"\",VLOOKUP(A366,Itinerário!$A$3:$I$875,9,FALSE))","v":"Araranguá"}]
[364,{"$f":"VLOOKUP(A367,Itinerário!$A$3:$I$875,3,FALSE)","v":"FRANCISCO FRANCIEUDO FONSECA"},{"$f":"VLOOKUP(A367,Itinerário!$A$3:$I$875,5,FALSE)","v":"JULHO"},{"$f":"IF(VLOOKUP(A367,Itinerário!$A$3:$I$875,6,FALSE)=0,\"\",VLOOKUP(A367,Itinerário!$A$3:$I$875,6,FALSE))","v":21},"2018-07-21",{"$f":"IF(VLOOKUP(A367,Itinerário!$A$3:$I$875,7,FALSE)=0,\"\",VLOOKUP(A367,Itinerário!$A$3:$I$875,7,FALSE))","v":"Férias"},{"$f":"IF(VLOOKUP(A367,Itinerário!$A$3:$I$875,8,FALSE)=0,\"\",VLOOKUP(A367,Itinerário!$A$3:$I$875,8,FALSE))","v":""},{"$f":"IF(VLOOKUP(A367,Itinerário!$A$3:$I$875,9,FALSE)=0,\"\",VLOOKUP(A367,Itinerário!$A$3:$I$875,9,FALSE))","v":""}]
[365,{"$f":"VLOOKUP(A368,Itinerário!$A$3:$I$875,3,FALSE)","v":"FRANCISCO FRANCIEUDO FONSECA"},{"$f":"VLOOKUP(A368,Itinerário!$A$3:$I$875,5,FALSE)","v":"JULHO"},{"$f":"IF(VLOOKUP(A368,Itinerário!$A$3:$I$875,6,FALSE)=0,\"\",VLOOKUP(A368,Itinerário!$A$3:$I$875,6,FALSE))","v":""},"00:00:00",{"$f":"IF(VLOOKUP(A368,Itinerário!$A$3:$I$875,7,FALSE)=0,\"\",VLOOKUP(A368,Itinerário!$A$3:$I$875,7,FALSE))","v":""},{"$f":"IF(VLOOKUP(A368,Itinerário!$A$3:$I$875,8,FALSE)=0,\"\",VLOOKUP(A368,Itinerário!$A$3:$I$875,8,FALSE))","v":""},{"$f":"IF(VLOOKUP(A368,Itinerário!$A$3:$I$875,9,FALSE)=0,\"\",VLOOKUP(A368,Itinerário!$A$3:$I$875,9,FALSE))","v":""}]
[366,{"$f":"VLOOKUP(A369,Itinerário!$A$3:$I$875,3,FALSE)","v":"FRANCISCO FRANCIEUDO FONSECA"},{"$f":"VLOOKUP(A369,Itinerário!$A$3:$I$875,5,FALSE)","v":"JULHO"},{"$f":"IF(VLOOKUP(A369,Itinerário!$A$3:$I$875,6,FALSE)=0,\"\",VLOOKUP(A369,Itinerário!$A$3:$I$875,6,FALSE))","v":""},"00:00:00",{"$f":"IF(VLOOKUP(A369,Itinerário!$A$3:$I$875,7,FALSE)=0,\"\",VLOOKUP(A369,Itinerário!$A$3:$I$875,7,FALSE))","v":""},{"$f":"IF(VLOOKUP(A369,Itinerário!$A$3:$I$875,8,FALSE)=0,\"\",VLOOKUP(A369,Itinerário!$A$3:$I$875,8,FALSE))","v":""},{"$f":"IF(VLOOKUP(A369,Itinerário!$A$3:$I$875,9,FALSE)=0,\"\",VLOOKUP(A369,Itinerário!$A$3:$I$875,9,FALSE))","v":""}]
[367,{"$f":"VLOOKUP(A370,Itinerário!$A$3:$I$875,3,FALSE)","v":"FRANCISCO FRANCIEUDO FONSECA"},{"$f":"VLOOKUP(A370,Itinerário!$A$3:$I$875,5,FALSE)","v":"JULHO"},{"$f":"IF(VLOOKUP(A370,Itinerário!$A$3:$I$875,6,FALSE)=0,\"\",VLOOKUP(A370,Itinerário!$A$3:$I$875,6,FALSE))","v":""},"00:00:00",{"$f":"IF(VLOOKUP(A370,Itinerário!$A$3:$I$875,7,FALSE)=0,\"\",VLOOKUP(A370,Itinerário!$A$3:$I$875,7,FALSE))","v":""},{"$f":"IF(VLOOKUP(A370,Itinerário!$A$3:$I$875,8,FALSE)=0,\"\",VLOOKUP(A370,Itinerário!$A$3:$I$875,8,FALSE))","v":""},{"$f":"IF(VLOOKUP(A370,Itinerário!$A$3:$I$875,9,FALSE)=0,\"\",VLOOKUP(A370,Itinerário!$A$3:$I$875,9,FALSE))","v":""}]
[368,{"$f":"VLOOKUP(A371,Itinerário!$A$3:$I$875,3,FALSE)","v":"FRANCISCO FRANCIEUDO FONSECA"},{"$f":"VLOOKUP(A371,Itinerário!$A$3:$I$875,5,FALSE)","v":"JULHO"},{"$f":"IF(VLOOKUP(A371,Itinerário!$A$3:$I$875,6,FALSE)=0,\"\",VLOOKUP(A371,Itinerário!$A$3:$I$875,6,FALSE))","v":""},"00:00:00",{"$f":"IF(VLOOKUP(A371,Itinerário!$A$3:$I$875,7,FALSE)=0,\"\",VLOOKUP(A371,Itinerário!$A$3:$I$875,7,FALSE))","v":""},{"$f":"IF(VLOOKUP(A371,Itinerário!$A$3:$I$875,8,FALSE)=0,\"\",VLOOKUP(A371,Itinerário!$A$3:$I$875,8,FALSE))","v":""},{"$f":"IF(VLOOKUP(A371,Itinerário!$A$3:$I$875,9,FALSE)=0,\"\",VLOOKUP(A371,Itinerário!$A$3:$I$875,9,FALSE))","v":""}]
[369,{"$f":"VLOOKUP(A372,Itinerário!$A$3:$I$875,3,FALSE)","v":"FRANCISCO FRANCIEUDO FONSECA"},{"$f":"VLOOKUP(A372,Itinerário!$A$3:$I$875,5,FALSE)","v":"JULHO"},{"$f":"IF(VLOOKUP(A372,Itinerário!$A$3:$I$875,6,FALSE)=0,\"\",VLOOKUP(A372,Itinerário!$A$3:$I$875,6,FALSE))","v":""},"00:00:00",{"$f":"IF(VLOOKUP(A372,Itinerário!$A$3:$I$875,7,FALSE)=0,\"\",VLOOKUP(A372,Itinerário!$A$3:$I$875,7,FALSE))","v":""},{"$f":"IF(VLOOKUP(A372,Itinerário!$A$3:$I$875,8,FALSE)=0,\"\",VLOOKUP(A372,Itinerário!$A$3:$I$875,8,FALSE))","v":""},{"$f":"IF(VLOOKUP(A372,Itinerário!$A$3:$I$875,9,FALSE)=0,\"\",VLOOKUP(A372,Itinerário!$A$3:$I$875,9,FALSE))","v":""}]
[370,{"$f":"VLOOKUP(A373,Itinerário!$A$3:$I$875,3,FALSE)","v":"FRANCISCO FRANCIEUDO FONSECA"},{"$f":"VLOOKUP(A373,Itinerário!$A$3:$I$875,5,FALSE)","v":"JULHO"},{"$f":"IF(VLOOKUP(A373,Itinerário!$A$3:$I$875,6,FALSE)=0,\"\",VLOOKUP(A373,Itinerário!$A$3:$I$875,6,FALSE))","v":""},"00:00:00",{"$f":"IF(VLOOKUP(A373,Itinerário!$A$3:$I$875,7,FALSE)=0,\"\",VLOOKUP(A373,Itinerário!$A$3:$I$875,7,FALSE))","v":""},{"$f":"IF(VLOOKUP(A373,Itinerário!$A$3:$I$875,8,FALSE)=0,\"\",VLOOKUP(A373,Itinerário!$A$3:$I$875,8,FALSE))","v":""},{"$f":"IF(VLOOKUP(A373,Itinerário!$A$3:$I$875,9,FALSE)=0,\"\",VLOOKUP(A373,Itinerário!$A$3:$I$875,9,FALSE))","v":""}]
[371,{"$f":"VLOOKUP(A374,Itinerário!$A$3:$I$875,3,FALSE)","v":"FRANCISCO FRANCIEUDO FONSECA"},{"$f":"VLOOKUP(A374,Itinerário!$A$3:$I$875,5,FALSE)","v":"AGOSTO"},{"$f":"IF(VLOOKUP(A374,Itinerário!$A$3:$I$875,6,FALSE)=0,\"\",VLOOKUP(A374,Itinerário!$A$3:$I$875,6,FALSE))","v":4},"2018-08-04",{"$f":"IF(VLOOKUP(A374,Itinerário!$A$3:$I$875,7,FALSE)=0,\"\",VLOOKUP(A374,Itinerário!$A$3:$I$875,7,FALSE))","v":"Aliança de Fé"},{"$f":"IF(VLOOKUP(A374,Itinerário!$A$3:$I$875,8,FALSE)=0,\"\",VLOOKUP(A374,Itinerário!$A$3:$I$875,8,FALSE))","v":"Biguaçu"},{"$f":"IF(VLOOKUP(A374,Itinerário!$A$3:$I$875,9,FALSE)=0,\"\",VLOOKUP(A374,Itinerário!$A$3:$I$875,9,FALSE))","v":"Biguaçu"}]
[372,{"$f":"VLOOKUP(A375,Itinerário!$A$3:$I$875,3,FALSE)","v":"FRANCISCO FRANCIEUDO FONSECA"},{"$f":"VLOOKUP(A375,Itinerário!$A$3:$I$875,5,FALSE)","v":"AGOSTO"},{"$f":"IF(VLOOKUP(A375,Itinerário!$A$3:$I$875,6,FALSE)=0,\"\",VLOOKUP(A375,Itinerário!$A$3:$I$875,6,FALSE))","v":11},"2018-08-11",{"$f":"IF(VLOOKUP(A375,Itinerário!$A$3:$I$875,7,FALSE)=0,\"\",VLOOKUP(A375,Itinerário!$A$3:$I$875,7,FALSE))","v":"Aliança de Fé"},{"$f":"IF(VLOOKUP(A375,Itinerário!$A$3:$I$875,8,FALSE)=0,\"\",VLOOKUP(A375,Itinerário!$A$3:$I$875,8,FALSE))","v":"Revoredo"},{"$f":"IF(VLOOKUP(A375,Itinerário!$A$3:$I$875,9,FALSE)=0,\"\",VLOOKUP(A375,Itinerário!$A$3:$I$875,9,FALSE))","v":"Revoredo"}]
[373,{"$f":"VLOOKUP(A376,Itinerário!$A$3:$I$875,3,FALSE)","v":"FRANCISCO FRANCIEUDO FONSECA"},{"$f":"VLOOKUP(A376,Itinerário!$A$3:$I$875,5,FALSE)","v":"AGOSTO"},{"$f":"IF(VLOOKUP(A376,Itinerário!$A$3:$I$875,6,FALSE)=0,\"\",VLOOKUP(A376,Itinerário!$A$3:$I$875,6,FALSE))","v":18},"2018-08-18",{"$f":"IF(VLOOKUP(A376,Itinerário!$A$3:$I$875,7,FALSE)=0,\"\",VLOOKUP(A376,Itinerário!$A$3:$I$875,7,FALSE))","v":"Aliança de Fé"},{"$f":"IF(VLOOKUP(A376,Itinerário!$A$3:$I$875,8,FALSE)=0,\"\",VLOOKUP(A376,Itinerário!$A$3:$I$875,8,FALSE))","v":"Bom Retiro"},{"$f":"IF(VLOOKUP(A376,Itinerário!$A$3:$I$875,9,FALSE)=0,\"\",VLOOKUP(A376,Itinerário!$A$3:$I$875,9,FALSE))","v":"Bom Retiro"}]
[374,{"$f":"VLOOKUP(A377,Itinerário!$A$3:$I$875,3,FALSE)","v":"FRANCISCO FRANCIEUDO FONSECA"},{"$f":"VLOOKUP(A377,Itinerário!$A$3:$I$875,5,FALSE)","v":"AGOSTO"},{"$f":"IF(VLOOKUP(A377,Itinerário!$A$3:$I$875,6,FALSE)=0,\"\",VLOOKUP(A377,Itinerário!$A$3:$I$875,6,FALSE))","v":25},"2018-08-25",{"$f":"IF(VLOOKUP(A377,Itinerário!$A$3:$I$875,7,FALSE)=0,\"\",VLOOKUP(A377,Itinerário!$A$3:$I$875,7,FALSE))","v":"Aliança de Fé"},{"$f":"IF(VLOOKUP(A377,Itinerário!$A$3:$I$875,8,FALSE)=0,\"\",VLOOKUP(A377,Itinerário!$A$3:$I$875,8,FALSE))","v":"Lages"},{"$f":"IF(VLOOKUP(A377,Itinerário!$A$3:$I$875,9,FALSE)=0,\"\",VLOOKUP(A377,Itinerário!$A$3:$I$875,9,FALSE))","v":"Lages"}]
[375,{"$f":"VLOOKUP(A378,Itinerário!$A$3:$I$875,3,FALSE)","v":"FRANCISCO FRANCIEUDO FONSECA"},{"$f":"VLOOKUP(A378,Itinerário!$A$3:$I$875,5,FALSE)","v":"AGOSTO"},{"$f":"IF(VLOOKUP(A378,Itinerário!$A$3:$I$875,6,FALSE)=0,\"\",VLOOKUP(A378,Itinerário!$A$3:$I$875,6,FALSE))","v":""},"00:00:00",{"$f":"IF(VLOOKUP(A378,Itinerário!$A$3:$I$875,7,FALSE)=0,\"\",VLOOKUP(A378,Itinerário!$A$3:$I$875,7,FALSE))","v":""},{"$f":"IF(VLOOKUP(A378,Itinerário!$A$3:$I$875,8,FALSE)=0,\"\",VLOOKUP(A378,Itinerário!$A$3:$I$875,8,FALSE))","v":""},{"$f":"IF(VLOOKUP(A378,Itinerário!$A$3:$I$875,9,FALSE)=0,\"\",VLOOKUP(A378,Itinerário!$A$3:$I$875,9,FALSE))","v":""}]
[376,{"$f":"VLOOKUP(A379,Itinerário!$A$3:$I$875,3,FALSE)","v":"FRANCISCO FRANCIEUDO FONSECA"},{"$f":"VLOOKUP(A379,Itinerário!$A$3:$I$875,5,FALSE)","v":"AGOSTO"},{"$f":"IF(VLOOKUP(A379,Itinerário!$A$3:$I$875,6,FALSE)=0,\"\",VLOOKUP(A379,Itinerário!$A$3:$I$875,6,FALSE))","v":""},"00:00:00",{"$f":"IF(VLOOKUP(A379,Itinerário!$A$3:$I$875,7,FALSE)=0,\"\",VLOOKUP(A379,Itinerário!$A$3:$I$875,7,FALSE))","v":""},{"$f":"IF(VLOOKUP(A379,Itinerário!$A$3:$I$875,8,FALSE)=0,\"\",VLOOKUP(A379,Itinerário!$A$3:$I$875,8,FALSE))","v":""},{"$f":"IF(VLOOKUP(A379,Itinerário!$A$3:$I$875,9,FALSE)=0,\"\",VLOOKUP(A379,Itinerário!$A$3:$I$875,9,FALSE))","v":""}]
[377,{"$f":"VLOOKUP(A380,Itinerário!$A$3:$I$875,3,FALSE)","v":"FRANCISCO FRANCIEUDO FONSECA"},{"$f":"VLOOKUP(A380,Itinerário!$A$3:$I$875,5,FALSE)","v":"AGOSTO"},{"$f":"IF(VLOOKUP(A380,Itinerário!$A$3:$I$875,6,FALSE)=0,\"\",VLOOKUP(A380,Itinerário!$A$3:$I$875,6,FALSE))","v":""},"00:00:00",{"$f":"IF(VLOOKUP(A380,Itinerário!$A$3:$I$875,7,FALSE)=0,\"\",VLOOKUP(A380,Itinerário!$A$3:$I$875,7,FALSE))","v":""},{"$f":"IF(VLOOKUP(A380,Itinerário!$A$3:$I$875,8,FALSE)=0,\"\",VLOOKUP(A380,Itinerário!$A$3:$I$875,8,FALSE))","v":""},{"$f":"IF(VLOOKUP(A380,Itinerário!$A$3:$I$875,9,FALSE)=0,\"\",VLOOKUP(A380,Itinerário!$A$3:$I$875,9,FALSE))","v":""}]
[378,{"$f":"VLOOKUP(A381,Itinerário!$A$3:$I$875,3,FALSE)","v":"FRANCISCO FRANCIEUDO FONSECA"},{"$f":"VLOOKUP(A381,Itinerário!$A$3:$I$875,5,FALSE)","v":"AGOSTO"},{"$f":"IF(VLOOKUP(A381,Itinerário!$A$3:$I$875,6,FALSE)=0,\"\",VLOOKUP(A381,Itinerário!$A$3:$I$875,6,FALSE))","v":""},"00:00:00",{"$f":"IF(VLOOKUP(A381,Itinerário!$A$3:$I$875,7,FALSE)=0,\"\",VLOOKUP(A381,Itinerário!$A$3:$I$875,7,FALSE))","v":""},{"$f":"IF(VLOOKUP(A381,Itinerário!$A$3:$I$875,8,FALSE)=0,\"\",VLOOKUP(A381,Itinerário!$A$3:$I$875,8,FALSE))","v":""},{"$f":"IF(VLOOKUP(A381,Itinerário!$A$3:$I$875,9,FALSE)=0,\"\",VLOOKUP(A381,Itinerário!$A$3:$I$875,9,FALSE))","v":""}]
[379,{"$f":"VLOOKUP(A382,Itinerário!$A$3:$I$875,3,FALSE)","v":"FRANCISCO FRANCIEUDO FONSECA"},{"$f":"VLOOKUP(A382,Itinerário!$A$3:$I$875,5,FALSE)","v":"AGOSTO"},{"$f":"IF(VLOOKUP(A382,Itinerário!$A$3:$I$875,6,FALSE)=0,\"\",VLOOKUP(A382,Itinerário!$A$3:$I$875,6,FALSE))","v":""},"00:00:00",{"$f":"IF(VLOOKUP(A382,Itinerário!$A$3:$I$875,7,FALSE)=0,\"\",VLOOKUP(A382,Itinerário!$A$3:$I$875,7,FALSE))","v":""},{"$f":"IF(VLOOKUP(A382,Itinerário!$A$3:$I$875,8,FALSE)=0,\"\",VLOOKUP(A382,Itinerário!$A$3:$I$875,8,FALSE))","v":""},{"$f":"IF(VLOOKUP(A382,Itinerário!$A$3:$I$875,9,FALSE)=0,\"\",VLOOKUP(A382,Itinerário!$A$3:$I$875,9,FALSE))","v":""}]
[380,{"$f":"VLOOKUP(A383,Itinerário!$A$3:$I$875,3,FALSE)","v":"FRANCISCO FRANCIEUDO FONSECA"},{"$f":"VLOOKUP(A383,Itinerário!$A$3:$I$875,5,FALSE)","v":"AGOSTO"},{"$f":"IF(VLOOKUP(A383,Itinerário!$A$3:$I$875,6,FALSE)=0,\"\",VLOOKUP(A383,Itinerário!$A$3:$I$875,6,FALSE))","v":""},"00:00:00",{"$f":"IF(VLOOKUP(A383,Itinerário!$A$3:$I$875,7,FALSE)=0,\"\",VLOOKUP(A383,Itinerário!$A$3:$I$875,7,FALSE))","v":""},{"$f":"IF(VLOOKUP(A383,Itinerário!$A$3:$I$875,8,FALSE)=0,\"\",VLOOKUP(A383,Itinerário!$A$3:$I$875,8,FALSE))","v":""},{"$f":"IF(VLOOKUP(A383,Itinerário!$A$3:$I$875,9,FALSE)=0,\"\",VLOOKUP(A383,Itinerário!$A$3:$I$875,9,FALSE))","v":""}]
[381,{"$f":"VLOOKUP(A384,Itinerário!$A$3:$I$875,3,FALSE)","v":"FRANCISCO FRANCIEUDO FONSECA"},{"$f":"VLOOKUP(A384,Itinerário!$A$3:$I$875,5,FALSE)","v":"SETEMBRO"},{"$f":"IF(VLOOKUP(A384,Itinerário!$A$3:$I$875,6,FALSE)=0,\"\",VLOOKUP(A384,Itinerário!$A$3:$I$875,6,FALSE))","v":1},"2018-09-01",{"$f":"IF(VLOOKUP(A384,Itinerário!$A$3:$I$875,7,FALSE)=0,\"\",VLOOKUP(A384,Itinerário!$A$3:$I$875,7,FALSE))","v":"Aliança de Fé"},{"$f":"IF(VLOOKUP(A384,Itinerário!$A$3:$I$875,8,FALSE)=0,\"\",VLOOKUP(A384,Itinerário!$A$3:$I$875,8,FALSE))","v":"São Vicente"},{"$f":"IF(VLOOKUP(A384,Itinerário!$A$3:$I$875,9,FALSE)=0,\"\",VLOOKUP(A384,Itinerário!$A$3:$I$875,9,FALSE))","v":"São Vicente"}]
[382,{"$f":"VLOOKUP(A385,Itinerário!$A$3:$I$875,3,FALSE)","v":"FRANCISCO FRANCIEUDO FONSECA"},{"$f":"VLOOKUP(A385,Itinerário!$A$3:$I$875,5,FALSE)","v":"SETEMBRO"},{"$f":"IF(VLOOKUP(A385,Itinerário!$A$3:$I$875,6,FALSE)=0,\"\",VLOOKUP(A385,Itinerário!$A$3:$I$875,6,FALSE))","v":8},"2018-09-08",{"$f":"IF(VLOOKUP(A385,Itinerário!$A$3:$I$875,7,FALSE)=0,\"\",VLOOKUP(A385,Itinerário!$A$3:$I$875,7,FALSE))","v":"Encontro Filhos de Obreiros CATRE"},{"$f":"IF(VLOOKUP(A385,Itinerário!$A$3:$I$875,8,FALSE)=0,\"\",VLOOKUP(A385,Itinerário!$A$3:$I$875,8,FALSE))","v":"CATRE"},{"$f":"IF(VLOOKUP(A385,Itinerário!$A$3:$I$875,9,FALSE)=0,\"\",VLOOKUP(A385,Itinerário!$A$3:$I$875,9,FALSE))","v":"CATRE"}]
[383,{"$f":"VLOOKUP(A386,Itinerário!$A$3:$I$875,3,FALSE)","v":"FRANCISCO FRANCIEUDO FONSECA"},{"$f":"VLOOKUP(A386,Itinerário!$A$3:$I$875,5,FALSE)","v":"SETEMBRO"},{"$f":"IF(VLOOKUP(A386,Itinerário!$A$3:$I$875,6,FALSE)=0,\"\",VLOOKUP(A386,Itinerário!$A$3:$I$875,6,FALSE))","v":15},"2018-09-15",{"$f":"IF(VLOOKUP(A386,Itinerário!$A$3:$I$875,7,FALSE)=0,\"\",VLOOKUP(A386,Itinerário!$A$3:$I$875,7,FALSE))","v":"Aliança de Fé"},{"$f":"IF(VLOOKUP(A386,Itinerário!$A$3:$I$875,8,FALSE)=0,\"\",VLOOKUP(A386,Itinerário!$A$3:$I$875,8,FALSE))","v":"Navegantes"},{"$f":"IF(VLOOKUP(A386,Itinerário!$A$3:$I$875,9,FALSE)=0,\"\",VLOOKUP(A386,Itinerário!$A$3:$I$875,9,FALSE))","v":"Navegantes"}]
[384,{"$f":"VLOOKUP(A387,Itinerário!$A$3:$I$875,3,FALSE)","v":"FRANCISCO FRANCIEUDO FONSECA"},{"$f":"VLOOKUP(A387,Itinerário!$A$3:$I$875,5,FALSE)","v":"SETEMBRO"},{"$f":"IF(VLOOKUP(A387,Itinerário!$A$3:$I$875,6,FALSE)=0,\"\",VLOOKUP(A387,Itinerário!$A$3:$I$875,6,FALSE))","v":22},"2018-09-22",{"$f":"IF(VLOOKUP(A387,Itinerário!$A$3:$I$875,7,FALSE)=0,\"\",VLOOKUP(A387,Itinerário!$A$3:$I$875,7,FALSE))","v":"Aliança de Fé"},{"$f":"IF(VLOOKUP(A387,Itinerário!$A$3:$I$875,8,FALSE)=0,\"\",VLOOKUP(A387,Itinerário!$A$3:$I$875,8,FALSE))","v":"Imbituba"},{"$f":"IF(VLOOKUP(A387,Itinerário!$A$3:$I$875,9,FALSE)=0,\"\",VLOOKUP(A387,Itinerário!$A$3:$I$875,9,FALSE))","v":"Imbituba"}]
[385,{"$f":"VLOOKUP(A388,Itinerário!$A$3:$I$875,3,FALSE)","v":"FRANCISCO FRANCIEUDO FONSECA"},{"$f":"VLOOKUP(A388,Itinerário!$A$3:$I$875,5,FALSE)","v":"SETEMBRO"},{"$f":"IF(VLOOKUP(A388,Itinerário!$A$3:$I$875,6,FALSE)=0,\"\",VLOOKUP(A388,Itinerário!$A$3:$I$875,6,FALSE))","v":29},{"$f":"IFERROR(DATE(RIGHT($B$2,4),VLOOKUP(C388,$J$4:$K$15,2,FALSE),D388),0)","v":"2018-09-29"},{"$f":"IF(VLOOKUP(A388,Itinerário!$A$3:$I$875,7,FALSE)=0,\"\",VLOOKUP(A388,Itinerário!$A$3:$I$875,7,FALSE))","v":"Ajuste"},{"$f":"IF(VLOOKUP(A388,Itinerário!$A$3:$I$875,8,FALSE)=0,\"\",VLOOKUP(A388,Itinerário!$A$3:$I$875,8,FALSE))","v":""},{"$f":"IF(VLOOKUP(A388,Itinerário!$A$3:$I$875,9,FALSE)=0,\"\",VLOOKUP(A388,Itinerário!$A$3:$I$875,9,FALSE))","v":""}]
[386,{"$f":"VLOOKUP(A389,Itinerário!$A$3:$I$875,3,FALSE)","v":"FRANCISCO FRANCIEUDO FONSECA"},{"$f":"VLOOKUP(A389,Itinerário!$A$3:$I$875,5,FALSE)","v":"SETEMBRO"},{"$f":"IF(VLOOKUP(A389,Itinerário!$A$3:$I$875,6,FALSE)=0,\"\",VLOOKUP(A389,Itinerário!$A$3:$I$875,6,FALSE))","v":""},"00:00:00",{"$f":"IF(VLOOKUP(A389,Itinerário!$A$3:$I$875,7,FALSE)=0,\"\",VLOOKUP(A389,Itinerário!$A$3:$I$875,7,FALSE))","v":""},{"$f":"IF(VLOOKUP(A389,Itinerário!$A$3:$I$875,8,FALSE)=0,\"\",VLOOKUP(A389,Itinerário!$A$3:$I$875,8,FALSE))","v":""},{"$f":"IF(VLOOKUP(A389,Itinerário!$A$3:$I$875,9,FALSE)=0,\"\",VLOOKUP(A389,Itinerário!$A$3:$I$875,9,FALSE))","v":""}]
[387,{"$f":"VLOOKUP(A390,Itinerário!$A$3:$I$875,3,FALSE)","v":"FRANCISCO FRANCIEUDO FONSECA"},{"$f":"VLOOKUP(A390,Itinerário!$A$3:$I$875,5,FALSE)","v":"SETEMBRO"},{"$f":"IF(VLOOKUP(A390,Itinerário!$A$3:$I$875,6,FALSE)=0,\"\",VLOOKUP(A390,Itinerário!$A$3:$I$875,6,FALSE))","v":""},"00:00:00",{"$f":"IF(VLOOKUP(A390,Itinerário!$A$3:$I$875,7,FALSE)=0,\"\",VLOOKUP(A390,Itinerário!$A$3:$I$875,7,FALSE))","v":""},{"$f":"IF(VLOOKUP(A390,Itinerário!$A$3:$I$875,8,FALSE)=0,\"\",VLOOKUP(A390,Itinerário!$A$3:$I$875,8,FALSE))","v":""},{"$f":"IF(VLOOKUP(A390,Itinerário!$A$3:$I$875,9,FALSE)=0,\"\",VLOOKUP(A390,Itinerário!$A$3:$I$875,9,FALSE))","v":""}]
[388,{"$f":"VLOOKUP(A391,Itinerário!$A$3:$I$875,3,FALSE)","v":"FRANCISCO FRANCIEUDO FONSECA"},{"$f":"VLOOKUP(A391,Itinerário!$A$3:$I$875,5,FALSE)","v":"SETEMBRO"},{"$f":"IF(VLOOKUP(A391,Itinerário!$A$3:$I$875,6,FALSE)=0,\"\",VLOOKUP(A391,Itinerário!$A$3:$I$875,6,FALSE))","v":""},"00:00:00",{"$f":"IF(VLOOKUP(A391,Itinerário!$A$3:$I$875,7,FALSE)=0,\"\",VLOOKUP(A391,Itinerário!$A$3:$I$875,7,FALSE))","v":""},{"$f":"IF(VLOOKUP(A391,Itinerário!$A$3:$I$875,8,FALSE)=0,\"\",VLOOKUP(A391,Itinerário!$A$3:$I$875,8,FALSE))","v":""},{"$f":"IF(VLOOKUP(A391,Itinerário!$A$3:$I$875,9,FALSE)=0,\"\",VLOOKUP(A391,Itinerário!$A$3:$I$875,9,FALSE))","v":""}]
[389,{"$f":"VLOOKUP(A392,Itinerário!$A$3:$I$875,3,FALSE)","v":"FRANCISCO FRANCIEUDO FONSECA"},{"$f":"VLOOKUP(A392,Itinerário!$A$3:$I$875,5,FALSE)","v":"SETEMBRO"},{"$f":"IF(VLOOKUP(A392,Itinerário!$A$3:$I$875,6,FALSE)=0,\"\",VLOOKUP(A392,Itinerário!$A$3:$I$875,6,FALSE))","v":""},"00:00:00",{"$f":"IF(VLOOKUP(A392,Itinerário!$A$3:$I$875,7,FALSE)=0,\"\",VLOOKUP(A392,Itinerário!$A$3:$I$875,7,FALSE))","v":""},{"$f":"IF(VLOOKUP(A392,Itinerário!$A$3:$I$875,8,FALSE)=0,\"\",VLOOKUP(A392,Itinerário!$A$3:$I$875,8,FALSE))","v":""},{"$f":"IF(VLOOKUP(A392,Itinerário!$A$3:$I$875,9,FALSE)=0,\"\",VLOOKUP(A392,Itinerário!$A$3:$I$875,9,FALSE))","v":""}]
[390,{"$f":"VLOOKUP(A393,Itinerário!$A$3:$I$875,3,FALSE)","v":"FRANCISCO FRANCIEUDO FONSECA"},{"$f":"VLOOKUP(A393,Itinerário!$A$3:$I$875,5,FALSE)","v":"SETEMBRO"},{"$f":"IF(VLOOKUP(A393,Itinerário!$A$3:$I$875,6,FALSE)=0,\"\",VLOOKUP(A393,Itinerário!$A$3:$I$875,6,FALSE))","v":""},"00:00:00",{"$f":"IF(VLOOKUP(A393,Itinerário!$A$3:$I$875,7,FALSE)=0,\"\",VLOOKUP(A393,Itinerário!$A$3:$I$875,7,FALSE))","v":""},{"$f":"IF(VLOOKUP(A393,Itinerário!$A$3:$I$875,8,FALSE)=0,\"\",VLOOKUP(A393,Itinerário!$A$3:$I$875,8,FALSE))","v":""},{"$f":"IF(VLOOKUP(A393,Itinerário!$A$3:$I$875,9,FALSE)=0,\"\",VLOOKUP(A393,Itinerário!$A$3:$I$875,9,FALSE))","v":""}]
[391,{"$f":"VLOOKUP(A394,Itinerário!$A$3:$I$875,3,FALSE)","v":"FRANCISCO FRANCIEUDO FONSECA"},{"$f":"VLOOKUP(A394,Itinerário!$A$3:$I$875,5,FALSE)","v":"OUTUBRO"},{"$f":"IF(VLOOKUP(A394,Itinerário!$A$3:$I$875,6,FALSE)=0,\"\",VLOOKUP(A394,Itinerário!$A$3:$I$875,6,FALSE))","v":6},"2018-10-06",{"$f":"IF(VLOOKUP(A394,Itinerário!$A$3:$I$875,7,FALSE)=0,\"\",VLOOKUP(A394,Itinerário!$A$3:$I$875,7,FALSE))","v":"Aliança de Fé"},{"$f":"IF(VLOOKUP(A394,Itinerário!$A$3:$I$875,8,FALSE)=0,\"\",VLOOKUP(A394,Itinerário!$A$3:$I$875,8,FALSE))","v":"Criciúma"},{"$f":"IF(VLOOKUP(A394,Itinerário!$A$3:$I$875,9,FALSE)=0,\"\",VLOOKUP(A394,Itinerário!$A$3:$I$875,9,FALSE))","v":"Criciúma"}]
[392,{"$f":"VLOOKUP(A395,Itinerário!$A$3:$I$875,3,FALSE)","v":"FRANCISCO FRANCIEUDO FONSECA"},{"$f":"VLOOKUP(A395,Itinerário!$A$3:$I$875,5,FALSE)","v":"OUTUBRO"},{"$f":"IF(VLOOKUP(A395,Itinerário!$A$3:$I$875,6,FALSE)=0,\"\",VLOOKUP(A395,Itinerário!$A$3:$I$875,6,FALSE))","v":13},"2018-10-13",{"$f":"IF(VLOOKUP(A395,Itinerário!$A$3:$I$875,7,FALSE)=0,\"\",VLOOKUP(A395,Itinerário!$A$3:$I$875,7,FALSE))","v":"Aliança de Fé"},{"$f":"IF(VLOOKUP(A395,Itinerário!$A$3:$I$875,8,FALSE)=0,\"\",VLOOKUP(A395,Itinerário!$A$3:$I$875,8,FALSE))","v":"Balneário Camboriú"},{"$f":"IF(VLOOKUP(A395,Itinerário!$A$3:$I$875,9,FALSE)=0,\"\",VLOOKUP(A395,Itinerário!$A$3:$I$875,9,FALSE))","v":"Balneário Camboriú"}]
[393,{"$f":"VLOOKUP(A396,Itinerário!$A$3:$I$875,3,FALSE)","v":"FRANCISCO FRANCIEUDO FONSECA"},{"$f":"VLOOKUP(A396,Itinerário!$A$3:$I$875,5,FALSE)","v":"OUTUBRO"},{"$f":"IF(VLOOKUP(A396,Itinerário!$A$3:$I$875,6,FALSE)=0,\"\",VLOOKUP(A396,Itinerário!$A$3:$I$875,6,FALSE))","v":20},"2018-10-20",{"$f":"IF(VLOOKUP(A396,Itinerário!$A$3:$I$875,7,FALSE)=0,\"\",VLOOKUP(A396,Itinerário!$A$3:$I$875,7,FALSE))","v":"Aliança de Fé"},{"$f":"IF(VLOOKUP(A396,Itinerário!$A$3:$I$875,8,FALSE)=0,\"\",VLOOKUP(A396,Itinerário!$A$3:$I$875,8,FALSE))","v":"Joaçaba"},{"$f":"IF(VLOOKUP(A396,Itinerário!$A$3:$I$875,9,FALSE)=0,\"\",VLOOKUP(A396,Itinerário!$A$3:$I$875,9,FALSE))","v":"Joaçaba"}]
[394,{"$f":"VLOOKUP(A397,Itinerário!$A$3:$I$875,3,FALSE)","v":"FRANCISCO FRANCIEUDO FONSECA"},{"$f":"VLOOKUP(A397,Itinerário!$A$3:$I$875,5,FALSE)","v":"OUTUBRO"},{"$f":"IF(VLOOKUP(A397,Itinerário!$A$3:$I$875,6,FALSE)=0,\"\",VLOOKUP(A397,Itinerário!$A$3:$I$875,6,FALSE))","v":"26-28"},"00:00:00",{"$f":"IF(VLOOKUP(A397,Itinerário!$A$3:$I$875,7,FALSE)=0,\"\",VLOOKUP(A397,Itinerário!$A$3:$I$875,7,FALSE))","v":"Santa Covocação (Seminário Teórico Prático)"},{"$f":"IF(VLOOKUP(A397,Itinerário!$A$3:$I$875,8,FALSE)=0,\"\",VLOOKUP(A397,Itinerário!$A$3:$I$875,8,FALSE))","v":"AC"},{"$f":"IF(VLOOKUP(A397,Itinerário!$A$3:$I$875,9,FALSE)=0,\"\",VLOOKUP(A397,Itinerário!$A$3:$I$875,9,FALSE))","v":"AC"}]
[395,{"$f":"VLOOKUP(A398,Itinerário!$A$3:$I$875,3,FALSE)","v":"FRANCISCO FRANCIEUDO FONSECA"},{"$f":"VLOOKUP(A398,Itinerário!$A$3:$I$875,5,FALSE)","v":"OUTUBRO"},{"$f":"IF(VLOOKUP(A398,Itinerário!$A$3:$I$875,6,FALSE)=0,\"\",VLOOKUP(A398,Itinerário!$A$3:$I$875,6,FALSE))","v":""},"00:00:00",{"$f":"IF(VLOOKUP(A398,Itinerário!$A$3:$I$875,7,FALSE)=0,\"\",VLOOKUP(A398,Itinerário!$A$3:$I$875,7,FALSE))","v":""},{"$f":"IF(VLOOKUP(A398,Itinerário!$A$3:$I$875,8,FALSE)=0,\"\",VLOOKUP(A398,Itinerário!$A$3:$I$875,8,FALSE))","v":""},{"$f":"IF(VLOOKUP(A398,Itinerário!$A$3:$I$875,9,FALSE)=0,\"\",VLOOKUP(A398,Itinerário!$A$3:$I$875,9,FALSE))","v":""}]
[396,{"$f":"VLOOKUP(A399,Itinerário!$A$3:$I$875,3,FALSE)","v":"FRANCISCO FRANCIEUDO FONSECA"},{"$f":"VLOOKUP(A399,Itinerário!$A$3:$I$875,5,FALSE)","v":"OUTUBRO"},{"$f":"IF(VLOOKUP(A399,Itinerário!$A$3:$I$875,6,FALSE)=0,\"\",VLOOKUP(A399,Itinerário!$A$3:$I$875,6,FALSE))","v":""},"00:00:00",{"$f":"IF(VLOOKUP(A399,Itinerário!$A$3:$I$875,7,FALSE)=0,\"\",VLOOKUP(A399,Itinerário!$A$3:$I$875,7,FALSE))","v":""},{"$f":"IF(VLOOKUP(A399,Itinerário!$A$3:$I$875,8,FALSE)=0,\"\",VLOOKUP(A399,Itinerário!$A$3:$I$875,8,FALSE))","v":""},{"$f":"IF(VLOOKUP(A399,Itinerário!$A$3:$I$875,9,FALSE)=0,\"\",VLOOKUP(A399,Itinerário!$A$3:$I$875,9,FALSE))","v":""}]
[397,{"$f":"VLOOKUP(A400,Itinerário!$A$3:$I$875,3,FALSE)","v":"FRANCISCO FRANCIEUDO FONSECA"},{"$f":"VLOOKUP(A400,Itinerário!$A$3:$I$875,5,FALSE)","v":"OUTUBRO"},{"$f":"IF(VLOOKUP(A400,Itinerário!$A$3:$I$875,6,FALSE)=0,\"\",VLOOKUP(A400,Itinerário!$A$3:$I$875,6,FALSE))","v":""},"00:00:00",{"$f":"IF(VLOOKUP(A400,Itinerário!$A$3:$I$875,7,FALSE)=0,\"\",VLOOKUP(A400,Itinerário!$A$3:$I$875,7,FALSE))","v":""},{"$f":"IF(VLOOKUP(A400,Itinerário!$A$3:$I$875,8,FALSE)=0,\"\",VLOOKUP(A400,Itinerário!$A$3:$I$875,8,FALSE))","v":""},{"$f":"IF(VLOOKUP(A400,Itinerário!$A$3:$I$875,9,FALSE)=0,\"\",VLOOKUP(A400,Itinerário!$A$3:$I$875,9,FALSE))","v":""}]
[398,{"$f":"VLOOKUP(A401,Itinerário!$A$3:$I$875,3,FALSE)","v":"FRANCISCO FRANCIEUDO FONSECA"},{"$f":"VLOOKUP(A401,Itinerário!$A$3:$I$875,5,FALSE)","v":"OUTUBRO"},{"$f":"IF(VLOOKUP(A401,Itinerário!$A$3:$I$875,6,FALSE)=0,\"\",VLOOKUP(A401,Itinerário!$A$3:$I$875,6,FALSE))","v":""},"00:00:00",{"$f":"IF(VLOOKUP(A401,Itinerário!$A$3:$I$875,7,FALSE)=0,\"\",VLOOKUP(A401,Itinerário!$A$3:$I$875,7,FALSE))","v":""},{"$f":"IF(VLOOKUP(A401,Itinerário!$A$3:$I$875,8,FALSE)=0,\"\",VLOOKUP(A401,Itinerário!$A$3:$I$875,8,FALSE))","v":""},{"$f":"IF(VLOOKUP(A401,Itinerário!$A$3:$I$875,9,FALSE)=0,\"\",VLOOKUP(A401,Itinerário!$A$3:$I$875,9,FALSE))","v":""}]
[399,{"$f":"VLOOKUP(A402,Itinerário!$A$3:$I$875,3,FALSE)","v":"FRANCISCO FRANCIEUDO FONSECA"},{"$f":"VLOOKUP(A402,Itinerário!$A$3:$I$875,5,FALSE)","v":"OUTUBRO"},{"$f":"IF(VLOOKUP(A402,Itinerário!$A$3:$I$875,6,FALSE)=0,\"\",VLOOKUP(A402,Itinerário!$A$3:$I$875,6,FALSE))","v":""},"00:00:00",{"$f":"IF(VLOOKUP(A402,Itinerário!$A$3:$I$875,7,FALSE)=0,\"\",VLOOKUP(A402,Itinerário!$A$3:$I$875,7,FALSE))","v":""},{"$f":"IF(VLOOKUP(A402,Itinerário!$A$3:$I$875,8,FALSE)=0,\"\",VLOOKUP(A402,Itinerário!$A$3:$I$875,8,FALSE))","v":""},{"$f":"IF(VLOOKUP(A402,Itinerário!$A$3:$I$875,9,FALSE)=0,\"\",VLOOKUP(A402,Itinerário!$A$3:$I$875,9,FALSE))","v":""}]
[400,{"$f":"VLOOKUP(A403,Itinerário!$A$3:$I$875,3,FALSE)","v":"FRANCISCO FRANCIEUDO FONSECA"},{"$f":"VLOOKUP(A403,Itinerário!$A$3:$I$875,5,FALSE)","v":"OUTUBRO"},{"$f":"IF(VLOOKUP(A403,Itinerário!$A$3:$I$875,6,FALSE)=0,\"\",VLOOKUP(A403,Itinerário!$A$3:$I$875,6,FALSE))","v":""},"00:00:00",{"$f":"IF(VLOOKUP(A403,Itinerário!$A$3:$I$875,7,FALSE)=0,\"\",VLOOKUP(A403,Itinerário!$A$3:$I$875,7,FALSE))","v":""},{"$f":"IF(VLOOKUP(A403,Itinerário!$A$3:$I$875,8,FALSE)=0,\"\",VLOOKUP(A403,Itinerário!$A$3:$I$875,8,FALSE))","v":""},{"$f":"IF(VLOOKUP(A403,Itinerário!$A$3:$I$875,9,FALSE)=0,\"\",VLOOKUP(A403,Itinerário!$A$3:$I$875,9,FALSE))","v":""}]
[401,{"$f":"VLOOKUP(A404,Itinerário!$A$3:$I$875,3,FALSE)","v":"FRANCISCO FRANCIEUDO FONSECA"},{"$f":"VLOOKUP(A404,Itinerário!$A$3:$I$875,5,FALSE)","v":"NOVEMBRO"},{"$f":"IF(VLOOKUP(A404,Itinerário!$A$3:$I$875,6,FALSE)=0,\"\",VLOOKUP(A404,Itinerário!$A$3:$I$875,6,FALSE))","v":3},"2018-11-03",{"$f":"IF(VLOOKUP(A404,Itinerário!$A$3:$I$875,7,FALSE)=0,\"\",VLOOKUP(A404,Itinerário!$A$3:$I$875,7,FALSE))","v":"Aliança de Fé"},{"$f":"IF(VLOOKUP(A404,Itinerário!$A$3:$I$875,8,FALSE)=0,\"\",VLOOKUP(A404,Itinerário!$A$3:$I$875,8,FALSE))","v":"Jardim Eldorado"},{"$f":"IF(VLOOKUP(A404,Itinerário!$A$3:$I$875,9,FALSE)=0,\"\",VLOOKUP(A404,Itinerário!$A$3:$I$875,9,FALSE))","v":"Jardim Eldorado"}]
[402,{"$f":"VLOOKUP(A405,Itinerário!$A$3:$I$875,3,FALSE)","v":"FRANCISCO FRANCIEUDO FONSECA"},{"$f":"VLOOKUP(A405,Itinerário!$A$3:$I$875,5,FALSE)","v":"NOVEMBRO"},{"$f":"IF(VLOOKUP(A405,Itinerário!$A$3:$I$875,6,FALSE)=0,\"\",VLOOKUP(A405,Itinerário!$A$3:$I$875,6,FALSE))","v":10},"2018-11-10",{"$f":"IF(VLOOKUP(A405,Itinerário!$A$3:$I$875,7,FALSE)=0,\"\",VLOOKUP(A405,Itinerário!$A$3:$I$875,7,FALSE))","v":"Aliança de Fé"},{"$f":"IF(VLOOKUP(A405,Itinerário!$A$3:$I$875,8,FALSE)=0,\"\",VLOOKUP(A405,Itinerário!$A$3:$I$875,8,FALSE))","v":"Limoeiro"},{"$f":"IF(VLOOKUP(A405,Itinerário!$A$3:$I$875,9,FALSE)=0,\"\",VLOOKUP(A405,Itinerário!$A$3:$I$875,9,FALSE))","v":"Limoeiro"}]
[403,{"$f":"VLOOKUP(A406,Itinerário!$A$3:$I$875,3,FALSE)","v":"FRANCISCO FRANCIEUDO FONSECA"},{"$f":"VLOOKUP(A406,Itinerário!$A$3:$I$875,5,FALSE)","v":"NOVEMBRO"},{"$f":"IF(VLOOKUP(A406,Itinerário!$A$3:$I$875,6,FALSE)=0,\"\",VLOOKUP(A406,Itinerário!$A$3:$I$875,6,FALSE))","v":17},"2018-11-17",{"$f":"IF(VLOOKUP(A406,Itinerário!$A$3:$I$875,7,FALSE)=0,\"\",VLOOKUP(A406,Itinerário!$A$3:$I$875,7,FALSE))","v":"Aliança de Fé"},{"$f":"IF(VLOOKUP(A406,Itinerário!$A$3:$I$875,8,FALSE)=0,\"\",VLOOKUP(A406,Itinerário!$A$3:$I$875,8,FALSE))","v":"Próspera"},{"$f":"IF(VLOOKUP(A406,Itinerário!$A$3:$I$875,9,FALSE)=0,\"\",VLOOKUP(A406,Itinerário!$A$3:$I$875,9,FALSE))","v":"Próspera"}]
[404,{"$f":"VLOOKUP(A407,Itinerário!$A$3:$I$875,3,FALSE)","v":"FRANCISCO FRANCIEUDO FONSECA"},{"$f":"VLOOKUP(A407,Itinerário!$A$3:$I$875,5,FALSE)","v":"NOVEMBRO"},{"$f":"IF(VLOOKUP(A407,Itinerário!$A$3:$I$875,6,FALSE)=0,\"\",VLOOKUP(A407,Itinerário!$A$3:$I$875,6,FALSE))","v":24},"2018-11-24",{"$f":"IF(VLOOKUP(A407,Itinerário!$A$3:$I$875,7,FALSE)=0,\"\",VLOOKUP(A407,Itinerário!$A$3:$I$875,7,FALSE))","v":"Aliança de Fé"},{"$f":"IF(VLOOKUP(A407,Itinerário!$A$3:$I$875,8,FALSE)=0,\"\",VLOOKUP(A407,Itinerário!$A$3:$I$875,8,FALSE))","v":"Jardim Atlântico"},{"$f":"IF(VLOOKUP(A407,Itinerário!$A$3:$I$875,9,FALSE)=0,\"\",VLOOKUP(A407,Itinerário!$A$3:$I$875,9,FALSE))","v":"Jardim Atlântico"}]
[405,{"$f":"VLOOKUP(A408,Itinerário!$A$3:$I$875,3,FALSE)","v":"FRANCISCO FRANCIEUDO FONSECA"},{"$f":"VLOOKUP(A408,Itinerário!$A$3:$I$875,5,FALSE)","v":"NOVEMBRO"},{"$f":"IF(VLOOKUP(A408,Itinerário!$A$3:$I$875,6,FALSE)=0,\"\",VLOOKUP(A408,Itinerário!$A$3:$I$875,6,FALSE))","v":""},"00:00:00",{"$f":"IF(VLOOKUP(A408,Itinerário!$A$3:$I$875,7,FALSE)=0,\"\",VLOOKUP(A408,Itinerário!$A$3:$I$875,7,FALSE))","v":""},{"$f":"IF(VLOOKUP(A408,Itinerário!$A$3:$I$875,8,FALSE)=0,\"\",VLOOKUP(A408,Itinerário!$A$3:$I$875,8,FALSE))","v":""},{"$f":"IF(VLOOKUP(A408,Itinerário!$A$3:$I$875,9,FALSE)=0,\"\",VLOOKUP(A408,Itinerário!$A$3:$I$875,9,FALSE))","v":""}]
[406,{"$f":"VLOOKUP(A409,Itinerário!$A$3:$I$875,3,FALSE)","v":"FRANCISCO FRANCIEUDO FONSECA"},{"$f":"VLOOKUP(A409,Itinerário!$A$3:$I$875,5,FALSE)","v":"NOVEMBRO"},{"$f":"IF(VLOOKUP(A409,Itinerário!$A$3:$I$875,6,FALSE)=0,\"\",VLOOKUP(A409,Itinerário!$A$3:$I$875,6,FALSE))","v":""},"00:00:00",{"$f":"IF(VLOOKUP(A409,Itinerário!$A$3:$I$875,7,FALSE)=0,\"\",VLOOKUP(A409,Itinerário!$A$3:$I$875,7,FALSE))","v":""},{"$f":"IF(VLOOKUP(A409,Itinerário!$A$3:$I$875,8,FALSE)=0,\"\",VLOOKUP(A409,Itinerário!$A$3:$I$875,8,FALSE))","v":""},{"$f":"IF(VLOOKUP(A409,Itinerário!$A$3:$I$875,9,FALSE)=0,\"\",VLOOKUP(A409,Itinerário!$A$3:$I$875,9,FALSE))","v":""}]
[407,{"$f":"VLOOKUP(A410,Itinerário!$A$3:$I$875,3,FALSE)","v":"FRANCISCO FRANCIEUDO FONSECA"},{"$f":"VLOOKUP(A410,Itinerário!$A$3:$I$875,5,FALSE)","v":"NOVEMBRO"},{"$f":"IF(VLOOKUP(A410,Itinerário!$A$3:$I$875,6,FALSE)=0,\"\",VLOOKUP(A410,Itinerário!$A$3:$I$875,6,FALSE))","v":""},"00:00:00",{"$f":"IF(VLOOKUP(A410,Itinerário!$A$3:$I$875,7,FALSE)=0,\"\",VLOOKUP(A410,Itinerário!$A$3:$I$875,7,FALSE))","v":""},{"$f":"IF(VLOOKUP(A410,Itinerário!$A$3:$I$875,8,FALSE)=0,\"\",VLOOKUP(A410,Itinerário!$A$3:$I$875,8,FALSE))","v":""},{"$f":"IF(VLOOKUP(A410,Itinerário!$A$3:$I$875,9,FALSE)=0,\"\",VLOOKUP(A410,Itinerário!$A$3:$I$875,9,FALSE))","v":""}]
[408,{"$f":"VLOOKUP(A411,Itinerário!$A$3:$I$875,3,FALSE)","v":"FRANCISCO FRANCIEUDO FONSECA"},{"$f":"VLOOKUP(A411,Itinerário!$A$3:$I$875,5,FALSE)","v":"NOVEMBRO"},{"$f":"IF(VLOOKUP(A411,Itinerário!$A$3:$I$875,6,FALSE)=0,\"\",VLOOKUP(A411,Itinerário!$A$3:$I$875,6,FALSE))","v":""},"00:00:00",{"$f":"IF(VLOOKUP(A411,Itinerário!$A$3:$I$875,7,FALSE)=0,\"\",VLOOKUP(A411,Itinerário!$A$3:$I$875,7,FALSE))","v":""},{"$f":"IF(VLOOKUP(A411,Itinerário!$A$3:$I$875,8,FALSE)=0,\"\",VLOOKUP(A411,Itinerário!$A$3:$I$875,8,FALSE))","v":""},{"$f":"IF(VLOOKUP(A411,Itinerário!$A$3:$I$875,9,FALSE)=0,\"\",VLOOKUP(A411,Itinerário!$A$3:$I$875,9,FALSE))","v":""}]
[409,{"$f":"VLOOKUP(A412,Itinerário!$A$3:$I$875,3,FALSE)","v":"FRANCISCO FRANCIEUDO FONSECA"},{"$f":"VLOOKUP(A412,Itinerário!$A$3:$I$875,5,FALSE)","v":"NOVEMBRO"},{"$f":"IF(VLOOKUP(A412,Itinerário!$A$3:$I$875,6,FALSE)=0,\"\",VLOOKUP(A412,Itinerário!$A$3:$I$875,6,FALSE))","v":""},"00:00:00",{"$f":"IF(VLOOKUP(A412,Itinerário!$A$3:$I$875,7,FALSE)=0,\"\",VLOOKUP(A412,Itinerário!$A$3:$I$875,7,FALSE))","v":""},{"$f":"IF(VLOOKUP(A412,Itinerário!$A$3:$I$875,8,FALSE)=0,\"\",VLOOKUP(A412,Itinerário!$A$3:$I$875,8,FALSE))","v":""},{"$f":"IF(VLOOKUP(A412,Itinerário!$A$3:$I$875,9,FALSE)=0,\"\",VLOOKUP(A412,Itinerário!$A$3:$I$875,9,FALSE))","v":""}]
[410,{"$f":"VLOOKUP(A413,Itinerário!$A$3:$I$875,3,FALSE)","v":"FRANCISCO FRANCIEUDO FONSECA"},{"$f":"VLOOKUP(A413,Itinerário!$A$3:$I$875,5,FALSE)","v":"NOVEMBRO"},{"$f":"IF(VLOOKUP(A413,Itinerário!$A$3:$I$875,6,FALSE)=0,\"\",VLOOKUP(A413,Itinerário!$A$3:$I$875,6,FALSE))","v":""},"00:00:00",{"$f":"IF(VLOOKUP(A413,Itinerário!$A$3:$I$875,7,FALSE)=0,\"\",VLOOKUP(A413,Itinerário!$A$3:$I$875,7,FALSE))","v":""},{"$f":"IF(VLOOKUP(A413,Itinerário!$A$3:$I$875,8,FALSE)=0,\"\",VLOOKUP(A413,Itinerário!$A$3:$I$875,8,FALSE))","v":""},{"$f":"IF(VLOOKUP(A413,Itinerário!$A$3:$I$875,9,FALSE)=0,\"\",VLOOKUP(A413,Itinerário!$A$3:$I$875,9,FALSE))","v":""}]
[411,{"$f":"VLOOKUP(A414,Itinerário!$A$3:$I$875,3,FALSE)","v":"FRANCISCO FRANCIEUDO FONSECA"},{"$f":"VLOOKUP(A414,Itinerário!$A$3:$I$875,5,FALSE)","v":"DEZEMBRO"},{"$f":"IF(VLOOKUP(A414,Itinerário!$A$3:$I$875,6,FALSE)=0,\"\",VLOOKUP(A414,Itinerário!$A$3:$I$875,6,FALSE))","v":1},"2018-12-01",{"$f":"IF(VLOOKUP(A414,Itinerário!$A$3:$I$875,7,FALSE)=0,\"\",VLOOKUP(A414,Itinerário!$A$3:$I$875,7,FALSE))","v":"Aliança de Fé"},{"$f":"IF(VLOOKUP(A414,Itinerário!$A$3:$I$875,8,FALSE)=0,\"\",VLOOKUP(A414,Itinerário!$A$3:$I$875,8,FALSE))","v":"Caminho Novo"},{"$f":"IF(VLOOKUP(A414,Itinerário!$A$3:$I$875,9,FALSE)=0,\"\",VLOOKUP(A414,Itinerário!$A$3:$I$875,9,FALSE))","v":"Caminho Novo"}]
[412,{"$f":"VLOOKUP(A415,Itinerário!$A$3:$I$875,3,FALSE)","v":"FRANCISCO FRANCIEUDO FONSECA"},{"$f":"VLOOKUP(A415,Itinerário!$A$3:$I$875,5,FALSE)","v":"DEZEMBRO"},{"$f":"IF(VLOOKUP(A415,Itinerário!$A$3:$I$875,6,FALSE)=0,\"\",VLOOKUP(A415,Itinerário!$A$3:$I$875,6,FALSE))","v":8},"2018-12-08",{"$f":"IF(VLOOKUP(A415,Itinerário!$A$3:$I$875,7,FALSE)=0,\"\",VLOOKUP(A415,Itinerário!$A$3:$I$875,7,FALSE))","v":"Aliança de Fé"},{"$f":"IF(VLOOKUP(A415,Itinerário!$A$3:$I$875,8,FALSE)=0,\"\",VLOOKUP(A415,Itinerário!$A$3:$I$875,8,FALSE))","v":"Garopaba"},{"$f":"IF(VLOOKUP(A415,Itinerário!$A$3:$I$875,9,FALSE)=0,\"\",VLOOKUP(A415,Itinerário!$A$3:$I$875,9,FALSE))","v":"Garopaba"}]
[413,{"$f":"VLOOKUP(A416,Itinerário!$A$3:$I$875,3,FALSE)","v":"FRANCISCO FRANCIEUDO FONSECA"},{"$f":"VLOOKUP(A416,Itinerário!$A$3:$I$875,5,FALSE)","v":"DEZEMBRO"},{"$f":"IF(VLOOKUP(A416,Itinerário!$A$3:$I$875,6,FALSE)=0,\"\",VLOOKUP(A416,Itinerário!$A$3:$I$875,6,FALSE))","v":15},"2018-12-15",{"$f":"IF(VLOOKUP(A416,Itinerário!$A$3:$I$875,7,FALSE)=0,\"\",VLOOKUP(A416,Itinerário!$A$3:$I$875,7,FALSE))","v":"Ajuste"},{"$f":"IF(VLOOKUP(A416,Itinerário!$A$3:$I$875,8,FALSE)=0,\"\",VLOOKUP(A416,Itinerário!$A$3:$I$875,8,FALSE))","v":""},{"$f":"IF(VLOOKUP(A416,Itinerário!$A$3:$I$875,9,FALSE)=0,\"\",VLOOKUP(A416,Itinerário!$A$3:$I$875,9,FALSE))","v":""}]
[414,{"$f":"VLOOKUP(A417,Itinerário!$A$3:$I$875,3,FALSE)","v":"FRANCISCO FRANCIEUDO FONSECA"},{"$f":"VLOOKUP(A417,Itinerário!$A$3:$I$875,5,FALSE)","v":"DEZEMBRO"},{"$f":"IF(VLOOKUP(A417,Itinerário!$A$3:$I$875,6,FALSE)=0,\"\",VLOOKUP(A417,Itinerário!$A$3:$I$875,6,FALSE))","v":""},"00:00:00",{"$f":"IF(VLOOKUP(A417,Itinerário!$A$3:$I$875,7,FALSE)=0,\"\",VLOOKUP(A417,Itinerário!$A$3:$I$875,7,FALSE))","v":""},{"$f":"IF(VLOOKUP(A417,Itinerário!$A$3:$I$875,8,FALSE)=0,\"\",VLOOKUP(A417,Itinerário!$A$3:$I$875,8,FALSE))","v":""},{"$f":"IF(VLOOKUP(A417,Itinerário!$A$3:$I$875,9,FALSE)=0,\"\",VLOOKUP(A417,Itinerário!$A$3:$I$875,9,FALSE))","v":""}]
[415,{"$f":"VLOOKUP(A418,Itinerário!$A$3:$I$875,3,FALSE)","v":"FRANCISCO FRANCIEUDO FONSECA"},{"$f":"VLOOKUP(A418,Itinerário!$A$3:$I$875,5,FALSE)","v":"DEZEMBRO"},{"$f":"IF(VLOOKUP(A418,Itinerário!$A$3:$I$875,6,FALSE)=0,\"\",VLOOKUP(A418,Itinerário!$A$3:$I$875,6,FALSE))","v":""},"00:00:00",{"$f":"IF(VLOOKUP(A418,Itinerário!$A$3:$I$875,7,FALSE)=0,\"\",VLOOKUP(A418,Itinerário!$A$3:$I$875,7,FALSE))","v":""},{"$f":"IF(VLOOKUP(A418,Itinerário!$A$3:$I$875,8,FALSE)=0,\"\",VLOOKUP(A418,Itinerário!$A$3:$I$875,8,FALSE))","v":""},{"$f":"IF(VLOOKUP(A418,Itinerário!$A$3:$I$875,9,FALSE)=0,\"\",VLOOKUP(A418,Itinerário!$A$3:$I$875,9,FALSE))","v":""}]
[416,{"$f":"VLOOKUP(A419,Itinerário!$A$3:$I$875,3,FALSE)","v":"FRANCISCO FRANCIEUDO FONSECA"},{"$f":"VLOOKUP(A419,Itinerário!$A$3:$I$875,5,FALSE)","v":"DEZEMBRO"},{"$f":"IF(VLOOKUP(A419,Itinerário!$A$3:$I$875,6,FALSE)=0,\"\",VLOOKUP(A419,Itinerário!$A$3:$I$875,6,FALSE))","v":""},"00:00:00",{"$f":"IF(VLOOKUP(A419,Itinerário!$A$3:$I$875,7,FALSE)=0,\"\",VLOOKUP(A419,Itinerário!$A$3:$I$875,7,FALSE))","v":""},{"$f":"IF(VLOOKUP(A419,Itinerário!$A$3:$I$875,8,FALSE)=0,\"\",VLOOKUP(A419,Itinerário!$A$3:$I$875,8,FALSE))","v":""},{"$f":"IF(VLOOKUP(A419,Itinerário!$A$3:$I$875,9,FALSE)=0,\"\",VLOOKUP(A419,Itinerário!$A$3:$I$875,9,FALSE))","v":""}]
[417,{"$f":"VLOOKUP(A420,Itinerário!$A$3:$I$875,3,FALSE)","v":"FRANCISCO FRANCIEUDO FONSECA"},{"$f":"VLOOKUP(A420,Itinerário!$A$3:$I$875,5,FALSE)","v":"DEZEMBRO"},{"$f":"IF(VLOOKUP(A420,Itinerário!$A$3:$I$875,6,FALSE)=0,\"\",VLOOKUP(A420,Itinerário!$A$3:$I$875,6,FALSE))","v":""},"00:00:00",{"$f":"IF(VLOOKUP(A420,Itinerário!$A$3:$I$875,7,FALSE)=0,\"\",VLOOKUP(A420,Itinerário!$A$3:$I$875,7,FALSE))","v":""},{"$f":"IF(VLOOKUP(A420,Itinerário!$A$3:$I$875,8,FALSE)=0,\"\",VLOOKUP(A420,Itinerário!$A$3:$I$875,8,FALSE))","v":""},{"$f":"IF(VLOOKUP(A420,Itinerário!$A$3:$I$875,9,FALSE)=0,\"\",VLOOKUP(A420,Itinerário!$A$3:$I$875,9,FALSE))","v":""}]
[418,{"$f":"VLOOKUP(A421,Itinerário!$A$3:$I$875,3,FALSE)","v":"FRANCISCO FRANCIEUDO FONSECA"},{"$f":"VLOOKUP(A421,Itinerário!$A$3:$I$875,5,FALSE)","v":"DEZEMBRO"},{"$f":"IF(VLOOKUP(A421,Itinerário!$A$3:$I$875,6,FALSE)=0,\"\",VLOOKUP(A421,Itinerário!$A$3:$I$875,6,FALSE))","v":""},"00:00:00",{"$f":"IF(VLOOKUP(A421,Itinerário!$A$3:$I$875,7,FALSE)=0,\"\",VLOOKUP(A421,Itinerário!$A$3:$I$875,7,FALSE))","v":""},{"$f":"IF(VLOOKUP(A421,Itinerário!$A$3:$I$875,8,FALSE)=0,\"\",VLOOKUP(A421,Itinerário!$A$3:$I$875,8,FALSE))","v":""},{"$f":"IF(VLOOKUP(A421,Itinerário!$A$3:$I$875,9,FALSE)=0,\"\",VLOOKUP(A421,Itinerário!$A$3:$I$875,9,FALSE))","v":""}]
[419,{"$f":"VLOOKUP(A422,Itinerário!$A$3:$I$875,3,FALSE)","v":"FRANCISCO FRANCIEUDO FONSECA"},{"$f":"VLOOKUP(A422,Itinerário!$A$3:$I$875,5,FALSE)","v":"DEZEMBRO"},{"$f":"IF(VLOOKUP(A422,Itinerário!$A$3:$I$875,6,FALSE)=0,\"\",VLOOKUP(A422,Itinerário!$A$3:$I$875,6,FALSE))","v":""},"00:00:00",{"$f":"IF(VLOOKUP(A422,Itinerário!$A$3:$I$875,7,FALSE)=0,\"\",VLOOKUP(A422,Itinerário!$A$3:$I$875,7,FALSE))","v":""},{"$f":"IF(VLOOKUP(A422,Itinerário!$A$3:$I$875,8,FALSE)=0,\"\",VLOOKUP(A422,Itinerário!$A$3:$I$875,8,FALSE))","v":""},{"$f":"IF(VLOOKUP(A422,Itinerário!$A$3:$I$875,9,FALSE)=0,\"\",VLOOKUP(A422,Itinerário!$A$3:$I$875,9,FALSE))","v":""}]
[420,{"$f":"VLOOKUP(A423,Itinerário!$A$3:$I$875,3,FALSE)","v":"FRANCISCO FRANCIEUDO FONSECA"},{"$f":"VLOOKUP(A423,Itinerário!$A$3:$I$875,5,FALSE)","v":"DEZEMBRO"},{"$f":"IF(VLOOKUP(A423,Itinerário!$A$3:$I$875,6,FALSE)=0,\"\",VLOOKUP(A423,Itinerário!$A$3:$I$875,6,FALSE))","v":""},"00:00:00",{"$f":"IF(VLOOKUP(A423,Itinerário!$A$3:$I$875,7,FALSE)=0,\"\",VLOOKUP(A423,Itinerário!$A$3:$I$875,7,FALSE))","v":""},{"$f":"IF(VLOOKUP(A423,Itinerário!$A$3:$I$875,8,FALSE)=0,\"\",VLOOKUP(A423,Itinerário!$A$3:$I$875,8,FALSE))","v":""},{"$f":"IF(VLOOKUP(A423,Itinerário!$A$3:$I$875,9,FALSE)=0,\"\",VLOOKUP(A423,Itinerário!$A$3:$I$875,9,FALSE))","v":""}]
[421,{"$f":"VLOOKUP(A424,Itinerário!$A$3:$I$875,3,FALSE)","v":"JEFERSON FORTES LORENZI"},{"$f":"VLOOKUP(A424,Itinerário!$A$3:$I$875,5,FALSE)","v":"JULHO"},{"$f":"IF(VLOOKUP(A424,Itinerário!$A$3:$I$875,6,FALSE)=0,\"\",VLOOKUP(A424,Itinerário!$A$3:$I$875,6,FALSE))","v":"7 e 8"},"00:00:00",{"$f":"IF(VLOOKUP(A424,Itinerário!$A$3:$I$875,7,FALSE)=0,\"\",VLOOKUP(A424,Itinerário!$A$3:$I$875,7,FALSE))","v":"Escola de Evangelistas Voluntários"},{"$f":"IF(VLOOKUP(A424,Itinerário!$A$3:$I$875,8,FALSE)=0,\"\",VLOOKUP(A424,Itinerário!$A$3:$I$875,8,FALSE))","v":"CATRE"},{"$f":"IF(VLOOKUP(A424,Itinerário!$A$3:$I$875,9,FALSE)=0,\"\",VLOOKUP(A424,Itinerário!$A$3:$I$875,9,FALSE))","v":"CATRE"}]
[422,{"$f":"VLOOKUP(A425,Itinerário!$A$3:$I$875,3,FALSE)","v":"JEFERSON FORTES LORENZI"},{"$f":"VLOOKUP(A425,Itinerário!$A$3:$I$875,5,FALSE)","v":"JULHO"},{"$f":"IF(VLOOKUP(A425,Itinerário!$A$3:$I$875,6,FALSE)=0,\"\",VLOOKUP(A425,Itinerário!$A$3:$I$875,6,FALSE))","v":14},"2018-07-14",{"$f":"IF(VLOOKUP(A425,Itinerário!$A$3:$I$875,7,FALSE)=0,\"\",VLOOKUP(A425,Itinerário!$A$3:$I$875,7,FALSE))","v":"Semana de Colheita"},{"$f":"IF(VLOOKUP(A425,Itinerário!$A$3:$I$875,8,FALSE)=0,\"\",VLOOKUP(A425,Itinerário!$A$3:$I$875,8,FALSE))","v":"Parque Lisboa"},{"$f":"IF(VLOOKUP(A425,Itinerário!$A$3:$I$875,9,FALSE)=0,\"\",VLOOKUP(A425,Itinerário!$A$3:$I$875,9,FALSE))","v":"Parque Lisboa"}]
[423,{"$f":"VLOOKUP(A426,Itinerário!$A$3:$I$875,3,FALSE)","v":"JEFERSON FORTES LORENZI"},{"$f":"VLOOKUP(A426,Itinerário!$A$3:$I$875,5,FALSE)","v":"JULHO"},{"$f":"IF(VLOOKUP(A426,Itinerário!$A$3:$I$875,6,FALSE)=0,\"\",VLOOKUP(A426,Itinerário!$A$3:$I$875,6,FALSE))","v":21},"2018-07-21",{"$f":"IF(VLOOKUP(A426,Itinerário!$A$3:$I$875,7,FALSE)=0,\"\",VLOOKUP(A426,Itinerário!$A$3:$I$875,7,FALSE))","v":"Preparação Semana de Colheita"},{"$f":"IF(VLOOKUP(A426,Itinerário!$A$3:$I$875,8,FALSE)=0,\"\",VLOOKUP(A426,Itinerário!$A$3:$I$875,8,FALSE))","v":"Barreiros"},{"$f":"IF(VLOOKUP(A426,Itinerário!$A$3:$I$875,9,FALSE)=0,\"\",VLOOKUP(A426,Itinerário!$A$3:$I$875,9,FALSE))","v":"Barreiros"}]
[424,{"$f":"VLOOKUP(A427,Itinerário!$A$3:$I$875,3,FALSE)","v":"JEFERSON FORTES LORENZI"},{"$f":"VLOOKUP(A427,Itinerário!$A$3:$I$875,5,FALSE)","v":"JULHO"},{"$f":"IF(VLOOKUP(A427,Itinerário!$A$3:$I$875,6,FALSE)=0,\"\",VLOOKUP(A427,Itinerário!$A$3:$I$875,6,FALSE))","v":28},"2018-07-28",{"$f":"IF(VLOOKUP(A427,Itinerário!$A$3:$I$875,7,FALSE)=0,\"\",VLOOKUP(A427,Itinerário!$A$3:$I$875,7,FALSE))","v":"Congresso Missionário"},{"$f":"IF(VLOOKUP(A427,Itinerário!$A$3:$I$875,8,FALSE)=0,\"\",VLOOKUP(A427,Itinerário!$A$3:$I$875,8,FALSE))","v":"Palhoça"},{"$f":"IF(VLOOKUP(A427,Itinerário!$A$3:$I$875,9,FALSE)=0,\"\",VLOOKUP(A427,Itinerário!$A$3:$I$875,9,FALSE))","v":"Palhoça"}]
[425,{"$f":"VLOOKUP(A428,Itinerário!$A$3:$I$875,3,FALSE)","v":"JEFERSON FORTES LORENZI"},{"$f":"VLOOKUP(A428,Itinerário!$A$3:$I$875,5,FALSE)","v":"JULHO"},{"$f":"IF(VLOOKUP(A428,Itinerário!$A$3:$I$875,6,FALSE)=0,\"\",VLOOKUP(A428,Itinerário!$A$3:$I$875,6,FALSE))","v":""},"00:00:00",{"$f":"IF(VLOOKUP(A428,Itinerário!$A$3:$I$875,7,FALSE)=0,\"\",VLOOKUP(A428,Itinerário!$A$3:$I$875,7,FALSE))","v":""},{"$f":"IF(VLOOKUP(A428,Itinerário!$A$3:$I$875,8,FALSE)=0,\"\",VLOOKUP(A428,Itinerário!$A$3:$I$875,8,FALSE))","v":""},{"$f":"IF(VLOOKUP(A428,Itinerário!$A$3:$I$875,9,FALSE)=0,\"\",VLOOKUP(A428,Itinerário!$A$3:$I$875,9,FALSE))","v":""}]
[426,{"$f":"VLOOKUP(A429,Itinerário!$A$3:$I$875,3,FALSE)","v":"JEFERSON FORTES LORENZI"},{"$f":"VLOOKUP(A429,Itinerário!$A$3:$I$875,5,FALSE)","v":"JULHO"},{"$f":"IF(VLOOKUP(A429,Itinerário!$A$3:$I$875,6,FALSE)=0,\"\",VLOOKUP(A429,Itinerário!$A$3:$I$875,6,FALSE))","v":""},"00:00:00",{"$f":"IF(VLOOKUP(A429,Itinerário!$A$3:$I$875,7,FALSE)=0,\"\",VLOOKUP(A429,Itinerário!$A$3:$I$875,7,FALSE))","v":""},{"$f":"IF(VLOOKUP(A429,Itinerário!$A$3:$I$875,8,FALSE)=0,\"\",VLOOKUP(A429,Itinerário!$A$3:$I$875,8,FALSE))","v":""},{"$f":"IF(VLOOKUP(A429,Itinerário!$A$3:$I$875,9,FALSE)=0,\"\",VLOOKUP(A429,Itinerário!$A$3:$I$875,9,FALSE))","v":""}]
[427,{"$f":"VLOOKUP(A430,Itinerário!$A$3:$I$875,3,FALSE)","v":"JEFERSON FORTES LORENZI"},{"$f":"VLOOKUP(A430,Itinerário!$A$3:$I$875,5,FALSE)","v":"JULHO"},{"$f":"IF(VLOOKUP(A430,Itinerário!$A$3:$I$875,6,FALSE)=0,\"\",VLOOKUP(A430,Itinerário!$A$3:$I$875,6,FALSE))","v":""},"00:00:00",{"$f":"IF(VLOOKUP(A430,Itinerário!$A$3:$I$875,7,FALSE)=0,\"\",VLOOKUP(A430,Itinerário!$A$3:$I$875,7,FALSE))","v":""},{"$f":"IF(VLOOKUP(A430,Itinerário!$A$3:$I$875,8,FALSE)=0,\"\",VLOOKUP(A430,Itinerário!$A$3:$I$875,8,FALSE))","v":""},{"$f":"IF(VLOOKUP(A430,Itinerário!$A$3:$I$875,9,FALSE)=0,\"\",VLOOKUP(A430,Itinerário!$A$3:$I$875,9,FALSE))","v":""}]
[428,{"$f":"VLOOKUP(A431,Itinerário!$A$3:$I$875,3,FALSE)","v":"JEFERSON FORTES LORENZI"},{"$f":"VLOOKUP(A431,Itinerário!$A$3:$I$875,5,FALSE)","v":"JULHO"},{"$f":"IF(VLOOKUP(A431,Itinerário!$A$3:$I$875,6,FALSE)=0,\"\",VLOOKUP(A431,Itinerário!$A$3:$I$875,6,FALSE))","v":""},"00:00:00",{"$f":"IF(VLOOKUP(A431,Itinerário!$A$3:$I$875,7,FALSE)=0,\"\",VLOOKUP(A431,Itinerário!$A$3:$I$875,7,FALSE))","v":""},{"$f":"IF(VLOOKUP(A431,Itinerário!$A$3:$I$875,8,FALSE)=0,\"\",VLOOKUP(A431,Itinerário!$A$3:$I$875,8,FALSE))","v":""},{"$f":"IF(VLOOKUP(A431,Itinerário!$A$3:$I$875,9,FALSE)=0,\"\",VLOOKUP(A431,Itinerário!$A$3:$I$875,9,FALSE))","v":""}]
[429,{"$f":"VLOOKUP(A432,Itinerário!$A$3:$I$875,3,FALSE)","v":"JEFERSON FORTES LORENZI"},{"$f":"VLOOKUP(A432,Itinerário!$A$3:$I$875,5,FALSE)","v":"JULHO"},{"$f":"IF(VLOOKUP(A432,Itinerário!$A$3:$I$875,6,FALSE)=0,\"\",VLOOKUP(A432,Itinerário!$A$3:$I$875,6,FALSE))","v":""},"00:00:00",{"$f":"IF(VLOOKUP(A432,Itinerário!$A$3:$I$875,7,FALSE)=0,\"\",VLOOKUP(A432,Itinerário!$A$3:$I$875,7,FALSE))","v":""},{"$f":"IF(VLOOKUP(A432,Itinerário!$A$3:$I$875,8,FALSE)=0,\"\",VLOOKUP(A432,Itinerário!$A$3:$I$875,8,FALSE))","v":""},{"$f":"IF(VLOOKUP(A432,Itinerário!$A$3:$I$875,9,FALSE)=0,\"\",VLOOKUP(A432,Itinerário!$A$3:$I$875,9,FALSE))","v":""}]
[430,{"$f":"VLOOKUP(A433,Itinerário!$A$3:$I$875,3,FALSE)","v":"JEFERSON FORTES LORENZI"},{"$f":"VLOOKUP(A433,Itinerário!$A$3:$I$875,5,FALSE)","v":"JULHO"},{"$f":"IF(VLOOKUP(A433,Itinerário!$A$3:$I$875,6,FALSE)=0,\"\",VLOOKUP(A433,Itinerário!$A$3:$I$875,6,FALSE))","v":""},"00:00:00",{"$f":"IF(VLOOKUP(A433,Itinerário!$A$3:$I$875,7,FALSE)=0,\"\",VLOOKUP(A433,Itinerário!$A$3:$I$875,7,FALSE))","v":""},{"$f":"IF(VLOOKUP(A433,Itinerário!$A$3:$I$875,8,FALSE)=0,\"\",VLOOKUP(A433,Itinerário!$A$3:$I$875,8,FALSE))","v":""},{"$f":"IF(VLOOKUP(A433,Itinerário!$A$3:$I$875,9,FALSE)=0,\"\",VLOOKUP(A433,Itinerário!$A$3:$I$875,9,FALSE))","v":""}]
[431,{"$f":"VLOOKUP(A434,Itinerário!$A$3:$I$875,3,FALSE)","v":"JEFERSON FORTES LORENZI"},{"$f":"VLOOKUP(A434,Itinerário!$A$3:$I$875,5,FALSE)","v":"AGOSTO"},{"$f":"IF(VLOOKUP(A434,Itinerário!$A$3:$I$875,6,FALSE)=0,\"\",VLOOKUP(A434,Itinerário!$A$3:$I$875,6,FALSE))","v":4},"2018-08-04",{"$f":"IF(VLOOKUP(A434,Itinerário!$A$3:$I$875,7,FALSE)=0,\"\",VLOOKUP(A434,Itinerário!$A$3:$I$875,7,FALSE))","v":"Lançamento Colheita"},{"$f":"IF(VLOOKUP(A434,Itinerário!$A$3:$I$875,8,FALSE)=0,\"\",VLOOKUP(A434,Itinerário!$A$3:$I$875,8,FALSE))","v":"Camboriú"},{"$f":"IF(VLOOKUP(A434,Itinerário!$A$3:$I$875,9,FALSE)=0,\"\",VLOOKUP(A434,Itinerário!$A$3:$I$875,9,FALSE))","v":"Camboriú"}]
[432,{"$f":"VLOOKUP(A435,Itinerário!$A$3:$I$875,3,FALSE)","v":"JEFERSON FORTES LORENZI"},{"$f":"VLOOKUP(A435,Itinerário!$A$3:$I$875,5,FALSE)","v":"AGOSTO"},{"$f":"IF(VLOOKUP(A435,Itinerário!$A$3:$I$875,6,FALSE)=0,\"\",VLOOKUP(A435,Itinerário!$A$3:$I$875,6,FALSE))","v":11},"2018-08-11",{"$f":"IF(VLOOKUP(A435,Itinerário!$A$3:$I$875,7,FALSE)=0,\"\",VLOOKUP(A435,Itinerário!$A$3:$I$875,7,FALSE))","v":"Semana de Colheita"},{"$f":"IF(VLOOKUP(A435,Itinerário!$A$3:$I$875,8,FALSE)=0,\"\",VLOOKUP(A435,Itinerário!$A$3:$I$875,8,FALSE))","v":"Barreiros"},{"$f":"IF(VLOOKUP(A435,Itinerário!$A$3:$I$875,9,FALSE)=0,\"\",VLOOKUP(A435,Itinerário!$A$3:$I$875,9,FALSE))","v":"Barreiros"}]
[433,{"$f":"VLOOKUP(A436,Itinerário!$A$3:$I$875,3,FALSE)","v":"JEFERSON FORTES LORENZI"},{"$f":"VLOOKUP(A436,Itinerário!$A$3:$I$875,5,FALSE)","v":"AGOSTO"},{"$f":"IF(VLOOKUP(A436,Itinerário!$A$3:$I$875,6,FALSE)=0,\"\",VLOOKUP(A436,Itinerário!$A$3:$I$875,6,FALSE))","v":18},"2018-08-18",{"$f":"IF(VLOOKUP(A436,Itinerário!$A$3:$I$875,7,FALSE)=0,\"\",VLOOKUP(A436,Itinerário!$A$3:$I$875,7,FALSE))","v":"Encerramento Semana de Colheita"},{"$f":"IF(VLOOKUP(A436,Itinerário!$A$3:$I$875,8,FALSE)=0,\"\",VLOOKUP(A436,Itinerário!$A$3:$I$875,8,FALSE))","v":"Barreiros"},{"$f":"IF(VLOOKUP(A436,Itinerário!$A$3:$I$875,9,FALSE)=0,\"\",VLOOKUP(A436,Itinerário!$A$3:$I$875,9,FALSE))","v":"Barreiros"}]
[434,{"$f":"VLOOKUP(A437,Itinerário!$A$3:$I$875,3,FALSE)","v":"JEFERSON FORTES LORENZI"},{"$f":"VLOOKUP(A437,Itinerário!$A$3:$I$875,5,FALSE)","v":"AGOSTO"},{"$f":"IF(VLOOKUP(A437,Itinerário!$A$3:$I$875,6,FALSE)=0,\"\",VLOOKUP(A437,Itinerário!$A$3:$I$875,6,FALSE))","v":25},"2018-08-25",{"$f":"IF(VLOOKUP(A437,Itinerário!$A$3:$I$875,7,FALSE)=0,\"\",VLOOKUP(A437,Itinerário!$A$3:$I$875,7,FALSE))","v":"Sermão"},{"$f":"IF(VLOOKUP(A437,Itinerário!$A$3:$I$875,8,FALSE)=0,\"\",VLOOKUP(A437,Itinerário!$A$3:$I$875,8,FALSE))","v":"Santo Amaro da Imperatriz"},{"$f":"IF(VLOOKUP(A437,Itinerário!$A$3:$I$875,9,FALSE)=0,\"\",VLOOKUP(A437,Itinerário!$A$3:$I$875,9,FALSE))","v":"Caminho Novo"}]
[435,{"$f":"VLOOKUP(A438,Itinerário!$A$3:$I$875,3,FALSE)","v":"JEFERSON FORTES LORENZI"},{"$f":"VLOOKUP(A438,Itinerário!$A$3:$I$875,5,FALSE)","v":"AGOSTO"},{"$f":"IF(VLOOKUP(A438,Itinerário!$A$3:$I$875,6,FALSE)=0,\"\",VLOOKUP(A438,Itinerário!$A$3:$I$875,6,FALSE))","v":""},"00:00:00",{"$f":"IF(VLOOKUP(A438,Itinerário!$A$3:$I$875,7,FALSE)=0,\"\",VLOOKUP(A438,Itinerário!$A$3:$I$875,7,FALSE))","v":""},{"$f":"IF(VLOOKUP(A438,Itinerário!$A$3:$I$875,8,FALSE)=0,\"\",VLOOKUP(A438,Itinerário!$A$3:$I$875,8,FALSE))","v":""},{"$f":"IF(VLOOKUP(A438,Itinerário!$A$3:$I$875,9,FALSE)=0,\"\",VLOOKUP(A438,Itinerário!$A$3:$I$875,9,FALSE))","v":""}]
[436,{"$f":"VLOOKUP(A439,Itinerário!$A$3:$I$875,3,FALSE)","v":"JEFERSON FORTES LORENZI"},{"$f":"VLOOKUP(A439,Itinerário!$A$3:$I$875,5,FALSE)","v":"AGOSTO"},{"$f":"IF(VLOOKUP(A439,Itinerário!$A$3:$I$875,6,FALSE)=0,\"\",VLOOKUP(A439,Itinerário!$A$3:$I$875,6,FALSE))","v":""},"00:00:00",{"$f":"IF(VLOOKUP(A439,Itinerário!$A$3:$I$875,7,FALSE)=0,\"\",VLOOKUP(A439,Itinerário!$A$3:$I$875,7,FALSE))","v":""},{"$f":"IF(VLOOKUP(A439,Itinerário!$A$3:$I$875,8,FALSE)=0,\"\",VLOOKUP(A439,Itinerário!$A$3:$I$875,8,FALSE))","v":""},{"$f":"IF(VLOOKUP(A439,Itinerário!$A$3:$I$875,9,FALSE)=0,\"\",VLOOKUP(A439,Itinerário!$A$3:$I$875,9,FALSE))","v":""}]
[437,{"$f":"VLOOKUP(A440,Itinerário!$A$3:$I$875,3,FALSE)","v":"JEFERSON FORTES LORENZI"},{"$f":"VLOOKUP(A440,Itinerário!$A$3:$I$875,5,FALSE)","v":"AGOSTO"},{"$f":"IF(VLOOKUP(A440,Itinerário!$A$3:$I$875,6,FALSE)=0,\"\",VLOOKUP(A440,Itinerário!$A$3:$I$875,6,FALSE))","v":""},"00:00:00",{"$f":"IF(VLOOKUP(A440,Itinerário!$A$3:$I$875,7,FALSE)=0,\"\",VLOOKUP(A440,Itinerário!$A$3:$I$875,7,FALSE))","v":""},{"$f":"IF(VLOOKUP(A440,Itinerário!$A$3:$I$875,8,FALSE)=0,\"\",VLOOKUP(A440,Itinerário!$A$3:$I$875,8,FALSE))","v":""},{"$f":"IF(VLOOKUP(A440,Itinerário!$A$3:$I$875,9,FALSE)=0,\"\",VLOOKUP(A440,Itinerário!$A$3:$I$875,9,FALSE))","v":""}]
[438,{"$f":"VLOOKUP(A441,Itinerário!$A$3:$I$875,3,FALSE)","v":"JEFERSON FORTES LORENZI"},{"$f":"VLOOKUP(A441,Itinerário!$A$3:$I$875,5,FALSE)","v":"AGOSTO"},{"$f":"IF(VLOOKUP(A441,Itinerário!$A$3:$I$875,6,FALSE)=0,\"\",VLOOKUP(A441,Itinerário!$A$3:$I$875,6,FALSE))","v":""},"00:00:00",{"$f":"IF(VLOOKUP(A441,Itinerário!$A$3:$I$875,7,FALSE)=0,\"\",VLOOKUP(A441,Itinerário!$A$3:$I$875,7,FALSE))","v":""},{"$f":"IF(VLOOKUP(A441,Itinerário!$A$3:$I$875,8,FALSE)=0,\"\",VLOOKUP(A441,Itinerário!$A$3:$I$875,8,FALSE))","v":""},{"$f":"IF(VLOOKUP(A441,Itinerário!$A$3:$I$875,9,FALSE)=0,\"\",VLOOKUP(A441,Itinerário!$A$3:$I$875,9,FALSE))","v":""}]
[439,{"$f":"VLOOKUP(A442,Itinerário!$A$3:$I$875,3,FALSE)","v":"JEFERSON FORTES LORENZI"},{"$f":"VLOOKUP(A442,Itinerário!$A$3:$I$875,5,FALSE)","v":"AGOSTO"},{"$f":"IF(VLOOKUP(A442,Itinerário!$A$3:$I$875,6,FALSE)=0,\"\",VLOOKUP(A442,Itinerário!$A$3:$I$875,6,FALSE))","v":""},"00:00:00",{"$f":"IF(VLOOKUP(A442,Itinerário!$A$3:$I$875,7,FALSE)=0,\"\",VLOOKUP(A442,Itinerário!$A$3:$I$875,7,FALSE))","v":""},{"$f":"IF(VLOOKUP(A442,Itinerário!$A$3:$I$875,8,FALSE)=0,\"\",VLOOKUP(A442,Itinerário!$A$3:$I$875,8,FALSE))","v":""},{"$f":"IF(VLOOKUP(A442,Itinerário!$A$3:$I$875,9,FALSE)=0,\"\",VLOOKUP(A442,Itinerário!$A$3:$I$875,9,FALSE))","v":""}]
[440,{"$f":"VLOOKUP(A443,Itinerário!$A$3:$I$875,3,FALSE)","v":"JEFERSON FORTES LORENZI"},{"$f":"VLOOKUP(A443,Itinerário!$A$3:$I$875,5,FALSE)","v":"AGOSTO"},{"$f":"IF(VLOOKUP(A443,Itinerário!$A$3:$I$875,6,FALSE)=0,\"\",VLOOKUP(A443,Itinerário!$A$3:$I$875,6,FALSE))","v":""},"00:00:00",{"$f":"IF(VLOOKUP(A443,Itinerário!$A$3:$I$875,7,FALSE)=0,\"\",VLOOKUP(A443,Itinerário!$A$3:$I$875,7,FALSE))","v":""},{"$f":"IF(VLOOKUP(A443,Itinerário!$A$3:$I$875,8,FALSE)=0,\"\",VLOOKUP(A443,Itinerário!$A$3:$I$875,8,FALSE))","v":""},{"$f":"IF(VLOOKUP(A443,Itinerário!$A$3:$I$875,9,FALSE)=0,\"\",VLOOKUP(A443,Itinerário!$A$3:$I$875,9,FALSE))","v":""}]
[441,{"$f":"VLOOKUP(A444,Itinerário!$A$3:$I$875,3,FALSE)","v":"JEFERSON FORTES LORENZI"},{"$f":"VLOOKUP(A444,Itinerário!$A$3:$I$875,5,FALSE)","v":"SETEMBRO"},{"$f":"IF(VLOOKUP(A444,Itinerário!$A$3:$I$875,6,FALSE)=0,\"\",VLOOKUP(A444,Itinerário!$A$3:$I$875,6,FALSE))","v":1},"2018-09-01",{"$f":"IF(VLOOKUP(A444,Itinerário!$A$3:$I$875,7,FALSE)=0,\"\",VLOOKUP(A444,Itinerário!$A$3:$I$875,7,FALSE))","v":"Semana de Colheita"},{"$f":"IF(VLOOKUP(A444,Itinerário!$A$3:$I$875,8,FALSE)=0,\"\",VLOOKUP(A444,Itinerário!$A$3:$I$875,8,FALSE))","v":"Itajaí"},{"$f":"IF(VLOOKUP(A444,Itinerário!$A$3:$I$875,9,FALSE)=0,\"\",VLOOKUP(A444,Itinerário!$A$3:$I$875,9,FALSE))","v":"Itajaí"}]
[442,{"$f":"VLOOKUP(A445,Itinerário!$A$3:$I$875,3,FALSE)","v":"JEFERSON FORTES LORENZI"},{"$f":"VLOOKUP(A445,Itinerário!$A$3:$I$875,5,FALSE)","v":"SETEMBRO"},{"$f":"IF(VLOOKUP(A445,Itinerário!$A$3:$I$875,6,FALSE)=0,\"\",VLOOKUP(A445,Itinerário!$A$3:$I$875,6,FALSE))","v":8},"2018-09-08",{"$f":"IF(VLOOKUP(A445,Itinerário!$A$3:$I$875,7,FALSE)=0,\"\",VLOOKUP(A445,Itinerário!$A$3:$I$875,7,FALSE))","v":"Encerramento Semana de Colheita"},{"$f":"IF(VLOOKUP(A445,Itinerário!$A$3:$I$875,8,FALSE)=0,\"\",VLOOKUP(A445,Itinerário!$A$3:$I$875,8,FALSE))","v":"Itajaí"},{"$f":"IF(VLOOKUP(A445,Itinerário!$A$3:$I$875,9,FALSE)=0,\"\",VLOOKUP(A445,Itinerário!$A$3:$I$875,9,FALSE))","v":"Itajaí"}]
[443,{"$f":"VLOOKUP(A446,Itinerário!$A$3:$I$875,3,FALSE)","v":"JEFERSON FORTES LORENZI"},{"$f":"VLOOKUP(A446,Itinerário!$A$3:$I$875,5,FALSE)","v":"SETEMBRO"},{"$f":"IF(VLOOKUP(A446,Itinerário!$A$3:$I$875,6,FALSE)=0,\"\",VLOOKUP(A446,Itinerário!$A$3:$I$875,6,FALSE))","v":15},"2018-09-15",{"$f":"IF(VLOOKUP(A446,Itinerário!$A$3:$I$875,7,FALSE)=0,\"\",VLOOKUP(A446,Itinerário!$A$3:$I$875,7,FALSE))","v":"Semana de Colheita"},{"$f":"IF(VLOOKUP(A446,Itinerário!$A$3:$I$875,8,FALSE)=0,\"\",VLOOKUP(A446,Itinerário!$A$3:$I$875,8,FALSE))","v":"Tubarão"},{"$f":"IF(VLOOKUP(A446,Itinerário!$A$3:$I$875,9,FALSE)=0,\"\",VLOOKUP(A446,Itinerário!$A$3:$I$875,9,FALSE))","v":"Tubarão"}]
[444,{"$f":"VLOOKUP(A447,Itinerário!$A$3:$I$875,3,FALSE)","v":"JEFERSON FORTES LORENZI"},{"$f":"VLOOKUP(A447,Itinerário!$A$3:$I$875,5,FALSE)","v":"SETEMBRO"},{"$f":"IF(VLOOKUP(A447,Itinerário!$A$3:$I$875,6,FALSE)=0,\"\",VLOOKUP(A447,Itinerário!$A$3:$I$875,6,FALSE))","v":22},"2018-09-22",{"$f":"IF(VLOOKUP(A447,Itinerário!$A$3:$I$875,7,FALSE)=0,\"\",VLOOKUP(A447,Itinerário!$A$3:$I$875,7,FALSE))","v":"Preparação Semana de Colheita"},{"$f":"IF(VLOOKUP(A447,Itinerário!$A$3:$I$875,8,FALSE)=0,\"\",VLOOKUP(A447,Itinerário!$A$3:$I$875,8,FALSE))","v":"Biguaçu"},{"$f":"IF(VLOOKUP(A447,Itinerário!$A$3:$I$875,9,FALSE)=0,\"\",VLOOKUP(A447,Itinerário!$A$3:$I$875,9,FALSE))","v":"Biguaçu"}]
[445,{"$f":"VLOOKUP(A448,Itinerário!$A$3:$I$875,3,FALSE)","v":"JEFERSON FORTES LORENZI"},{"$f":"VLOOKUP(A448,Itinerário!$A$3:$I$875,5,FALSE)","v":"SETEMBRO"},{"$f":"IF(VLOOKUP(A448,Itinerário!$A$3:$I$875,6,FALSE)=0,\"\",VLOOKUP(A448,Itinerário!$A$3:$I$875,6,FALSE))","v":29},"2018-09-29",{"$f":"IF(VLOOKUP(A448,Itinerário!$A$3:$I$875,7,FALSE)=0,\"\",VLOOKUP(A448,Itinerário!$A$3:$I$875,7,FALSE))","v":"Semana de Colheita"},{"$f":"IF(VLOOKUP(A448,Itinerário!$A$3:$I$875,8,FALSE)=0,\"\",VLOOKUP(A448,Itinerário!$A$3:$I$875,8,FALSE))","v":"Camboriú"},{"$f":"IF(VLOOKUP(A448,Itinerário!$A$3:$I$875,9,FALSE)=0,\"\",VLOOKUP(A448,Itinerário!$A$3:$I$875,9,FALSE))","v":"Camboriú"}]
[446,{"$f":"VLOOKUP(A449,Itinerário!$A$3:$I$875,3,FALSE)","v":"JEFERSON FORTES LORENZI"},{"$f":"VLOOKUP(A449,Itinerário!$A$3:$I$875,5,FALSE)","v":"SETEMBRO"},{"$f":"IF(VLOOKUP(A449,Itinerário!$A$3:$I$875,6,FALSE)=0,\"\",VLOOKUP(A449,Itinerário!$A$3:$I$875,6,FALSE))","v":""},"00:00:00",{"$f":"IF(VLOOKUP(A449,Itinerário!$A$3:$I$875,7,FALSE)=0,\"\",VLOOKUP(A449,Itinerário!$A$3:$I$875,7,FALSE))","v":""},{"$f":"IF(VLOOKUP(A449,Itinerário!$A$3:$I$875,8,FALSE)=0,\"\",VLOOKUP(A449,Itinerário!$A$3:$I$875,8,FALSE))","v":""},{"$f":"IF(VLOOKUP(A449,Itinerário!$A$3:$I$875,9,FALSE)=0,\"\",VLOOKUP(A449,Itinerário!$A$3:$I$875,9,FALSE))","v":""}]
[447,{"$f":"VLOOKUP(A450,Itinerário!$A$3:$I$875,3,FALSE)","v":"JEFERSON FORTES LORENZI"},{"$f":"VLOOKUP(A450,Itinerário!$A$3:$I$875,5,FALSE)","v":"SETEMBRO"},{"$f":"IF(VLOOKUP(A450,Itinerário!$A$3:$I$875,6,FALSE)=0,\"\",VLOOKUP(A450,Itinerário!$A$3:$I$875,6,FALSE))","v":""},"00:00:00",{"$f":"IF(VLOOKUP(A450,Itinerário!$A$3:$I$875,7,FALSE)=0,\"\",VLOOKUP(A450,Itinerário!$A$3:$I$875,7,FALSE))","v":""},{"$f":"IF(VLOOKUP(A450,Itinerário!$A$3:$I$875,8,FALSE)=0,\"\",VLOOKUP(A450,Itinerário!$A$3:$I$875,8,FALSE))","v":""},{"$f":"IF(VLOOKUP(A450,Itinerário!$A$3:$I$875,9,FALSE)=0,\"\",VLOOKUP(A450,Itinerário!$A$3:$I$875,9,FALSE))","v":""}]
[448,{"$f":"VLOOKUP(A451,Itinerário!$A$3:$I$875,3,FALSE)","v":"JEFERSON FORTES LORENZI"},{"$f":"VLOOKUP(A451,Itinerário!$A$3:$I$875,5,FALSE)","v":"SETEMBRO"},{"$f":"IF(VLOOKUP(A451,Itinerário!$A$3:$I$875,6,FALSE)=0,\"\",VLOOKUP(A451,Itinerário!$A$3:$I$875,6,FALSE))","v":""},"00:00:00",{"$f":"IF(VLOOKUP(A451,Itinerário!$A$3:$I$875,7,FALSE)=0,\"\",VLOOKUP(A451,Itinerário!$A$3:$I$875,7,FALSE))","v":""},{"$f":"IF(VLOOKUP(A451,Itinerário!$A$3:$I$875,8,FALSE)=0,\"\",VLOOKUP(A451,Itinerário!$A$3:$I$875,8,FALSE))","v":""},{"$f":"IF(VLOOKUP(A451,Itinerário!$A$3:$I$875,9,FALSE)=0,\"\",VLOOKUP(A451,Itinerário!$A$3:$I$875,9,FALSE))","v":""}]
[449,{"$f":"VLOOKUP(A452,Itinerário!$A$3:$I$875,3,FALSE)","v":"JEFERSON FORTES LORENZI"},{"$f":"VLOOKUP(A452,Itinerário!$A$3:$I$875,5,FALSE)","v":"SETEMBRO"},{"$f":"IF(VLOOKUP(A452,Itinerário!$A$3:$I$875,6,FALSE)=0,\"\",VLOOKUP(A452,Itinerário!$A$3:$I$875,6,FALSE))","v":""},{"$f":"IFERROR(DATE(RIGHT($B$2,4),VLOOKUP(C452,$J$4:$K$15,2,FALSE),D452),0)","v":"00:00:00"},{"$f":"IF(VLOOKUP(A452,Itinerário!$A$3:$I$875,7,FALSE)=0,\"\",VLOOKUP(A452,Itinerário!$A$3:$I$875,7,FALSE))","v":""},{"$f":"IF(VLOOKUP(A452,Itinerário!$A$3:$I$875,8,FALSE)=0,\"\",VLOOKUP(A452,Itinerário!$A$3:$I$875,8,FALSE))","v":""},{"$f":"IF(VLOOKUP(A452,Itinerário!$A$3:$I$875,9,FALSE)=0,\"\",VLOOKUP(A452,Itinerário!$A$3:$I$875,9,FALSE))","v":""}]
[450,{"$f":"VLOOKUP(A453,Itinerário!$A$3:$I$875,3,FALSE)","v":"JEFERSON FORTES LORENZI"},{"$f":"VLOOKUP(A453,Itinerário!$A$3:$I$875,5,FALSE)","v":"SETEMBRO"},{"$f":"IF(VLOOKUP(A453,Itinerário!$A$3:$I$875,6,FALSE)=0,\"\",VLOOKUP(A453,Itinerário!$A$3:$I$875,6,FALSE))","v":""},"00:00:00",{"$f":"IF(VLOOKUP(A453,Itinerário!$A$3:$I$875,7,FALSE)=0,\"\",VLOOKUP(A453,Itinerário!$A$3:$I$875,7,FALSE))","v":""},{"$f":"IF(VLOOKUP(A453,Itinerário!$A$3:$I$875,8,FALSE)=0,\"\",VLOOKUP(A453,Itinerário!$A$3:$I$875,8,FALSE))","v":""},{"$f":"IF(VLOOKUP(A453,Itinerário!$A$3:$I$875,9,FALSE)=0,\"\",VLOOKUP(A453,Itinerário!$A$3:$I$875,9,FALSE))","v":""}]
[451,{"$f":"VLOOKUP(A454,Itinerário!$A$3:$I$875,3,FALSE)","v":"JEFERSON FORTES LORENZI"},{"$f":"VLOOKUP(A454,Itinerário!$A$3:$I$875,5,FALSE)","v":"OUTUBRO"},{"$f":"IF(VLOOKUP(A454,Itinerário!$A$3:$I$875,6,FALSE)=0,\"\",VLOOKUP(A454,Itinerário!$A$3:$I$875,6,FALSE))","v":6},"2018-10-06",{"$f":"IF(VLOOKUP(A454,Itinerário!$A$3:$I$875,7,FALSE)=0,\"\",VLOOKUP(A454,Itinerário!$A$3:$I$875,7,FALSE))","v":"Encerramento Semana de Colheita"},{"$f":"IF(VLOOKUP(A454,Itinerário!$A$3:$I$875,8,FALSE)=0,\"\",VLOOKUP(A454,Itinerário!$A$3:$I$875,8,FALSE))","v":"Camboriú"},{"$f":"IF(VLOOKUP(A454,Itinerário!$A$3:$I$875,9,FALSE)=0,\"\",VLOOKUP(A454,Itinerário!$A$3:$I$875,9,FALSE))","v":"Camboriú"}]
[452,{"$f":"VLOOKUP(A455,Itinerário!$A$3:$I$875,3,FALSE)","v":"JEFERSON FORTES LORENZI"},{"$f":"VLOOKUP(A455,Itinerário!$A$3:$I$875,5,FALSE)","v":"OUTUBRO"},{"$f":"IF(VLOOKUP(A455,Itinerário!$A$3:$I$875,6,FALSE)=0,\"\",VLOOKUP(A455,Itinerário!$A$3:$I$875,6,FALSE))","v":13},"2018-10-13",{"$f":"IF(VLOOKUP(A455,Itinerário!$A$3:$I$875,7,FALSE)=0,\"\",VLOOKUP(A455,Itinerário!$A$3:$I$875,7,FALSE))","v":"Preparação Semana de Colheita"},{"$f":"IF(VLOOKUP(A455,Itinerário!$A$3:$I$875,8,FALSE)=0,\"\",VLOOKUP(A455,Itinerário!$A$3:$I$875,8,FALSE))","v":"Tijucas"},{"$f":"IF(VLOOKUP(A455,Itinerário!$A$3:$I$875,9,FALSE)=0,\"\",VLOOKUP(A455,Itinerário!$A$3:$I$875,9,FALSE))","v":"Tijucas"}]
[453,{"$f":"VLOOKUP(A456,Itinerário!$A$3:$I$875,3,FALSE)","v":"JEFERSON FORTES LORENZI"},{"$f":"VLOOKUP(A456,Itinerário!$A$3:$I$875,5,FALSE)","v":"OUTUBRO"},{"$f":"IF(VLOOKUP(A456,Itinerário!$A$3:$I$875,6,FALSE)=0,\"\",VLOOKUP(A456,Itinerário!$A$3:$I$875,6,FALSE))","v":20},"2018-10-20",{"$f":"IF(VLOOKUP(A456,Itinerário!$A$3:$I$875,7,FALSE)=0,\"\",VLOOKUP(A456,Itinerário!$A$3:$I$875,7,FALSE))","v":"Semana de Colheita"},{"$f":"IF(VLOOKUP(A456,Itinerário!$A$3:$I$875,8,FALSE)=0,\"\",VLOOKUP(A456,Itinerário!$A$3:$I$875,8,FALSE))","v":"Biguaçu"},{"$f":"IF(VLOOKUP(A456,Itinerário!$A$3:$I$875,9,FALSE)=0,\"\",VLOOKUP(A456,Itinerário!$A$3:$I$875,9,FALSE))","v":"Biguaçu"}]
[454,{"$f":"VLOOKUP(A457,Itinerário!$A$3:$I$875,3,FALSE)","v":"JEFERSON FORTES LORENZI"},{"$f":"VLOOKUP(A457,Itinerário!$A$3:$I$875,5,FALSE)","v":"OUTUBRO"},{"$f":"IF(VLOOKUP(A457,Itinerário!$A$3:$I$875,6,FALSE)=0,\"\",VLOOKUP(A457,Itinerário!$A$3:$I$875,6,FALSE))","v":27},"2018-10-27",{"$f":"IF(VLOOKUP(A457,Itinerário!$A$3:$I$875,7,FALSE)=0,\"\",VLOOKUP(A457,Itinerário!$A$3:$I$875,7,FALSE))","v":"Encerramento Semana de Colheita"},{"$f":"IF(VLOOKUP(A457,Itinerário!$A$3:$I$875,8,FALSE)=0,\"\",VLOOKUP(A457,Itinerário!$A$3:$I$875,8,FALSE))","v":"Biguaçu"},{"$f":"IF(VLOOKUP(A457,Itinerário!$A$3:$I$875,9,FALSE)=0,\"\",VLOOKUP(A457,Itinerário!$A$3:$I$875,9,FALSE))","v":"Biguaçu"}]
[455,{"$f":"VLOOKUP(A458,Itinerário!$A$3:$I$875,3,FALSE)","v":"JEFERSON FORTES LORENZI"},{"$f":"VLOOKUP(A458,Itinerário!$A$3:$I$875,5,FALSE)","v":"OUTUBRO"},{"$f":"IF(VLOOKUP(A458,Itinerário!$A$3:$I$875,6,FALSE)=0,\"\",VLOOKUP(A458,Itinerário!$A$3:$I$875,6,FALSE))","v":""},"00:00:00",{"$f":"IF(VLOOKUP(A458,Itinerário!$A$3:$I$875,7,FALSE)=0,\"\",VLOOKUP(A458,Itinerário!$A$3:$I$875,7,FALSE))","v":""},{"$f":"IF(VLOOKUP(A458,Itinerário!$A$3:$I$875,8,FALSE)=0,\"\",VLOOKUP(A458,Itinerário!$A$3:$I$875,8,FALSE))","v":""},{"$f":"IF(VLOOKUP(A458,Itinerário!$A$3:$I$875,9,FALSE)=0,\"\",VLOOKUP(A458,Itinerário!$A$3:$I$875,9,FALSE))","v":""}]
[456,{"$f":"VLOOKUP(A459,Itinerário!$A$3:$I$875,3,FALSE)","v":"JEFERSON FORTES LORENZI"},{"$f":"VLOOKUP(A459,Itinerário!$A$3:$I$875,5,FALSE)","v":"OUTUBRO"},{"$f":"IF(VLOOKUP(A459,Itinerário!$A$3:$I$875,6,FALSE)=0,\"\",VLOOKUP(A459,Itinerário!$A$3:$I$875,6,FALSE))","v":""},"00:00:00",{"$f":"IF(VLOOKUP(A459,Itinerário!$A$3:$I$875,7,FALSE)=0,\"\",VLOOKUP(A459,Itinerário!$A$3:$I$875,7,FALSE))","v":""},{"$f":"IF(VLOOKUP(A459,Itinerário!$A$3:$I$875,8,FALSE)=0,\"\",VLOOKUP(A459,Itinerário!$A$3:$I$875,8,FALSE))","v":""},{"$f":"IF(VLOOKUP(A459,Itinerário!$A$3:$I$875,9,FALSE)=0,\"\",VLOOKUP(A459,Itinerário!$A$3:$I$875,9,FALSE))","v":""}]
[457,{"$f":"VLOOKUP(A460,Itinerário!$A$3:$I$875,3,FALSE)","v":"JEFERSON FORTES LORENZI"},{"$f":"VLOOKUP(A460,Itinerário!$A$3:$I$875,5,FALSE)","v":"OUTUBRO"},{"$f":"IF(VLOOKUP(A460,Itinerário!$A$3:$I$875,6,FALSE)=0,\"\",VLOOKUP(A460,Itinerário!$A$3:$I$875,6,FALSE))","v":""},"00:00:00",{"$f":"IF(VLOOKUP(A460,Itinerário!$A$3:$I$875,7,FALSE)=0,\"\",VLOOKUP(A460,Itinerário!$A$3:$I$875,7,FALSE))","v":""},{"$f":"IF(VLOOKUP(A460,Itinerário!$A$3:$I$875,8,FALSE)=0,\"\",VLOOKUP(A460,Itinerário!$A$3:$I$875,8,FALSE))","v":""},{"$f":"IF(VLOOKUP(A460,Itinerário!$A$3:$I$875,9,FALSE)=0,\"\",VLOOKUP(A460,Itinerário!$A$3:$I$875,9,FALSE))","v":""}]
[458,{"$f":"VLOOKUP(A461,Itinerário!$A$3:$I$875,3,FALSE)","v":"JEFERSON FORTES LORENZI"},{"$f":"VLOOKUP(A461,Itinerário!$A$3:$I$875,5,FALSE)","v":"OUTUBRO"},{"$f":"IF(VLOOKUP(A461,Itinerário!$A$3:$I$875,6,FALSE)=0,\"\",VLOOKUP(A461,Itinerário!$A$3:$I$875,6,FALSE))","v":""},"00:00:00",{"$f":"IF(VLOOKUP(A461,Itinerário!$A$3:$I$875,7,FALSE)=0,\"\",VLOOKUP(A461,Itinerário!$A$3:$I$875,7,FALSE))","v":""},{"$f":"IF(VLOOKUP(A461,Itinerário!$A$3:$I$875,8,FALSE)=0,\"\",VLOOKUP(A461,Itinerário!$A$3:$I$875,8,FALSE))","v":""},{"$f":"IF(VLOOKUP(A461,Itinerário!$A$3:$I$875,9,FALSE)=0,\"\",VLOOKUP(A461,Itinerário!$A$3:$I$875,9,FALSE))","v":""}]
[459,{"$f":"VLOOKUP(A462,Itinerário!$A$3:$I$875,3,FALSE)","v":"JEFERSON FORTES LORENZI"},{"$f":"VLOOKUP(A462,Itinerário!$A$3:$I$875,5,FALSE)","v":"OUTUBRO"},{"$f":"IF(VLOOKUP(A462,Itinerário!$A$3:$I$875,6,FALSE)=0,\"\",VLOOKUP(A462,Itinerário!$A$3:$I$875,6,FALSE))","v":""},"00:00:00",{"$f":"IF(VLOOKUP(A462,Itinerário!$A$3:$I$875,7,FALSE)=0,\"\",VLOOKUP(A462,Itinerário!$A$3:$I$875,7,FALSE))","v":""},{"$f":"IF(VLOOKUP(A462,Itinerário!$A$3:$I$875,8,FALSE)=0,\"\",VLOOKUP(A462,Itinerário!$A$3:$I$875,8,FALSE))","v":""},{"$f":"IF(VLOOKUP(A462,Itinerário!$A$3:$I$875,9,FALSE)=0,\"\",VLOOKUP(A462,Itinerário!$A$3:$I$875,9,FALSE))","v":""}]
[460,{"$f":"VLOOKUP(A463,Itinerário!$A$3:$I$875,3,FALSE)","v":"JEFERSON FORTES LORENZI"},{"$f":"VLOOKUP(A463,Itinerário!$A$3:$I$875,5,FALSE)","v":"OUTUBRO"},{"$f":"IF(VLOOKUP(A463,Itinerário!$A$3:$I$875,6,FALSE)=0,\"\",VLOOKUP(A463,Itinerário!$A$3:$I$875,6,FALSE))","v":""},"00:00:00",{"$f":"IF(VLOOKUP(A463,Itinerário!$A$3:$I$875,7,FALSE)=0,\"\",VLOOKUP(A463,Itinerário!$A$3:$I$875,7,FALSE))","v":""},{"$f":"IF(VLOOKUP(A463,Itinerário!$A$3:$I$875,8,FALSE)=0,\"\",VLOOKUP(A463,Itinerário!$A$3:$I$875,8,FALSE))","v":""},{"$f":"IF(VLOOKUP(A463,Itinerário!$A$3:$I$875,9,FALSE)=0,\"\",VLOOKUP(A463,Itinerário!$A$3:$I$875,9,FALSE))","v":""}]
[461,{"$f":"VLOOKUP(A464,Itinerário!$A$3:$I$875,3,FALSE)","v":"JEFERSON FORTES LORENZI"},{"$f":"VLOOKUP(A464,Itinerário!$A$3:$I$875,5,FALSE)","v":"NOVEMBRO"},{"$f":"IF(VLOOKUP(A464,Itinerário!$A$3:$I$875,6,FALSE)=0,\"\",VLOOKUP(A464,Itinerário!$A$3:$I$875,6,FALSE))","v":"03 a 10"},"00:00:00",{"$f":"IF(VLOOKUP(A464,Itinerário!$A$3:$I$875,7,FALSE)=0,\"\",VLOOKUP(A464,Itinerário!$A$3:$I$875,7,FALSE))","v":"Impacto Criciúma"},{"$f":"IF(VLOOKUP(A464,Itinerário!$A$3:$I$875,8,FALSE)=0,\"\",VLOOKUP(A464,Itinerário!$A$3:$I$875,8,FALSE))","v":"AC"},{"$f":"IF(VLOOKUP(A464,Itinerário!$A$3:$I$875,9,FALSE)=0,\"\",VLOOKUP(A464,Itinerário!$A$3:$I$875,9,FALSE))","v":"AC"}]
[462,{"$f":"VLOOKUP(A465,Itinerário!$A$3:$I$875,3,FALSE)","v":"JEFERSON FORTES LORENZI"},{"$f":"VLOOKUP(A465,Itinerário!$A$3:$I$875,5,FALSE)","v":"NOVEMBRO"},{"$f":"IF(VLOOKUP(A465,Itinerário!$A$3:$I$875,6,FALSE)=0,\"\",VLOOKUP(A465,Itinerário!$A$3:$I$875,6,FALSE))","v":17},"2018-11-17",{"$f":"IF(VLOOKUP(A465,Itinerário!$A$3:$I$875,7,FALSE)=0,\"\",VLOOKUP(A465,Itinerário!$A$3:$I$875,7,FALSE))","v":"Sermão"},{"$f":"IF(VLOOKUP(A465,Itinerário!$A$3:$I$875,8,FALSE)=0,\"\",VLOOKUP(A465,Itinerário!$A$3:$I$875,8,FALSE))","v":"Estreito"},{"$f":"IF(VLOOKUP(A465,Itinerário!$A$3:$I$875,9,FALSE)=0,\"\",VLOOKUP(A465,Itinerário!$A$3:$I$875,9,FALSE))","v":"Estreito"}]
[463,{"$f":"VLOOKUP(A466,Itinerário!$A$3:$I$875,3,FALSE)","v":"JEFERSON FORTES LORENZI"},{"$f":"VLOOKUP(A466,Itinerário!$A$3:$I$875,5,FALSE)","v":"NOVEMBRO"},{"$f":"IF(VLOOKUP(A466,Itinerário!$A$3:$I$875,6,FALSE)=0,\"\",VLOOKUP(A466,Itinerário!$A$3:$I$875,6,FALSE))","v":24},"2018-11-24",{"$f":"IF(VLOOKUP(A466,Itinerário!$A$3:$I$875,7,FALSE)=0,\"\",VLOOKUP(A466,Itinerário!$A$3:$I$875,7,FALSE))","v":"Semana de Colheita"},{"$f":"IF(VLOOKUP(A466,Itinerário!$A$3:$I$875,8,FALSE)=0,\"\",VLOOKUP(A466,Itinerário!$A$3:$I$875,8,FALSE))","v":"Tijucas"},{"$f":"IF(VLOOKUP(A466,Itinerário!$A$3:$I$875,9,FALSE)=0,\"\",VLOOKUP(A466,Itinerário!$A$3:$I$875,9,FALSE))","v":"Tijucas"}]
[464,{"$f":"VLOOKUP(A467,Itinerário!$A$3:$I$875,3,FALSE)","v":"JEFERSON FORTES LORENZI"},{"$f":"VLOOKUP(A467,Itinerário!$A$3:$I$875,5,FALSE)","v":"NOVEMBRO"},{"$f":"IF(VLOOKUP(A467,Itinerário!$A$3:$I$875,6,FALSE)=0,\"\",VLOOKUP(A467,Itinerário!$A$3:$I$875,6,FALSE))","v":""},"00:00:00",{"$f":"IF(VLOOKUP(A467,Itinerário!$A$3:$I$875,7,FALSE)=0,\"\",VLOOKUP(A467,Itinerário!$A$3:$I$875,7,FALSE))","v":""},{"$f":"IF(VLOOKUP(A467,Itinerário!$A$3:$I$875,8,FALSE)=0,\"\",VLOOKUP(A467,Itinerário!$A$3:$I$875,8,FALSE))","v":""},{"$f":"IF(VLOOKUP(A467,Itinerário!$A$3:$I$875,9,FALSE)=0,\"\",VLOOKUP(A467,Itinerário!$A$3:$I$875,9,FALSE))","v":""}]
[465,{"$f":"VLOOKUP(A468,Itinerário!$A$3:$I$875,3,FALSE)","v":"JEFERSON FORTES LORENZI"},{"$f":"VLOOKUP(A468,Itinerário!$A$3:$I$875,5,FALSE)","v":"NOVEMBRO"},{"$f":"IF(VLOOKUP(A468,Itinerário!$A$3:$I$875,6,FALSE)=0,\"\",VLOOKUP(A468,Itinerário!$A$3:$I$875,6,FALSE))","v":""},"00:00:00",{"$f":"IF(VLOOKUP(A468,Itinerário!$A$3:$I$875,7,FALSE)=0,\"\",VLOOKUP(A468,Itinerário!$A$3:$I$875,7,FALSE))","v":""},{"$f":"IF(VLOOKUP(A468,Itinerário!$A$3:$I$875,8,FALSE)=0,\"\",VLOOKUP(A468,Itinerário!$A$3:$I$875,8,FALSE))","v":""},{"$f":"IF(VLOOKUP(A468,Itinerário!$A$3:$I$875,9,FALSE)=0,\"\",VLOOKUP(A468,Itinerário!$A$3:$I$875,9,FALSE))","v":""}]
[466,{"$f":"VLOOKUP(A469,Itinerário!$A$3:$I$875,3,FALSE)","v":"JEFERSON FORTES LORENZI"},{"$f":"VLOOKUP(A469,Itinerário!$A$3:$I$875,5,FALSE)","v":"NOVEMBRO"},{"$f":"IF(VLOOKUP(A469,Itinerário!$A$3:$I$875,6,FALSE)=0,\"\",VLOOKUP(A469,Itinerário!$A$3:$I$875,6,FALSE))","v":""},"00:00:00",{"$f":"IF(VLOOKUP(A469,Itinerário!$A$3:$I$875,7,FALSE)=0,\"\",VLOOKUP(A469,Itinerário!$A$3:$I$875,7,FALSE))","v":""},{"$f":"IF(VLOOKUP(A469,Itinerário!$A$3:$I$875,8,FALSE)=0,\"\",VLOOKUP(A469,Itinerário!$A$3:$I$875,8,FALSE))","v":""},{"$f":"IF(VLOOKUP(A469,Itinerário!$A$3:$I$875,9,FALSE)=0,\"\",VLOOKUP(A469,Itinerário!$A$3:$I$875,9,FALSE))","v":""}]
[467,{"$f":"VLOOKUP(A470,Itinerário!$A$3:$I$875,3,FALSE)","v":"JEFERSON FORTES LORENZI"},{"$f":"VLOOKUP(A470,Itinerário!$A$3:$I$875,5,FALSE)","v":"NOVEMBRO"},{"$f":"IF(VLOOKUP(A470,Itinerário!$A$3:$I$875,6,FALSE)=0,\"\",VLOOKUP(A470,Itinerário!$A$3:$I$875,6,FALSE))","v":""},"00:00:00",{"$f":"IF(VLOOKUP(A470,Itinerário!$A$3:$I$875,7,FALSE)=0,\"\",VLOOKUP(A470,Itinerário!$A$3:$I$875,7,FALSE))","v":""},{"$f":"IF(VLOOKUP(A470,Itinerário!$A$3:$I$875,8,FALSE)=0,\"\",VLOOKUP(A470,Itinerário!$A$3:$I$875,8,FALSE))","v":""},{"$f":"IF(VLOOKUP(A470,Itinerário!$A$3:$I$875,9,FALSE)=0,\"\",VLOOKUP(A470,Itinerário!$A$3:$I$875,9,FALSE))","v":""}]
[468,{"$f":"VLOOKUP(A471,Itinerário!$A$3:$I$875,3,FALSE)","v":"JEFERSON FORTES LORENZI"},{"$f":"VLOOKUP(A471,Itinerário!$A$3:$I$875,5,FALSE)","v":"NOVEMBRO"},{"$f":"IF(VLOOKUP(A471,Itinerário!$A$3:$I$875,6,FALSE)=0,\"\",VLOOKUP(A471,Itinerário!$A$3:$I$875,6,FALSE))","v":""},"00:00:00",{"$f":"IF(VLOOKUP(A471,Itinerário!$A$3:$I$875,7,FALSE)=0,\"\",VLOOKUP(A471,Itinerário!$A$3:$I$875,7,FALSE))","v":""},{"$f":"IF(VLOOKUP(A471,Itinerário!$A$3:$I$875,8,FALSE)=0,\"\",VLOOKUP(A471,Itinerário!$A$3:$I$875,8,FALSE))","v":""},{"$f":"IF(VLOOKUP(A471,Itinerário!$A$3:$I$875,9,FALSE)=0,\"\",VLOOKUP(A471,Itinerário!$A$3:$I$875,9,FALSE))","v":""}]
[469,{"$f":"VLOOKUP(A472,Itinerário!$A$3:$I$875,3,FALSE)","v":"JEFERSON FORTES LORENZI"},{"$f":"VLOOKUP(A472,Itinerário!$A$3:$I$875,5,FALSE)","v":"NOVEMBRO"},{"$f":"IF(VLOOKUP(A472,Itinerário!$A$3:$I$875,6,FALSE)=0,\"\",VLOOKUP(A472,Itinerário!$A$3:$I$875,6,FALSE))","v":""},"00:00:00",{"$f":"IF(VLOOKUP(A472,Itinerário!$A$3:$I$875,7,FALSE)=0,\"\",VLOOKUP(A472,Itinerário!$A$3:$I$875,7,FALSE))","v":""},{"$f":"IF(VLOOKUP(A472,Itinerário!$A$3:$I$875,8,FALSE)=0,\"\",VLOOKUP(A472,Itinerário!$A$3:$I$875,8,FALSE))","v":""},{"$f":"IF(VLOOKUP(A472,Itinerário!$A$3:$I$875,9,FALSE)=0,\"\",VLOOKUP(A472,Itinerário!$A$3:$I$875,9,FALSE))","v":""}]
[470,{"$f":"VLOOKUP(A473,Itinerário!$A$3:$I$875,3,FALSE)","v":"JEFERSON FORTES LORENZI"},{"$f":"VLOOKUP(A473,Itinerário!$A$3:$I$875,5,FALSE)","v":"NOVEMBRO"},{"$f":"IF(VLOOKUP(A473,Itinerário!$A$3:$I$875,6,FALSE)=0,\"\",VLOOKUP(A473,Itinerário!$A$3:$I$875,6,FALSE))","v":""},"00:00:00",{"$f":"IF(VLOOKUP(A473,Itinerário!$A$3:$I$875,7,FALSE)=0,\"\",VLOOKUP(A473,Itinerário!$A$3:$I$875,7,FALSE))","v":""},{"$f":"IF(VLOOKUP(A473,Itinerário!$A$3:$I$875,8,FALSE)=0,\"\",VLOOKUP(A473,Itinerário!$A$3:$I$875,8,FALSE))","v":""},{"$f":"IF(VLOOKUP(A473,Itinerário!$A$3:$I$875,9,FALSE)=0,\"\",VLOOKUP(A473,Itinerário!$A$3:$I$875,9,FALSE))","v":""}]
[471,{"$f":"VLOOKUP(A474,Itinerário!$A$3:$I$875,3,FALSE)","v":"JEFERSON FORTES LORENZI"},{"$f":"VLOOKUP(A474,Itinerário!$A$3:$I$875,5,FALSE)","v":"DEZEMBRO"},{"$f":"IF(VLOOKUP(A474,Itinerário!$A$3:$I$875,6,FALSE)=0,\"\",VLOOKUP(A474,Itinerário!$A$3:$I$875,6,FALSE))","v":1},"2018-12-01",{"$f":"IF(VLOOKUP(A474,Itinerário!$A$3:$I$875,7,FALSE)=0,\"\",VLOOKUP(A474,Itinerário!$A$3:$I$875,7,FALSE))","v":"Encerramento Semana de Colheita"},{"$f":"IF(VLOOKUP(A474,Itinerário!$A$3:$I$875,8,FALSE)=0,\"\",VLOOKUP(A474,Itinerário!$A$3:$I$875,8,FALSE))","v":"Tijucas"},{"$f":"IF(VLOOKUP(A474,Itinerário!$A$3:$I$875,9,FALSE)=0,\"\",VLOOKUP(A474,Itinerário!$A$3:$I$875,9,FALSE))","v":"Tijucas"}]
[472,{"$f":"VLOOKUP(A475,Itinerário!$A$3:$I$875,3,FALSE)","v":"JEFERSON FORTES LORENZI"},{"$f":"VLOOKUP(A475,Itinerário!$A$3:$I$875,5,FALSE)","v":"DEZEMBRO"},{"$f":"IF(VLOOKUP(A475,Itinerário!$A$3:$I$875,6,FALSE)=0,\"\",VLOOKUP(A475,Itinerário!$A$3:$I$875,6,FALSE))","v":8},"2018-12-08",{"$f":"IF(VLOOKUP(A475,Itinerário!$A$3:$I$875,7,FALSE)=0,\"\",VLOOKUP(A475,Itinerário!$A$3:$I$875,7,FALSE))","v":"Sermão"},{"$f":"IF(VLOOKUP(A475,Itinerário!$A$3:$I$875,8,FALSE)=0,\"\",VLOOKUP(A475,Itinerário!$A$3:$I$875,8,FALSE))","v":"Ingleses"},{"$f":"IF(VLOOKUP(A475,Itinerário!$A$3:$I$875,9,FALSE)=0,\"\",VLOOKUP(A475,Itinerário!$A$3:$I$875,9,FALSE))","v":"Ingleses"}]
[473,{"$f":"VLOOKUP(A476,Itinerário!$A$3:$I$875,3,FALSE)","v":"JEFERSON FORTES LORENZI"},{"$f":"VLOOKUP(A476,Itinerário!$A$3:$I$875,5,FALSE)","v":"DEZEMBRO"},{"$f":"IF(VLOOKUP(A476,Itinerário!$A$3:$I$875,6,FALSE)=0,\"\",VLOOKUP(A476,Itinerário!$A$3:$I$875,6,FALSE))","v":15},"2018-12-15",{"$f":"IF(VLOOKUP(A476,Itinerário!$A$3:$I$875,7,FALSE)=0,\"\",VLOOKUP(A476,Itinerário!$A$3:$I$875,7,FALSE))","v":"Sermão"},{"$f":"IF(VLOOKUP(A476,Itinerário!$A$3:$I$875,8,FALSE)=0,\"\",VLOOKUP(A476,Itinerário!$A$3:$I$875,8,FALSE))","v":"Rio Tavares"},{"$f":"IF(VLOOKUP(A476,Itinerário!$A$3:$I$875,9,FALSE)=0,\"\",VLOOKUP(A476,Itinerário!$A$3:$I$875,9,FALSE))","v":"Rio Tavares"}]
[474,{"$f":"VLOOKUP(A477,Itinerário!$A$3:$I$875,3,FALSE)","v":"JEFERSON FORTES LORENZI"},{"$f":"VLOOKUP(A477,Itinerário!$A$3:$I$875,5,FALSE)","v":"DEZEMBRO"},{"$f":"IF(VLOOKUP(A477,Itinerário!$A$3:$I$875,6,FALSE)=0,\"\",VLOOKUP(A477,Itinerário!$A$3:$I$875,6,FALSE))","v":""},"00:00:00",{"$f":"IF(VLOOKUP(A477,Itinerário!$A$3:$I$875,7,FALSE)=0,\"\",VLOOKUP(A477,Itinerário!$A$3:$I$875,7,FALSE))","v":""},{"$f":"IF(VLOOKUP(A477,Itinerário!$A$3:$I$875,8,FALSE)=0,\"\",VLOOKUP(A477,Itinerário!$A$3:$I$875,8,FALSE))","v":""},{"$f":"IF(VLOOKUP(A477,Itinerário!$A$3:$I$875,9,FALSE)=0,\"\",VLOOKUP(A477,Itinerário!$A$3:$I$875,9,FALSE))","v":""}]
[475,{"$f":"VLOOKUP(A478,Itinerário!$A$3:$I$875,3,FALSE)","v":"JEFERSON FORTES LORENZI"},{"$f":"VLOOKUP(A478,Itinerário!$A$3:$I$875,5,FALSE)","v":"DEZEMBRO"},{"$f":"IF(VLOOKUP(A478,Itinerário!$A$3:$I$875,6,FALSE)=0,\"\",VLOOKUP(A478,Itinerário!$A$3:$I$875,6,FALSE))","v":""},"00:00:00",{"$f":"IF(VLOOKUP(A478,Itinerário!$A$3:$I$875,7,FALSE)=0,\"\",VLOOKUP(A478,Itinerário!$A$3:$I$875,7,FALSE))","v":""},{"$f":"IF(VLOOKUP(A478,Itinerário!$A$3:$I$875,8,FALSE)=0,\"\",VLOOKUP(A478,Itinerário!$A$3:$I$875,8,FALSE))","v":""},{"$f":"IF(VLOOKUP(A478,Itinerário!$A$3:$I$875,9,FALSE)=0,\"\",VLOOKUP(A478,Itinerário!$A$3:$I$875,9,FALSE))","v":""}]
[476,{"$f":"VLOOKUP(A479,Itinerário!$A$3:$I$875,3,FALSE)","v":"JEFERSON FORTES LORENZI"},{"$f":"VLOOKUP(A479,Itinerário!$A$3:$I$875,5,FALSE)","v":"DEZEMBRO"},{"$f":"IF(VLOOKUP(A479,Itinerário!$A$3:$I$875,6,FALSE)=0,\"\",VLOOKUP(A479,Itinerário!$A$3:$I$875,6,FALSE))","v":""},"00:00:00",{"$f":"IF(VLOOKUP(A479,Itinerário!$A$3:$I$875,7,FALSE)=0,\"\",VLOOKUP(A479,Itinerário!$A$3:$I$875,7,FALSE))","v":""},{"$f":"IF(VLOOKUP(A479,Itinerário!$A$3:$I$875,8,FALSE)=0,\"\",VLOOKUP(A479,Itinerário!$A$3:$I$875,8,FALSE))","v":""},{"$f":"IF(VLOOKUP(A479,Itinerário!$A$3:$I$875,9,FALSE)=0,\"\",VLOOKUP(A479,Itinerário!$A$3:$I$875,9,FALSE))","v":""}]
[477,{"$f":"VLOOKUP(A480,Itinerário!$A$3:$I$875,3,FALSE)","v":"JEFERSON FORTES LORENZI"},{"$f":"VLOOKUP(A480,Itinerário!$A$3:$I$875,5,FALSE)","v":"DEZEMBRO"},{"$f":"IF(VLOOKUP(A480,Itinerário!$A$3:$I$875,6,FALSE)=0,\"\",VLOOKUP(A480,Itinerário!$A$3:$I$875,6,FALSE))","v":""},"00:00:00",{"$f":"IF(VLOOKUP(A480,Itinerário!$A$3:$I$875,7,FALSE)=0,\"\",VLOOKUP(A480,Itinerário!$A$3:$I$875,7,FALSE))","v":""},{"$f":"IF(VLOOKUP(A480,Itinerário!$A$3:$I$875,8,FALSE)=0,\"\",VLOOKUP(A480,Itinerário!$A$3:$I$875,8,FALSE))","v":""},{"$f":"IF(VLOOKUP(A480,Itinerário!$A$3:$I$875,9,FALSE)=0,\"\",VLOOKUP(A480,Itinerário!$A$3:$I$875,9,FALSE))","v":""}]
[478,{"$f":"VLOOKUP(A481,Itinerário!$A$3:$I$875,3,FALSE)","v":"JEFERSON FORTES LORENZI"},{"$f":"VLOOKUP(A481,Itinerário!$A$3:$I$875,5,FALSE)","v":"DEZEMBRO"},{"$f":"IF(VLOOKUP(A481,Itinerário!$A$3:$I$875,6,FALSE)=0,\"\",VLOOKUP(A481,Itinerário!$A$3:$I$875,6,FALSE))","v":""},"00:00:00",{"$f":"IF(VLOOKUP(A481,Itinerário!$A$3:$I$875,7,FALSE)=0,\"\",VLOOKUP(A481,Itinerário!$A$3:$I$875,7,FALSE))","v":""},{"$f":"IF(VLOOKUP(A481,Itinerário!$A$3:$I$875,8,FALSE)=0,\"\",VLOOKUP(A481,Itinerário!$A$3:$I$875,8,FALSE))","v":""},{"$f":"IF(VLOOKUP(A481,Itinerário!$A$3:$I$875,9,FALSE)=0,\"\",VLOOKUP(A481,Itinerário!$A$3:$I$875,9,FALSE))","v":""}]
[479,{"$f":"VLOOKUP(A482,Itinerário!$A$3:$I$875,3,FALSE)","v":"JEFERSON FORTES LORENZI"},{"$f":"VLOOKUP(A482,Itinerário!$A$3:$I$875,5,FALSE)","v":"DEZEMBRO"},{"$f":"IF(VLOOKUP(A482,Itinerário!$A$3:$I$875,6,FALSE)=0,\"\",VLOOKUP(A482,Itinerário!$A$3:$I$875,6,FALSE))","v":""},"00:00:00",{"$f":"IF(VLOOKUP(A482,Itinerário!$A$3:$I$875,7,FALSE)=0,\"\",VLOOKUP(A482,Itinerário!$A$3:$I$875,7,FALSE))","v":""},{"$f":"IF(VLOOKUP(A482,Itinerário!$A$3:$I$875,8,FALSE)=0,\"\",VLOOKUP(A482,Itinerário!$A$3:$I$875,8,FALSE))","v":""},{"$f":"IF(VLOOKUP(A482,Itinerário!$A$3:$I$875,9,FALSE)=0,\"\",VLOOKUP(A482,Itinerário!$A$3:$I$875,9,FALSE))","v":""}]
[480,{"$f":"VLOOKUP(A483,Itinerário!$A$3:$I$875,3,FALSE)","v":"JEFERSON FORTES LORENZI"},{"$f":"VLOOKUP(A483,Itinerário!$A$3:$I$875,5,FALSE)","v":"DEZEMBRO"},{"$f":"IF(VLOOKUP(A483,Itinerário!$A$3:$I$875,6,FALSE)=0,\"\",VLOOKUP(A483,Itinerário!$A$3:$I$875,6,FALSE))","v":""},"00:00:00",{"$f":"IF(VLOOKUP(A483,Itinerário!$A$3:$I$875,7,FALSE)=0,\"\",VLOOKUP(A483,Itinerário!$A$3:$I$875,7,FALSE))","v":""},{"$f":"IF(VLOOKUP(A483,Itinerário!$A$3:$I$875,8,FALSE)=0,\"\",VLOOKUP(A483,Itinerário!$A$3:$I$875,8,FALSE))","v":""},{"$f":"IF(VLOOKUP(A483,Itinerário!$A$3:$I$875,9,FALSE)=0,\"\",VLOOKUP(A483,Itinerário!$A$3:$I$875,9,FALSE))","v":""}]
[481,{"$f":"VLOOKUP(A484,Itinerário!$A$3:$I$875,3,FALSE)","v":"JOÃO NICOLAU GONÇALVES"},{"$f":"VLOOKUP(A484,Itinerário!$A$3:$I$875,5,FALSE)","v":"JULHO"},{"$f":"IF(VLOOKUP(A484,Itinerário!$A$3:$I$875,6,FALSE)=0,\"\",VLOOKUP(A484,Itinerário!$A$3:$I$875,6,FALSE))","v":7},"2018-07-07",{"$f":"IF(VLOOKUP(A484,Itinerário!$A$3:$I$875,7,FALSE)=0,\"\",VLOOKUP(A484,Itinerário!$A$3:$I$875,7,FALSE))","v":"Pregação, Treinamento e Visitação"},{"$f":"IF(VLOOKUP(A484,Itinerário!$A$3:$I$875,8,FALSE)=0,\"\",VLOOKUP(A484,Itinerário!$A$3:$I$875,8,FALSE))","v":"Parque Lisboa"},{"$f":"IF(VLOOKUP(A484,Itinerário!$A$3:$I$875,9,FALSE)=0,\"\",VLOOKUP(A484,Itinerário!$A$3:$I$875,9,FALSE))","v":"Parque Lisboa"}]
[482,{"$f":"VLOOKUP(A485,Itinerário!$A$3:$I$875,3,FALSE)","v":"JOÃO NICOLAU GONÇALVES"},{"$f":"VLOOKUP(A485,Itinerário!$A$3:$I$875,5,FALSE)","v":"JULHO"},{"$f":"IF(VLOOKUP(A485,Itinerário!$A$3:$I$875,6,FALSE)=0,\"\",VLOOKUP(A485,Itinerário!$A$3:$I$875,6,FALSE))","v":14},"2018-07-14",{"$f":"IF(VLOOKUP(A485,Itinerário!$A$3:$I$875,7,FALSE)=0,\"\",VLOOKUP(A485,Itinerário!$A$3:$I$875,7,FALSE))","v":"Pregação, Treinamento e Visitação"},{"$f":"IF(VLOOKUP(A485,Itinerário!$A$3:$I$875,8,FALSE)=0,\"\",VLOOKUP(A485,Itinerário!$A$3:$I$875,8,FALSE))","v":"Lageado Baixo"},{"$f":"IF(VLOOKUP(A485,Itinerário!$A$3:$I$875,9,FALSE)=0,\"\",VLOOKUP(A485,Itinerário!$A$3:$I$875,9,FALSE))","v":"Lageado Baixo"}]
[483,{"$f":"VLOOKUP(A486,Itinerário!$A$3:$I$875,3,FALSE)","v":"JOÃO NICOLAU GONÇALVES"},{"$f":"VLOOKUP(A486,Itinerário!$A$3:$I$875,5,FALSE)","v":"JULHO"},{"$f":"IF(VLOOKUP(A486,Itinerário!$A$3:$I$875,6,FALSE)=0,\"\",VLOOKUP(A486,Itinerário!$A$3:$I$875,6,FALSE))","v":21},"2018-07-21",{"$f":"IF(VLOOKUP(A486,Itinerário!$A$3:$I$875,7,FALSE)=0,\"\",VLOOKUP(A486,Itinerário!$A$3:$I$875,7,FALSE))","v":"Férias"},{"$f":"IF(VLOOKUP(A486,Itinerário!$A$3:$I$875,8,FALSE)=0,\"\",VLOOKUP(A486,Itinerário!$A$3:$I$875,8,FALSE))","v":""},{"$f":"IF(VLOOKUP(A486,Itinerário!$A$3:$I$875,9,FALSE)=0,\"\",VLOOKUP(A486,Itinerário!$A$3:$I$875,9,FALSE))","v":""}]
[484,{"$f":"VLOOKUP(A487,Itinerário!$A$3:$I$875,3,FALSE)","v":"JOÃO NICOLAU GONÇALVES"},{"$f":"VLOOKUP(A487,Itinerário!$A$3:$I$875,5,FALSE)","v":"JULHO"},{"$f":"IF(VLOOKUP(A487,Itinerário!$A$3:$I$875,6,FALSE)=0,\"\",VLOOKUP(A487,Itinerário!$A$3:$I$875,6,FALSE))","v":28},"2018-07-28",{"$f":"IF(VLOOKUP(A487,Itinerário!$A$3:$I$875,7,FALSE)=0,\"\",VLOOKUP(A487,Itinerário!$A$3:$I$875,7,FALSE))","v":"Pregação, Treinamento e Visitação"},{"$f":"IF(VLOOKUP(A487,Itinerário!$A$3:$I$875,8,FALSE)=0,\"\",VLOOKUP(A487,Itinerário!$A$3:$I$875,8,FALSE))","v":"Caminho Novo"},{"$f":"IF(VLOOKUP(A487,Itinerário!$A$3:$I$875,9,FALSE)=0,\"\",VLOOKUP(A487,Itinerário!$A$3:$I$875,9,FALSE))","v":"Caminho Novo"}]
[485,{"$f":"VLOOKUP(A488,Itinerário!$A$3:$I$875,3,FALSE)","v":"JOÃO NICOLAU GONÇALVES"},{"$f":"VLOOKUP(A488,Itinerário!$A$3:$I$875,5,FALSE)","v":"JULHO"},{"$f":"IF(VLOOKUP(A488,Itinerário!$A$3:$I$875,6,FALSE)=0,\"\",VLOOKUP(A488,Itinerário!$A$3:$I$875,6,FALSE))","v":""},"00:00:00",{"$f":"IF(VLOOKUP(A488,Itinerário!$A$3:$I$875,7,FALSE)=0,\"\",VLOOKUP(A488,Itinerário!$A$3:$I$875,7,FALSE))","v":""},{"$f":"IF(VLOOKUP(A488,Itinerário!$A$3:$I$875,8,FALSE)=0,\"\",VLOOKUP(A488,Itinerário!$A$3:$I$875,8,FALSE))","v":""},{"$f":"IF(VLOOKUP(A488,Itinerário!$A$3:$I$875,9,FALSE)=0,\"\",VLOOKUP(A488,Itinerário!$A$3:$I$875,9,FALSE))","v":""}]
[486,{"$f":"VLOOKUP(A489,Itinerário!$A$3:$I$875,3,FALSE)","v":"JOÃO NICOLAU GONÇALVES"},{"$f":"VLOOKUP(A489,Itinerário!$A$3:$I$875,5,FALSE)","v":"JULHO"},{"$f":"IF(VLOOKUP(A489,Itinerário!$A$3:$I$875,6,FALSE)=0,\"\",VLOOKUP(A489,Itinerário!$A$3:$I$875,6,FALSE))","v":""},"00:00:00",{"$f":"IF(VLOOKUP(A489,Itinerário!$A$3:$I$875,7,FALSE)=0,\"\",VLOOKUP(A489,Itinerário!$A$3:$I$875,7,FALSE))","v":""},{"$f":"IF(VLOOKUP(A489,Itinerário!$A$3:$I$875,8,FALSE)=0,\"\",VLOOKUP(A489,Itinerário!$A$3:$I$875,8,FALSE))","v":""},{"$f":"IF(VLOOKUP(A489,Itinerário!$A$3:$I$875,9,FALSE)=0,\"\",VLOOKUP(A489,Itinerário!$A$3:$I$875,9,FALSE))","v":""}]
[487,{"$f":"VLOOKUP(A490,Itinerário!$A$3:$I$875,3,FALSE)","v":"JOÃO NICOLAU GONÇALVES"},{"$f":"VLOOKUP(A490,Itinerário!$A$3:$I$875,5,FALSE)","v":"JULHO"},{"$f":"IF(VLOOKUP(A490,Itinerário!$A$3:$I$875,6,FALSE)=0,\"\",VLOOKUP(A490,Itinerário!$A$3:$I$875,6,FALSE))","v":""},"00:00:00",{"$f":"IF(VLOOKUP(A490,Itinerário!$A$3:$I$875,7,FALSE)=0,\"\",VLOOKUP(A490,Itinerário!$A$3:$I$875,7,FALSE))","v":""},{"$f":"IF(VLOOKUP(A490,Itinerário!$A$3:$I$875,8,FALSE)=0,\"\",VLOOKUP(A490,Itinerário!$A$3:$I$875,8,FALSE))","v":""},{"$f":"IF(VLOOKUP(A490,Itinerário!$A$3:$I$875,9,FALSE)=0,\"\",VLOOKUP(A490,Itinerário!$A$3:$I$875,9,FALSE))","v":""}]
[488,{"$f":"VLOOKUP(A491,Itinerário!$A$3:$I$875,3,FALSE)","v":"JOÃO NICOLAU GONÇALVES"},{"$f":"VLOOKUP(A491,Itinerário!$A$3:$I$875,5,FALSE)","v":"JULHO"},{"$f":"IF(VLOOKUP(A491,Itinerário!$A$3:$I$875,6,FALSE)=0,\"\",VLOOKUP(A491,Itinerário!$A$3:$I$875,6,FALSE))","v":""},"00:00:00",{"$f":"IF(VLOOKUP(A491,Itinerário!$A$3:$I$875,7,FALSE)=0,\"\",VLOOKUP(A491,Itinerário!$A$3:$I$875,7,FALSE))","v":""},{"$f":"IF(VLOOKUP(A491,Itinerário!$A$3:$I$875,8,FALSE)=0,\"\",VLOOKUP(A491,Itinerário!$A$3:$I$875,8,FALSE))","v":""},{"$f":"IF(VLOOKUP(A491,Itinerário!$A$3:$I$875,9,FALSE)=0,\"\",VLOOKUP(A491,Itinerário!$A$3:$I$875,9,FALSE))","v":""}]
[489,{"$f":"VLOOKUP(A492,Itinerário!$A$3:$I$875,3,FALSE)","v":"JOÃO NICOLAU GONÇALVES"},{"$f":"VLOOKUP(A492,Itinerário!$A$3:$I$875,5,FALSE)","v":"JULHO"},{"$f":"IF(VLOOKUP(A492,Itinerário!$A$3:$I$875,6,FALSE)=0,\"\",VLOOKUP(A492,Itinerário!$A$3:$I$875,6,FALSE))","v":""},"00:00:00",{"$f":"IF(VLOOKUP(A492,Itinerário!$A$3:$I$875,7,FALSE)=0,\"\",VLOOKUP(A492,Itinerário!$A$3:$I$875,7,FALSE))","v":""},{"$f":"IF(VLOOKUP(A492,Itinerário!$A$3:$I$875,8,FALSE)=0,\"\",VLOOKUP(A492,Itinerário!$A$3:$I$875,8,FALSE))","v":""},{"$f":"IF(VLOOKUP(A492,Itinerário!$A$3:$I$875,9,FALSE)=0,\"\",VLOOKUP(A492,Itinerário!$A$3:$I$875,9,FALSE))","v":""}]
[490,{"$f":"VLOOKUP(A493,Itinerário!$A$3:$I$875,3,FALSE)","v":"JOÃO NICOLAU GONÇALVES"},{"$f":"VLOOKUP(A493,Itinerário!$A$3:$I$875,5,FALSE)","v":"JULHO"},{"$f":"IF(VLOOKUP(A493,Itinerário!$A$3:$I$875,6,FALSE)=0,\"\",VLOOKUP(A493,Itinerário!$A$3:$I$875,6,FALSE))","v":""},"00:00:00",{"$f":"IF(VLOOKUP(A493,Itinerário!$A$3:$I$875,7,FALSE)=0,\"\",VLOOKUP(A493,Itinerário!$A$3:$I$875,7,FALSE))","v":""},{"$f":"IF(VLOOKUP(A493,Itinerário!$A$3:$I$875,8,FALSE)=0,\"\",VLOOKUP(A493,Itinerário!$A$3:$I$875,8,FALSE))","v":""},{"$f":"IF(VLOOKUP(A493,Itinerário!$A$3:$I$875,9,FALSE)=0,\"\",VLOOKUP(A493,Itinerário!$A$3:$I$875,9,FALSE))","v":""}]
[491,{"$f":"VLOOKUP(A494,Itinerário!$A$3:$I$875,3,FALSE)","v":"JOÃO NICOLAU GONÇALVES"},{"$f":"VLOOKUP(A494,Itinerário!$A$3:$I$875,5,FALSE)","v":"AGOSTO"},{"$f":"IF(VLOOKUP(A494,Itinerário!$A$3:$I$875,6,FALSE)=0,\"\",VLOOKUP(A494,Itinerário!$A$3:$I$875,6,FALSE))","v":4},"2018-08-04",{"$f":"IF(VLOOKUP(A494,Itinerário!$A$3:$I$875,7,FALSE)=0,\"\",VLOOKUP(A494,Itinerário!$A$3:$I$875,7,FALSE))","v":"Pregação, Treinamento e Visitação"},{"$f":"IF(VLOOKUP(A494,Itinerário!$A$3:$I$875,8,FALSE)=0,\"\",VLOOKUP(A494,Itinerário!$A$3:$I$875,8,FALSE))","v":"São Joaquim"},{"$f":"IF(VLOOKUP(A494,Itinerário!$A$3:$I$875,9,FALSE)=0,\"\",VLOOKUP(A494,Itinerário!$A$3:$I$875,9,FALSE))","v":"São Joaquim"}]
[492,{"$f":"VLOOKUP(A495,Itinerário!$A$3:$I$875,3,FALSE)","v":"JOÃO NICOLAU GONÇALVES"},{"$f":"VLOOKUP(A495,Itinerário!$A$3:$I$875,5,FALSE)","v":"AGOSTO"},{"$f":"IF(VLOOKUP(A495,Itinerário!$A$3:$I$875,6,FALSE)=0,\"\",VLOOKUP(A495,Itinerário!$A$3:$I$875,6,FALSE))","v":11},"2018-08-11",{"$f":"IF(VLOOKUP(A495,Itinerário!$A$3:$I$875,7,FALSE)=0,\"\",VLOOKUP(A495,Itinerário!$A$3:$I$875,7,FALSE))","v":"Pregação, Treinamento e Visitação"},{"$f":"IF(VLOOKUP(A495,Itinerário!$A$3:$I$875,8,FALSE)=0,\"\",VLOOKUP(A495,Itinerário!$A$3:$I$875,8,FALSE))","v":"Nova Brasília"},{"$f":"IF(VLOOKUP(A495,Itinerário!$A$3:$I$875,9,FALSE)=0,\"\",VLOOKUP(A495,Itinerário!$A$3:$I$875,9,FALSE))","v":"Nova Brasília"}]
[493,{"$f":"VLOOKUP(A496,Itinerário!$A$3:$I$875,3,FALSE)","v":"JOÃO NICOLAU GONÇALVES"},{"$f":"VLOOKUP(A496,Itinerário!$A$3:$I$875,5,FALSE)","v":"AGOSTO"},{"$f":"IF(VLOOKUP(A496,Itinerário!$A$3:$I$875,6,FALSE)=0,\"\",VLOOKUP(A496,Itinerário!$A$3:$I$875,6,FALSE))","v":18},"2018-08-18",{"$f":"IF(VLOOKUP(A496,Itinerário!$A$3:$I$875,7,FALSE)=0,\"\",VLOOKUP(A496,Itinerário!$A$3:$I$875,7,FALSE))","v":"Pregação, Treinamento e Visitação"},{"$f":"IF(VLOOKUP(A496,Itinerário!$A$3:$I$875,8,FALSE)=0,\"\",VLOOKUP(A496,Itinerário!$A$3:$I$875,8,FALSE))","v":"Biguaçu"},{"$f":"IF(VLOOKUP(A496,Itinerário!$A$3:$I$875,9,FALSE)=0,\"\",VLOOKUP(A496,Itinerário!$A$3:$I$875,9,FALSE))","v":"Biguaçu"}]
[494,{"$f":"VLOOKUP(A497,Itinerário!$A$3:$I$875,3,FALSE)","v":"JOÃO NICOLAU GONÇALVES"},{"$f":"VLOOKUP(A497,Itinerário!$A$3:$I$875,5,FALSE)","v":"AGOSTO"},{"$f":"IF(VLOOKUP(A497,Itinerário!$A$3:$I$875,6,FALSE)=0,\"\",VLOOKUP(A497,Itinerário!$A$3:$I$875,6,FALSE))","v":25},"2018-08-25",{"$f":"IF(VLOOKUP(A497,Itinerário!$A$3:$I$875,7,FALSE)=0,\"\",VLOOKUP(A497,Itinerário!$A$3:$I$875,7,FALSE))","v":"Pregação, Treinamento e Visitação"},{"$f":"IF(VLOOKUP(A497,Itinerário!$A$3:$I$875,8,FALSE)=0,\"\",VLOOKUP(A497,Itinerário!$A$3:$I$875,8,FALSE))","v":"Revoredo"},{"$f":"IF(VLOOKUP(A497,Itinerário!$A$3:$I$875,9,FALSE)=0,\"\",VLOOKUP(A497,Itinerário!$A$3:$I$875,9,FALSE))","v":"Revoredo"}]
[495,{"$f":"VLOOKUP(A498,Itinerário!$A$3:$I$875,3,FALSE)","v":"JOÃO NICOLAU GONÇALVES"},{"$f":"VLOOKUP(A498,Itinerário!$A$3:$I$875,5,FALSE)","v":"AGOSTO"},{"$f":"IF(VLOOKUP(A498,Itinerário!$A$3:$I$875,6,FALSE)=0,\"\",VLOOKUP(A498,Itinerário!$A$3:$I$875,6,FALSE))","v":""},"00:00:00",{"$f":"IF(VLOOKUP(A498,Itinerário!$A$3:$I$875,7,FALSE)=0,\"\",VLOOKUP(A498,Itinerário!$A$3:$I$875,7,FALSE))","v":""},{"$f":"IF(VLOOKUP(A498,Itinerário!$A$3:$I$875,8,FALSE)=0,\"\",VLOOKUP(A498,Itinerário!$A$3:$I$875,8,FALSE))","v":""},{"$f":"IF(VLOOKUP(A498,Itinerário!$A$3:$I$875,9,FALSE)=0,\"\",VLOOKUP(A498,Itinerário!$A$3:$I$875,9,FALSE))","v":""}]
[496,{"$f":"VLOOKUP(A499,Itinerário!$A$3:$I$875,3,FALSE)","v":"JOÃO NICOLAU GONÇALVES"},{"$f":"VLOOKUP(A499,Itinerário!$A$3:$I$875,5,FALSE)","v":"AGOSTO"},{"$f":"IF(VLOOKUP(A499,Itinerário!$A$3:$I$875,6,FALSE)=0,\"\",VLOOKUP(A499,Itinerário!$A$3:$I$875,6,FALSE))","v":""},"00:00:00",{"$f":"IF(VLOOKUP(A499,Itinerário!$A$3:$I$875,7,FALSE)=0,\"\",VLOOKUP(A499,Itinerário!$A$3:$I$875,7,FALSE))","v":""},{"$f":"IF(VLOOKUP(A499,Itinerário!$A$3:$I$875,8,FALSE)=0,\"\",VLOOKUP(A499,Itinerário!$A$3:$I$875,8,FALSE))","v":""},{"$f":"IF(VLOOKUP(A499,Itinerário!$A$3:$I$875,9,FALSE)=0,\"\",VLOOKUP(A499,Itinerário!$A$3:$I$875,9,FALSE))","v":""}]
[497,{"$f":"VLOOKUP(A500,Itinerário!$A$3:$I$875,3,FALSE)","v":"JOÃO NICOLAU GONÇALVES"},{"$f":"VLOOKUP(A500,Itinerário!$A$3:$I$875,5,FALSE)","v":"AGOSTO"},{"$f":"IF(VLOOKUP(A500,Itinerário!$A$3:$I$875,6,FALSE)=0,\"\",VLOOKUP(A500,Itinerário!$A$3:$I$875,6,FALSE))","v":""},"00:00:00",{"$f":"IF(VLOOKUP(A500,Itinerário!$A$3:$I$875,7,FALSE)=0,\"\",VLOOKUP(A500,Itinerário!$A$3:$I$875,7,FALSE))","v":""},{"$f":"IF(VLOOKUP(A500,Itinerário!$A$3:$I$875,8,FALSE)=0,\"\",VLOOKUP(A500,Itinerário!$A$3:$I$875,8,FALSE))","v":""},{"$f":"IF(VLOOKUP(A500,Itinerário!$A$3:$I$875,9,FALSE)=0,\"\",VLOOKUP(A500,Itinerário!$A$3:$I$875,9,FALSE))","v":""}]
[498,{"$f":"VLOOKUP(A501,Itinerário!$A$3:$I$875,3,FALSE)","v":"JOÃO NICOLAU GONÇALVES"},{"$f":"VLOOKUP(A501,Itinerário!$A$3:$I$875,5,FALSE)","v":"AGOSTO"},{"$f":"IF(VLOOKUP(A501,Itinerário!$A$3:$I$875,6,FALSE)=0,\"\",VLOOKUP(A501,Itinerário!$A$3:$I$875,6,FALSE))","v":""},"00:00:00",{"$f":"IF(VLOOKUP(A501,Itinerário!$A$3:$I$875,7,FALSE)=0,\"\",VLOOKUP(A501,Itinerário!$A$3:$I$875,7,FALSE))","v":""},{"$f":"IF(VLOOKUP(A501,Itinerário!$A$3:$I$875,8,FALSE)=0,\"\",VLOOKUP(A501,Itinerário!$A$3:$I$875,8,FALSE))","v":""},{"$f":"IF(VLOOKUP(A501,Itinerário!$A$3:$I$875,9,FALSE)=0,\"\",VLOOKUP(A501,Itinerário!$A$3:$I$875,9,FALSE))","v":""}]
[499,{"$f":"VLOOKUP(A502,Itinerário!$A$3:$I$875,3,FALSE)","v":"JOÃO NICOLAU GONÇALVES"},{"$f":"VLOOKUP(A502,Itinerário!$A$3:$I$875,5,FALSE)","v":"AGOSTO"},{"$f":"IF(VLOOKUP(A502,Itinerário!$A$3:$I$875,6,FALSE)=0,\"\",VLOOKUP(A502,Itinerário!$A$3:$I$875,6,FALSE))","v":""},"00:00:00",{"$f":"IF(VLOOKUP(A502,Itinerário!$A$3:$I$875,7,FALSE)=0,\"\",VLOOKUP(A502,Itinerário!$A$3:$I$875,7,FALSE))","v":""},{"$f":"IF(VLOOKUP(A502,Itinerário!$A$3:$I$875,8,FALSE)=0,\"\",VLOOKUP(A502,Itinerário!$A$3:$I$875,8,FALSE))","v":""},{"$f":"IF(VLOOKUP(A502,Itinerário!$A$3:$I$875,9,FALSE)=0,\"\",VLOOKUP(A502,Itinerário!$A$3:$I$875,9,FALSE))","v":""}]
[500,{"$f":"VLOOKUP(A503,Itinerário!$A$3:$I$875,3,FALSE)","v":"JOÃO NICOLAU GONÇALVES"},{"$f":"VLOOKUP(A503,Itinerário!$A$3:$I$875,5,FALSE)","v":"AGOSTO"},{"$f":"IF(VLOOKUP(A503,Itinerário!$A$3:$I$875,6,FALSE)=0,\"\",VLOOKUP(A503,Itinerário!$A$3:$I$875,6,FALSE))","v":""},"00:00:00",{"$f":"IF(VLOOKUP(A503,Itinerário!$A$3:$I$875,7,FALSE)=0,\"\",VLOOKUP(A503,Itinerário!$A$3:$I$875,7,FALSE))","v":""},{"$f":"IF(VLOOKUP(A503,Itinerário!$A$3:$I$875,8,FALSE)=0,\"\",VLOOKUP(A503,Itinerário!$A$3:$I$875,8,FALSE))","v":""},{"$f":"IF(VLOOKUP(A503,Itinerário!$A$3:$I$875,9,FALSE)=0,\"\",VLOOKUP(A503,Itinerário!$A$3:$I$875,9,FALSE))","v":""}]
[501,{"$f":"VLOOKUP(A504,Itinerário!$A$3:$I$875,3,FALSE)","v":"JOÃO NICOLAU GONÇALVES"},{"$f":"VLOOKUP(A504,Itinerário!$A$3:$I$875,5,FALSE)","v":"SETEMBRO"},{"$f":"IF(VLOOKUP(A504,Itinerário!$A$3:$I$875,6,FALSE)=0,\"\",VLOOKUP(A504,Itinerário!$A$3:$I$875,6,FALSE))","v":1},"2018-09-01",{"$f":"IF(VLOOKUP(A504,Itinerário!$A$3:$I$875,7,FALSE)=0,\"\",VLOOKUP(A504,Itinerário!$A$3:$I$875,7,FALSE))","v":"Pregação, Treinamento e Visitação"},{"$f":"IF(VLOOKUP(A504,Itinerário!$A$3:$I$875,8,FALSE)=0,\"\",VLOOKUP(A504,Itinerário!$A$3:$I$875,8,FALSE))","v":"Tubarão"},{"$f":"IF(VLOOKUP(A504,Itinerário!$A$3:$I$875,9,FALSE)=0,\"\",VLOOKUP(A504,Itinerário!$A$3:$I$875,9,FALSE))","v":"Tubarão"}]
[502,{"$f":"VLOOKUP(A505,Itinerário!$A$3:$I$875,3,FALSE)","v":"JOÃO NICOLAU GONÇALVES"},{"$f":"VLOOKUP(A505,Itinerário!$A$3:$I$875,5,FALSE)","v":"SETEMBRO"},{"$f":"IF(VLOOKUP(A505,Itinerário!$A$3:$I$875,6,FALSE)=0,\"\",VLOOKUP(A505,Itinerário!$A$3:$I$875,6,FALSE))","v":8},"2018-09-08",{"$f":"IF(VLOOKUP(A505,Itinerário!$A$3:$I$875,7,FALSE)=0,\"\",VLOOKUP(A505,Itinerário!$A$3:$I$875,7,FALSE))","v":"Pregação, Treinamento e Visitação"},{"$f":"IF(VLOOKUP(A505,Itinerário!$A$3:$I$875,8,FALSE)=0,\"\",VLOOKUP(A505,Itinerário!$A$3:$I$875,8,FALSE))","v":"Lagoa da Conceição"},{"$f":"IF(VLOOKUP(A505,Itinerário!$A$3:$I$875,9,FALSE)=0,\"\",VLOOKUP(A505,Itinerário!$A$3:$I$875,9,FALSE))","v":"Rio Tavares"}]
[503,{"$f":"VLOOKUP(A506,Itinerário!$A$3:$I$875,3,FALSE)","v":"JOÃO NICOLAU GONÇALVES"},{"$f":"VLOOKUP(A506,Itinerário!$A$3:$I$875,5,FALSE)","v":"SETEMBRO"},{"$f":"IF(VLOOKUP(A506,Itinerário!$A$3:$I$875,6,FALSE)=0,\"\",VLOOKUP(A506,Itinerário!$A$3:$I$875,6,FALSE))","v":15},"2018-09-15",{"$f":"IF(VLOOKUP(A506,Itinerário!$A$3:$I$875,7,FALSE)=0,\"\",VLOOKUP(A506,Itinerário!$A$3:$I$875,7,FALSE))","v":"Pregação e Convenção "},{"$f":"IF(VLOOKUP(A506,Itinerário!$A$3:$I$875,8,FALSE)=0,\"\",VLOOKUP(A506,Itinerário!$A$3:$I$875,8,FALSE))","v":"Itapema"},{"$f":"IF(VLOOKUP(A506,Itinerário!$A$3:$I$875,9,FALSE)=0,\"\",VLOOKUP(A506,Itinerário!$A$3:$I$875,9,FALSE))","v":"Itapema"}]
[504,{"$f":"VLOOKUP(A507,Itinerário!$A$3:$I$875,3,FALSE)","v":"JOÃO NICOLAU GONÇALVES"},{"$f":"VLOOKUP(A507,Itinerário!$A$3:$I$875,5,FALSE)","v":"SETEMBRO"},{"$f":"IF(VLOOKUP(A507,Itinerário!$A$3:$I$875,6,FALSE)=0,\"\",VLOOKUP(A507,Itinerário!$A$3:$I$875,6,FALSE))","v":22},"2018-09-22",{"$f":"IF(VLOOKUP(A507,Itinerário!$A$3:$I$875,7,FALSE)=0,\"\",VLOOKUP(A507,Itinerário!$A$3:$I$875,7,FALSE))","v":"Pregação, Treinamento e Visitação"},{"$f":"IF(VLOOKUP(A507,Itinerário!$A$3:$I$875,8,FALSE)=0,\"\",VLOOKUP(A507,Itinerário!$A$3:$I$875,8,FALSE))","v":"Campinas"},{"$f":"IF(VLOOKUP(A507,Itinerário!$A$3:$I$875,9,FALSE)=0,\"\",VLOOKUP(A507,Itinerário!$A$3:$I$875,9,FALSE))","v":"Campinas"}]
[505,{"$f":"VLOOKUP(A508,Itinerário!$A$3:$I$875,3,FALSE)","v":"JOÃO NICOLAU GONÇALVES"},{"$f":"VLOOKUP(A508,Itinerário!$A$3:$I$875,5,FALSE)","v":"SETEMBRO"},{"$f":"IF(VLOOKUP(A508,Itinerário!$A$3:$I$875,6,FALSE)=0,\"\",VLOOKUP(A508,Itinerário!$A$3:$I$875,6,FALSE))","v":29},"2018-09-29",{"$f":"IF(VLOOKUP(A508,Itinerário!$A$3:$I$875,7,FALSE)=0,\"\",VLOOKUP(A508,Itinerário!$A$3:$I$875,7,FALSE))","v":"Pregação e Convenção "},{"$f":"IF(VLOOKUP(A508,Itinerário!$A$3:$I$875,8,FALSE)=0,\"\",VLOOKUP(A508,Itinerário!$A$3:$I$875,8,FALSE))","v":"Bairro dos Municipios"},{"$f":"IF(VLOOKUP(A508,Itinerário!$A$3:$I$875,9,FALSE)=0,\"\",VLOOKUP(A508,Itinerário!$A$3:$I$875,9,FALSE))","v":"Balneário Camboriú"}]
[506,{"$f":"VLOOKUP(A509,Itinerário!$A$3:$I$875,3,FALSE)","v":"JOÃO NICOLAU GONÇALVES"},{"$f":"VLOOKUP(A509,Itinerário!$A$3:$I$875,5,FALSE)","v":"SETEMBRO"},{"$f":"IF(VLOOKUP(A509,Itinerário!$A$3:$I$875,6,FALSE)=0,\"\",VLOOKUP(A509,Itinerário!$A$3:$I$875,6,FALSE))","v":""},"00:00:00",{"$f":"IF(VLOOKUP(A509,Itinerário!$A$3:$I$875,7,FALSE)=0,\"\",VLOOKUP(A509,Itinerário!$A$3:$I$875,7,FALSE))","v":""},{"$f":"IF(VLOOKUP(A509,Itinerário!$A$3:$I$875,8,FALSE)=0,\"\",VLOOKUP(A509,Itinerário!$A$3:$I$875,8,FALSE))","v":""},{"$f":"IF(VLOOKUP(A509,Itinerário!$A$3:$I$875,9,FALSE)=0,\"\",VLOOKUP(A509,Itinerário!$A$3:$I$875,9,FALSE))","v":""}]
[507,{"$f":"VLOOKUP(A510,Itinerário!$A$3:$I$875,3,FALSE)","v":"JOÃO NICOLAU GONÇALVES"},{"$f":"VLOOKUP(A510,Itinerário!$A$3:$I$875,5,FALSE)","v":"SETEMBRO"},{"$f":"IF(VLOOKUP(A510,Itinerário!$A$3:$I$875,6,FALSE)=0,\"\",VLOOKUP(A510,Itinerário!$A$3:$I$875,6,FALSE))","v":""},"00:00:00",{"$f":"IF(VLOOKUP(A510,Itinerário!$A$3:$I$875,7,FALSE)=0,\"\",VLOOKUP(A510,Itinerário!$A$3:$I$875,7,FALSE))","v":""},{"$f":"IF(VLOOKUP(A510,Itinerário!$A$3:$I$875,8,FALSE)=0,\"\",VLOOKUP(A510,Itinerário!$A$3:$I$875,8,FALSE))","v":""},{"$f":"IF(VLOOKUP(A510,Itinerário!$A$3:$I$875,9,FALSE)=0,\"\",VLOOKUP(A510,Itinerário!$A$3:$I$875,9,FALSE))","v":""}]
[508,{"$f":"VLOOKUP(A511,Itinerário!$A$3:$I$875,3,FALSE)","v":"JOÃO NICOLAU GONÇALVES"},{"$f":"VLOOKUP(A511,Itinerário!$A$3:$I$875,5,FALSE)","v":"SETEMBRO"},{"$f":"IF(VLOOKUP(A511,Itinerário!$A$3:$I$875,6,FALSE)=0,\"\",VLOOKUP(A511,Itinerário!$A$3:$I$875,6,FALSE))","v":""},"00:00:00",{"$f":"IF(VLOOKUP(A511,Itinerário!$A$3:$I$875,7,FALSE)=0,\"\",VLOOKUP(A511,Itinerário!$A$3:$I$875,7,FALSE))","v":""},{"$f":"IF(VLOOKUP(A511,Itinerário!$A$3:$I$875,8,FALSE)=0,\"\",VLOOKUP(A511,Itinerário!$A$3:$I$875,8,FALSE))","v":""},{"$f":"IF(VLOOKUP(A511,Itinerário!$A$3:$I$875,9,FALSE)=0,\"\",VLOOKUP(A511,Itinerário!$A$3:$I$875,9,FALSE))","v":""}]
[509,{"$f":"VLOOKUP(A512,Itinerário!$A$3:$I$875,3,FALSE)","v":"JOÃO NICOLAU GONÇALVES"},{"$f":"VLOOKUP(A512,Itinerário!$A$3:$I$875,5,FALSE)","v":"SETEMBRO"},{"$f":"IF(VLOOKUP(A512,Itinerário!$A$3:$I$875,6,FALSE)=0,\"\",VLOOKUP(A512,Itinerário!$A$3:$I$875,6,FALSE))","v":""},"00:00:00",{"$f":"IF(VLOOKUP(A512,Itinerário!$A$3:$I$875,7,FALSE)=0,\"\",VLOOKUP(A512,Itinerário!$A$3:$I$875,7,FALSE))","v":""},{"$f":"IF(VLOOKUP(A512,Itinerário!$A$3:$I$875,8,FALSE)=0,\"\",VLOOKUP(A512,Itinerário!$A$3:$I$875,8,FALSE))","v":""},{"$f":"IF(VLOOKUP(A512,Itinerário!$A$3:$I$875,9,FALSE)=0,\"\",VLOOKUP(A512,Itinerário!$A$3:$I$875,9,FALSE))","v":""}]
[510,{"$f":"VLOOKUP(A513,Itinerário!$A$3:$I$875,3,FALSE)","v":"JOÃO NICOLAU GONÇALVES"},{"$f":"VLOOKUP(A513,Itinerário!$A$3:$I$875,5,FALSE)","v":"SETEMBRO"},{"$f":"IF(VLOOKUP(A513,Itinerário!$A$3:$I$875,6,FALSE)=0,\"\",VLOOKUP(A513,Itinerário!$A$3:$I$875,6,FALSE))","v":""},"00:00:00",{"$f":"IF(VLOOKUP(A513,Itinerário!$A$3:$I$875,7,FALSE)=0,\"\",VLOOKUP(A513,Itinerário!$A$3:$I$875,7,FALSE))","v":""},{"$f":"IF(VLOOKUP(A513,Itinerário!$A$3:$I$875,8,FALSE)=0,\"\",VLOOKUP(A513,Itinerário!$A$3:$I$875,8,FALSE))","v":""},{"$f":"IF(VLOOKUP(A513,Itinerário!$A$3:$I$875,9,FALSE)=0,\"\",VLOOKUP(A513,Itinerário!$A$3:$I$875,9,FALSE))","v":""}]
[511,{"$f":"VLOOKUP(A514,Itinerário!$A$3:$I$875,3,FALSE)","v":"JOÃO NICOLAU GONÇALVES"},{"$f":"VLOOKUP(A514,Itinerário!$A$3:$I$875,5,FALSE)","v":"OUTUBRO"},{"$f":"IF(VLOOKUP(A514,Itinerário!$A$3:$I$875,6,FALSE)=0,\"\",VLOOKUP(A514,Itinerário!$A$3:$I$875,6,FALSE))","v":6},"2018-10-06",{"$f":"IF(VLOOKUP(A514,Itinerário!$A$3:$I$875,7,FALSE)=0,\"\",VLOOKUP(A514,Itinerário!$A$3:$I$875,7,FALSE))","v":"Pregação, Treinamento e Visitação"},{"$f":"IF(VLOOKUP(A514,Itinerário!$A$3:$I$875,8,FALSE)=0,\"\",VLOOKUP(A514,Itinerário!$A$3:$I$875,8,FALSE))","v":"Limoeiro"},{"$f":"IF(VLOOKUP(A514,Itinerário!$A$3:$I$875,9,FALSE)=0,\"\",VLOOKUP(A514,Itinerário!$A$3:$I$875,9,FALSE))","v":"Limoeiro"}]
[512,{"$f":"VLOOKUP(A515,Itinerário!$A$3:$I$875,3,FALSE)","v":"JOÃO NICOLAU GONÇALVES"},{"$f":"VLOOKUP(A515,Itinerário!$A$3:$I$875,5,FALSE)","v":"OUTUBRO"},{"$f":"IF(VLOOKUP(A515,Itinerário!$A$3:$I$875,6,FALSE)=0,\"\",VLOOKUP(A515,Itinerário!$A$3:$I$875,6,FALSE))","v":13},"2018-10-13",{"$f":"IF(VLOOKUP(A515,Itinerário!$A$3:$I$875,7,FALSE)=0,\"\",VLOOKUP(A515,Itinerário!$A$3:$I$875,7,FALSE))","v":"Pregação, Treinamento e Visitação"},{"$f":"IF(VLOOKUP(A515,Itinerário!$A$3:$I$875,8,FALSE)=0,\"\",VLOOKUP(A515,Itinerário!$A$3:$I$875,8,FALSE))","v":"Bom Retiro"},{"$f":"IF(VLOOKUP(A515,Itinerário!$A$3:$I$875,9,FALSE)=0,\"\",VLOOKUP(A515,Itinerário!$A$3:$I$875,9,FALSE))","v":"Bom Retiro"}]
[513,{"$f":"VLOOKUP(A516,Itinerário!$A$3:$I$875,3,FALSE)","v":"JOÃO NICOLAU GONÇALVES"},{"$f":"VLOOKUP(A516,Itinerário!$A$3:$I$875,5,FALSE)","v":"OUTUBRO"},{"$f":"IF(VLOOKUP(A516,Itinerário!$A$3:$I$875,6,FALSE)=0,\"\",VLOOKUP(A516,Itinerário!$A$3:$I$875,6,FALSE))","v":20},{"$f":"IFERROR(DATE(RIGHT($B$2,4),VLOOKUP(C516,$J$4:$K$15,2,FALSE),D516),0)","v":"2018-10-20"},{"$f":"IF(VLOOKUP(A516,Itinerário!$A$3:$I$875,7,FALSE)=0,\"\",VLOOKUP(A516,Itinerário!$A$3:$I$875,7,FALSE))","v":"Pregação Planta Maluche"},{"$f":"IF(VLOOKUP(A516,Itinerário!$A$3:$I$875,8,FALSE)=0,\"\",VLOOKUP(A516,Itinerário!$A$3:$I$875,8,FALSE))","v":"Planta Maluche"},{"$f":"IF(VLOOKUP(A516,Itinerário!$A$3:$I$875,9,FALSE)=0,\"\",VLOOKUP(A516,Itinerário!$A$3:$I$875,9,FALSE))","v":"Brusque"}]
[514,{"$f":"VLOOKUP(A517,Itinerário!$A$3:$I$875,3,FALSE)","v":"JOÃO NICOLAU GONÇALVES"},{"$f":"VLOOKUP(A517,Itinerário!$A$3:$I$875,5,FALSE)","v":"OUTUBRO"},{"$f":"IF(VLOOKUP(A517,Itinerário!$A$3:$I$875,6,FALSE)=0,\"\",VLOOKUP(A517,Itinerário!$A$3:$I$875,6,FALSE))","v":27},"2018-10-27",{"$f":"IF(VLOOKUP(A517,Itinerário!$A$3:$I$875,7,FALSE)=0,\"\",VLOOKUP(A517,Itinerário!$A$3:$I$875,7,FALSE))","v":"Pregação e Convenção "},{"$f":"IF(VLOOKUP(A517,Itinerário!$A$3:$I$875,8,FALSE)=0,\"\",VLOOKUP(A517,Itinerário!$A$3:$I$875,8,FALSE))","v":"Navegantes"},{"$f":"IF(VLOOKUP(A517,Itinerário!$A$3:$I$875,9,FALSE)=0,\"\",VLOOKUP(A517,Itinerário!$A$3:$I$875,9,FALSE))","v":"Navegantes"}]
[515,{"$f":"VLOOKUP(A518,Itinerário!$A$3:$I$875,3,FALSE)","v":"JOÃO NICOLAU GONÇALVES"},{"$f":"VLOOKUP(A518,Itinerário!$A$3:$I$875,5,FALSE)","v":"OUTUBRO"},{"$f":"IF(VLOOKUP(A518,Itinerário!$A$3:$I$875,6,FALSE)=0,\"\",VLOOKUP(A518,Itinerário!$A$3:$I$875,6,FALSE))","v":""},"00:00:00",{"$f":"IF(VLOOKUP(A518,Itinerário!$A$3:$I$875,7,FALSE)=0,\"\",VLOOKUP(A518,Itinerário!$A$3:$I$875,7,FALSE))","v":""},{"$f":"IF(VLOOKUP(A518,Itinerário!$A$3:$I$875,8,FALSE)=0,\"\",VLOOKUP(A518,Itinerário!$A$3:$I$875,8,FALSE))","v":""},{"$f":"IF(VLOOKUP(A518,Itinerário!$A$3:$I$875,9,FALSE)=0,\"\",VLOOKUP(A518,Itinerário!$A$3:$I$875,9,FALSE))","v":""}]
[516,{"$f":"VLOOKUP(A519,Itinerário!$A$3:$I$875,3,FALSE)","v":"JOÃO NICOLAU GONÇALVES"},{"$f":"VLOOKUP(A519,Itinerário!$A$3:$I$875,5,FALSE)","v":"OUTUBRO"},{"$f":"IF(VLOOKUP(A519,Itinerário!$A$3:$I$875,6,FALSE)=0,\"\",VLOOKUP(A519,Itinerário!$A$3:$I$875,6,FALSE))","v":""},"00:00:00",{"$f":"IF(VLOOKUP(A519,Itinerário!$A$3:$I$875,7,FALSE)=0,\"\",VLOOKUP(A519,Itinerário!$A$3:$I$875,7,FALSE))","v":""},{"$f":"IF(VLOOKUP(A519,Itinerário!$A$3:$I$875,8,FALSE)=0,\"\",VLOOKUP(A519,Itinerário!$A$3:$I$875,8,FALSE))","v":""},{"$f":"IF(VLOOKUP(A519,Itinerário!$A$3:$I$875,9,FALSE)=0,\"\",VLOOKUP(A519,Itinerário!$A$3:$I$875,9,FALSE))","v":""}]
[517,{"$f":"VLOOKUP(A520,Itinerário!$A$3:$I$875,3,FALSE)","v":"JOÃO NICOLAU GONÇALVES"},{"$f":"VLOOKUP(A520,Itinerário!$A$3:$I$875,5,FALSE)","v":"OUTUBRO"},{"$f":"IF(VLOOKUP(A520,Itinerário!$A$3:$I$875,6,FALSE)=0,\"\",VLOOKUP(A520,Itinerário!$A$3:$I$875,6,FALSE))","v":""},"00:00:00",{"$f":"IF(VLOOKUP(A520,Itinerário!$A$3:$I$875,7,FALSE)=0,\"\",VLOOKUP(A520,Itinerário!$A$3:$I$875,7,FALSE))","v":""},{"$f":"IF(VLOOKUP(A520,Itinerário!$A$3:$I$875,8,FALSE)=0,\"\",VLOOKUP(A520,Itinerário!$A$3:$I$875,8,FALSE))","v":""},{"$f":"IF(VLOOKUP(A520,Itinerário!$A$3:$I$875,9,FALSE)=0,\"\",VLOOKUP(A520,Itinerário!$A$3:$I$875,9,FALSE))","v":""}]
[518,{"$f":"VLOOKUP(A521,Itinerário!$A$3:$I$875,3,FALSE)","v":"JOÃO NICOLAU GONÇALVES"},{"$f":"VLOOKUP(A521,Itinerário!$A$3:$I$875,5,FALSE)","v":"OUTUBRO"},{"$f":"IF(VLOOKUP(A521,Itinerário!$A$3:$I$875,6,FALSE)=0,\"\",VLOOKUP(A521,Itinerário!$A$3:$I$875,6,FALSE))","v":""},"00:00:00",{"$f":"IF(VLOOKUP(A521,Itinerário!$A$3:$I$875,7,FALSE)=0,\"\",VLOOKUP(A521,Itinerário!$A$3:$I$875,7,FALSE))","v":""},{"$f":"IF(VLOOKUP(A521,Itinerário!$A$3:$I$875,8,FALSE)=0,\"\",VLOOKUP(A521,Itinerário!$A$3:$I$875,8,FALSE))","v":""},{"$f":"IF(VLOOKUP(A521,Itinerário!$A$3:$I$875,9,FALSE)=0,\"\",VLOOKUP(A521,Itinerário!$A$3:$I$875,9,FALSE))","v":""}]
[519,{"$f":"VLOOKUP(A522,Itinerário!$A$3:$I$875,3,FALSE)","v":"JOÃO NICOLAU GONÇALVES"},{"$f":"VLOOKUP(A522,Itinerário!$A$3:$I$875,5,FALSE)","v":"OUTUBRO"},{"$f":"IF(VLOOKUP(A522,Itinerário!$A$3:$I$875,6,FALSE)=0,\"\",VLOOKUP(A522,Itinerário!$A$3:$I$875,6,FALSE))","v":""},"00:00:00",{"$f":"IF(VLOOKUP(A522,Itinerário!$A$3:$I$875,7,FALSE)=0,\"\",VLOOKUP(A522,Itinerário!$A$3:$I$875,7,FALSE))","v":""},{"$f":"IF(VLOOKUP(A522,Itinerário!$A$3:$I$875,8,FALSE)=0,\"\",VLOOKUP(A522,Itinerário!$A$3:$I$875,8,FALSE))","v":""},{"$f":"IF(VLOOKUP(A522,Itinerário!$A$3:$I$875,9,FALSE)=0,\"\",VLOOKUP(A522,Itinerário!$A$3:$I$875,9,FALSE))","v":""}]
[520,{"$f":"VLOOKUP(A523,Itinerário!$A$3:$I$875,3,FALSE)","v":"JOÃO NICOLAU GONÇALVES"},{"$f":"VLOOKUP(A523,Itinerário!$A$3:$I$875,5,FALSE)","v":"OUTUBRO"},{"$f":"IF(VLOOKUP(A523,Itinerário!$A$3:$I$875,6,FALSE)=0,\"\",VLOOKUP(A523,Itinerário!$A$3:$I$875,6,FALSE))","v":""},"00:00:00",{"$f":"IF(VLOOKUP(A523,Itinerário!$A$3:$I$875,7,FALSE)=0,\"\",VLOOKUP(A523,Itinerário!$A$3:$I$875,7,FALSE))","v":""},{"$f":"IF(VLOOKUP(A523,Itinerário!$A$3:$I$875,8,FALSE)=0,\"\",VLOOKUP(A523,Itinerário!$A$3:$I$875,8,FALSE))","v":""},{"$f":"IF(VLOOKUP(A523,Itinerário!$A$3:$I$875,9,FALSE)=0,\"\",VLOOKUP(A523,Itinerário!$A$3:$I$875,9,FALSE))","v":""}]
[521,{"$f":"VLOOKUP(A524,Itinerário!$A$3:$I$875,3,FALSE)","v":"JOÃO NICOLAU GONÇALVES"},{"$f":"VLOOKUP(A524,Itinerário!$A$3:$I$875,5,FALSE)","v":"NOVEMBRO"},{"$f":"IF(VLOOKUP(A524,Itinerário!$A$3:$I$875,6,FALSE)=0,\"\",VLOOKUP(A524,Itinerário!$A$3:$I$875,6,FALSE))","v":3},"2018-11-03",{"$f":"IF(VLOOKUP(A524,Itinerário!$A$3:$I$875,7,FALSE)=0,\"\",VLOOKUP(A524,Itinerário!$A$3:$I$875,7,FALSE))","v":"Pregação, Treinamento e Visitação"},{"$f":"IF(VLOOKUP(A524,Itinerário!$A$3:$I$875,8,FALSE)=0,\"\",VLOOKUP(A524,Itinerário!$A$3:$I$875,8,FALSE))","v":"Estreito"},{"$f":"IF(VLOOKUP(A524,Itinerário!$A$3:$I$875,9,FALSE)=0,\"\",VLOOKUP(A524,Itinerário!$A$3:$I$875,9,FALSE))","v":"Estreito"}]
[522,{"$f":"VLOOKUP(A525,Itinerário!$A$3:$I$875,3,FALSE)","v":"JOÃO NICOLAU GONÇALVES"},{"$f":"VLOOKUP(A525,Itinerário!$A$3:$I$875,5,FALSE)","v":"NOVEMBRO"},{"$f":"IF(VLOOKUP(A525,Itinerário!$A$3:$I$875,6,FALSE)=0,\"\",VLOOKUP(A525,Itinerário!$A$3:$I$875,6,FALSE))","v":10},"2018-11-10",{"$f":"IF(VLOOKUP(A525,Itinerário!$A$3:$I$875,7,FALSE)=0,\"\",VLOOKUP(A525,Itinerário!$A$3:$I$875,7,FALSE))","v":"Impacto Criciúma"},{"$f":"IF(VLOOKUP(A525,Itinerário!$A$3:$I$875,8,FALSE)=0,\"\",VLOOKUP(A525,Itinerário!$A$3:$I$875,8,FALSE))","v":"AC"},{"$f":"IF(VLOOKUP(A525,Itinerário!$A$3:$I$875,9,FALSE)=0,\"\",VLOOKUP(A525,Itinerário!$A$3:$I$875,9,FALSE))","v":"AC"}]
[523,{"$f":"VLOOKUP(A526,Itinerário!$A$3:$I$875,3,FALSE)","v":"JOÃO NICOLAU GONÇALVES"},{"$f":"VLOOKUP(A526,Itinerário!$A$3:$I$875,5,FALSE)","v":"NOVEMBRO"},{"$f":"IF(VLOOKUP(A526,Itinerário!$A$3:$I$875,6,FALSE)=0,\"\",VLOOKUP(A526,Itinerário!$A$3:$I$875,6,FALSE))","v":17},"2018-11-17",{"$f":"IF(VLOOKUP(A526,Itinerário!$A$3:$I$875,7,FALSE)=0,\"\",VLOOKUP(A526,Itinerário!$A$3:$I$875,7,FALSE))","v":"Pregação, Treinamento e Visitação"},{"$f":"IF(VLOOKUP(A526,Itinerário!$A$3:$I$875,8,FALSE)=0,\"\",VLOOKUP(A526,Itinerário!$A$3:$I$875,8,FALSE))","v":"Santa Helena"},{"$f":"IF(VLOOKUP(A526,Itinerário!$A$3:$I$875,9,FALSE)=0,\"\",VLOOKUP(A526,Itinerário!$A$3:$I$875,9,FALSE))","v":"Várzea"}]
[524,{"$f":"VLOOKUP(A527,Itinerário!$A$3:$I$875,3,FALSE)","v":"JOÃO NICOLAU GONÇALVES"},{"$f":"VLOOKUP(A527,Itinerário!$A$3:$I$875,5,FALSE)","v":"NOVEMBRO"},{"$f":"IF(VLOOKUP(A527,Itinerário!$A$3:$I$875,6,FALSE)=0,\"\",VLOOKUP(A527,Itinerário!$A$3:$I$875,6,FALSE))","v":24},"2018-11-24",{"$f":"IF(VLOOKUP(A527,Itinerário!$A$3:$I$875,7,FALSE)=0,\"\",VLOOKUP(A527,Itinerário!$A$3:$I$875,7,FALSE))","v":"Aventuri"},{"$f":"IF(VLOOKUP(A527,Itinerário!$A$3:$I$875,8,FALSE)=0,\"\",VLOOKUP(A527,Itinerário!$A$3:$I$875,8,FALSE))","v":"Canelinha"},{"$f":"IF(VLOOKUP(A527,Itinerário!$A$3:$I$875,9,FALSE)=0,\"\",VLOOKUP(A527,Itinerário!$A$3:$I$875,9,FALSE))","v":"Tijucas"}]
[525,{"$f":"VLOOKUP(A528,Itinerário!$A$3:$I$875,3,FALSE)","v":"JOÃO NICOLAU GONÇALVES"},{"$f":"VLOOKUP(A528,Itinerário!$A$3:$I$875,5,FALSE)","v":"NOVEMBRO"},{"$f":"IF(VLOOKUP(A528,Itinerário!$A$3:$I$875,6,FALSE)=0,\"\",VLOOKUP(A528,Itinerário!$A$3:$I$875,6,FALSE))","v":""},"00:00:00",{"$f":"IF(VLOOKUP(A528,Itinerário!$A$3:$I$875,7,FALSE)=0,\"\",VLOOKUP(A528,Itinerário!$A$3:$I$875,7,FALSE))","v":""},{"$f":"IF(VLOOKUP(A528,Itinerário!$A$3:$I$875,8,FALSE)=0,\"\",VLOOKUP(A528,Itinerário!$A$3:$I$875,8,FALSE))","v":""},{"$f":"IF(VLOOKUP(A528,Itinerário!$A$3:$I$875,9,FALSE)=0,\"\",VLOOKUP(A528,Itinerário!$A$3:$I$875,9,FALSE))","v":""}]
[526,{"$f":"VLOOKUP(A529,Itinerário!$A$3:$I$875,3,FALSE)","v":"JOÃO NICOLAU GONÇALVES"},{"$f":"VLOOKUP(A529,Itinerário!$A$3:$I$875,5,FALSE)","v":"NOVEMBRO"},{"$f":"IF(VLOOKUP(A529,Itinerário!$A$3:$I$875,6,FALSE)=0,\"\",VLOOKUP(A529,Itinerário!$A$3:$I$875,6,FALSE))","v":""},"00:00:00",{"$f":"IF(VLOOKUP(A529,Itinerário!$A$3:$I$875,7,FALSE)=0,\"\",VLOOKUP(A529,Itinerário!$A$3:$I$875,7,FALSE))","v":""},{"$f":"IF(VLOOKUP(A529,Itinerário!$A$3:$I$875,8,FALSE)=0,\"\",VLOOKUP(A529,Itinerário!$A$3:$I$875,8,FALSE))","v":""},{"$f":"IF(VLOOKUP(A529,Itinerário!$A$3:$I$875,9,FALSE)=0,\"\",VLOOKUP(A529,Itinerário!$A$3:$I$875,9,FALSE))","v":""}]
[527,{"$f":"VLOOKUP(A530,Itinerário!$A$3:$I$875,3,FALSE)","v":"JOÃO NICOLAU GONÇALVES"},{"$f":"VLOOKUP(A530,Itinerário!$A$3:$I$875,5,FALSE)","v":"NOVEMBRO"},{"$f":"IF(VLOOKUP(A530,Itinerário!$A$3:$I$875,6,FALSE)=0,\"\",VLOOKUP(A530,Itinerário!$A$3:$I$875,6,FALSE))","v":""},"00:00:00",{"$f":"IF(VLOOKUP(A530,Itinerário!$A$3:$I$875,7,FALSE)=0,\"\",VLOOKUP(A530,Itinerário!$A$3:$I$875,7,FALSE))","v":""},{"$f":"IF(VLOOKUP(A530,Itinerário!$A$3:$I$875,8,FALSE)=0,\"\",VLOOKUP(A530,Itinerário!$A$3:$I$875,8,FALSE))","v":""},{"$f":"IF(VLOOKUP(A530,Itinerário!$A$3:$I$875,9,FALSE)=0,\"\",VLOOKUP(A530,Itinerário!$A$3:$I$875,9,FALSE))","v":""}]
[528,{"$f":"VLOOKUP(A531,Itinerário!$A$3:$I$875,3,FALSE)","v":"JOÃO NICOLAU GONÇALVES"},{"$f":"VLOOKUP(A531,Itinerário!$A$3:$I$875,5,FALSE)","v":"NOVEMBRO"},{"$f":"IF(VLOOKUP(A531,Itinerário!$A$3:$I$875,6,FALSE)=0,\"\",VLOOKUP(A531,Itinerário!$A$3:$I$875,6,FALSE))","v":""},"00:00:00",{"$f":"IF(VLOOKUP(A531,Itinerário!$A$3:$I$875,7,FALSE)=0,\"\",VLOOKUP(A531,Itinerário!$A$3:$I$875,7,FALSE))","v":""},{"$f":"IF(VLOOKUP(A531,Itinerário!$A$3:$I$875,8,FALSE)=0,\"\",VLOOKUP(A531,Itinerário!$A$3:$I$875,8,FALSE))","v":""},{"$f":"IF(VLOOKUP(A531,Itinerário!$A$3:$I$875,9,FALSE)=0,\"\",VLOOKUP(A531,Itinerário!$A$3:$I$875,9,FALSE))","v":""}]
[529,{"$f":"VLOOKUP(A532,Itinerário!$A$3:$I$875,3,FALSE)","v":"JOÃO NICOLAU GONÇALVES"},{"$f":"VLOOKUP(A532,Itinerário!$A$3:$I$875,5,FALSE)","v":"NOVEMBRO"},{"$f":"IF(VLOOKUP(A532,Itinerário!$A$3:$I$875,6,FALSE)=0,\"\",VLOOKUP(A532,Itinerário!$A$3:$I$875,6,FALSE))","v":""},"00:00:00",{"$f":"IF(VLOOKUP(A532,Itinerário!$A$3:$I$875,7,FALSE)=0,\"\",VLOOKUP(A532,Itinerário!$A$3:$I$875,7,FALSE))","v":""},{"$f":"IF(VLOOKUP(A532,Itinerário!$A$3:$I$875,8,FALSE)=0,\"\",VLOOKUP(A532,Itinerário!$A$3:$I$875,8,FALSE))","v":""},{"$f":"IF(VLOOKUP(A532,Itinerário!$A$3:$I$875,9,FALSE)=0,\"\",VLOOKUP(A532,Itinerário!$A$3:$I$875,9,FALSE))","v":""}]
[530,{"$f":"VLOOKUP(A533,Itinerário!$A$3:$I$875,3,FALSE)","v":"JOÃO NICOLAU GONÇALVES"},{"$f":"VLOOKUP(A533,Itinerário!$A$3:$I$875,5,FALSE)","v":"NOVEMBRO"},{"$f":"IF(VLOOKUP(A533,Itinerário!$A$3:$I$875,6,FALSE)=0,\"\",VLOOKUP(A533,Itinerário!$A$3:$I$875,6,FALSE))","v":""},"00:00:00",{"$f":"IF(VLOOKUP(A533,Itinerário!$A$3:$I$875,7,FALSE)=0,\"\",VLOOKUP(A533,Itinerário!$A$3:$I$875,7,FALSE))","v":""},{"$f":"IF(VLOOKUP(A533,Itinerário!$A$3:$I$875,8,FALSE)=0,\"\",VLOOKUP(A533,Itinerário!$A$3:$I$875,8,FALSE))","v":""},{"$f":"IF(VLOOKUP(A533,Itinerário!$A$3:$I$875,9,FALSE)=0,\"\",VLOOKUP(A533,Itinerário!$A$3:$I$875,9,FALSE))","v":""}]
[531,{"$f":"VLOOKUP(A534,Itinerário!$A$3:$I$875,3,FALSE)","v":"JOÃO NICOLAU GONÇALVES"},{"$f":"VLOOKUP(A534,Itinerário!$A$3:$I$875,5,FALSE)","v":"DEZEMBRO"},{"$f":"IF(VLOOKUP(A534,Itinerário!$A$3:$I$875,6,FALSE)=0,\"\",VLOOKUP(A534,Itinerário!$A$3:$I$875,6,FALSE))","v":1},"2018-12-01",{"$f":"IF(VLOOKUP(A534,Itinerário!$A$3:$I$875,7,FALSE)=0,\"\",VLOOKUP(A534,Itinerário!$A$3:$I$875,7,FALSE))","v":"Pregação, Treinamento e Visitação"},{"$f":"IF(VLOOKUP(A534,Itinerário!$A$3:$I$875,8,FALSE)=0,\"\",VLOOKUP(A534,Itinerário!$A$3:$I$875,8,FALSE))","v":"Laguna"},{"$f":"IF(VLOOKUP(A534,Itinerário!$A$3:$I$875,9,FALSE)=0,\"\",VLOOKUP(A534,Itinerário!$A$3:$I$875,9,FALSE))","v":"Laguna"}]
[532,{"$f":"VLOOKUP(A535,Itinerário!$A$3:$I$875,3,FALSE)","v":"JOÃO NICOLAU GONÇALVES"},{"$f":"VLOOKUP(A535,Itinerário!$A$3:$I$875,5,FALSE)","v":"DEZEMBRO"},{"$f":"IF(VLOOKUP(A535,Itinerário!$A$3:$I$875,6,FALSE)=0,\"\",VLOOKUP(A535,Itinerário!$A$3:$I$875,6,FALSE))","v":8},"2018-12-08",{"$f":"IF(VLOOKUP(A535,Itinerário!$A$3:$I$875,7,FALSE)=0,\"\",VLOOKUP(A535,Itinerário!$A$3:$I$875,7,FALSE))","v":"Pregação"},{"$f":"IF(VLOOKUP(A535,Itinerário!$A$3:$I$875,8,FALSE)=0,\"\",VLOOKUP(A535,Itinerário!$A$3:$I$875,8,FALSE))","v":"Primavera"},{"$f":"IF(VLOOKUP(A535,Itinerário!$A$3:$I$875,9,FALSE)=0,\"\",VLOOKUP(A535,Itinerário!$A$3:$I$875,9,FALSE))","v":"Universitário"}]
[533,{"$f":"VLOOKUP(A536,Itinerário!$A$3:$I$875,3,FALSE)","v":"JOÃO NICOLAU GONÇALVES"},{"$f":"VLOOKUP(A536,Itinerário!$A$3:$I$875,5,FALSE)","v":"DEZEMBRO"},{"$f":"IF(VLOOKUP(A536,Itinerário!$A$3:$I$875,6,FALSE)=0,\"\",VLOOKUP(A536,Itinerário!$A$3:$I$875,6,FALSE))","v":15},"2018-12-15",{"$f":"IF(VLOOKUP(A536,Itinerário!$A$3:$I$875,7,FALSE)=0,\"\",VLOOKUP(A536,Itinerário!$A$3:$I$875,7,FALSE))","v":"Pregação, Treinamento e Visitação"},{"$f":"IF(VLOOKUP(A536,Itinerário!$A$3:$I$875,8,FALSE)=0,\"\",VLOOKUP(A536,Itinerário!$A$3:$I$875,8,FALSE))","v":"Ingleses"},{"$f":"IF(VLOOKUP(A536,Itinerário!$A$3:$I$875,9,FALSE)=0,\"\",VLOOKUP(A536,Itinerário!$A$3:$I$875,9,FALSE))","v":"Ingleses"}]
[534,{"$f":"VLOOKUP(A537,Itinerário!$A$3:$I$875,3,FALSE)","v":"JOÃO NICOLAU GONÇALVES"},{"$f":"VLOOKUP(A537,Itinerário!$A$3:$I$875,5,FALSE)","v":"DEZEMBRO"},{"$f":"IF(VLOOKUP(A537,Itinerário!$A$3:$I$875,6,FALSE)=0,\"\",VLOOKUP(A537,Itinerário!$A$3:$I$875,6,FALSE))","v":22},"2018-12-22",{"$f":"IF(VLOOKUP(A537,Itinerário!$A$3:$I$875,7,FALSE)=0,\"\",VLOOKUP(A537,Itinerário!$A$3:$I$875,7,FALSE))","v":"Pregação"},{"$f":"IF(VLOOKUP(A537,Itinerário!$A$3:$I$875,8,FALSE)=0,\"\",VLOOKUP(A537,Itinerário!$A$3:$I$875,8,FALSE))","v":"Garopaba"},{"$f":"IF(VLOOKUP(A537,Itinerário!$A$3:$I$875,9,FALSE)=0,\"\",VLOOKUP(A537,Itinerário!$A$3:$I$875,9,FALSE))","v":"Garopaba"}]
[535,{"$f":"VLOOKUP(A538,Itinerário!$A$3:$I$875,3,FALSE)","v":"JOÃO NICOLAU GONÇALVES"},{"$f":"VLOOKUP(A538,Itinerário!$A$3:$I$875,5,FALSE)","v":"DEZEMBRO"},{"$f":"IF(VLOOKUP(A538,Itinerário!$A$3:$I$875,6,FALSE)=0,\"\",VLOOKUP(A538,Itinerário!$A$3:$I$875,6,FALSE))","v":""},"00:00:00",{"$f":"IF(VLOOKUP(A538,Itinerário!$A$3:$I$875,7,FALSE)=0,\"\",VLOOKUP(A538,Itinerário!$A$3:$I$875,7,FALSE))","v":""},{"$f":"IF(VLOOKUP(A538,Itinerário!$A$3:$I$875,8,FALSE)=0,\"\",VLOOKUP(A538,Itinerário!$A$3:$I$875,8,FALSE))","v":""},{"$f":"IF(VLOOKUP(A538,Itinerário!$A$3:$I$875,9,FALSE)=0,\"\",VLOOKUP(A538,Itinerário!$A$3:$I$875,9,FALSE))","v":""}]
[536,{"$f":"VLOOKUP(A539,Itinerário!$A$3:$I$875,3,FALSE)","v":"JOÃO NICOLAU GONÇALVES"},{"$f":"VLOOKUP(A539,Itinerário!$A$3:$I$875,5,FALSE)","v":"DEZEMBRO"},{"$f":"IF(VLOOKUP(A539,Itinerário!$A$3:$I$875,6,FALSE)=0,\"\",VLOOKUP(A539,Itinerário!$A$3:$I$875,6,FALSE))","v":""},"00:00:00",{"$f":"IF(VLOOKUP(A539,Itinerário!$A$3:$I$875,7,FALSE)=0,\"\",VLOOKUP(A539,Itinerário!$A$3:$I$875,7,FALSE))","v":""},{"$f":"IF(VLOOKUP(A539,Itinerário!$A$3:$I$875,8,FALSE)=0,\"\",VLOOKUP(A539,Itinerário!$A$3:$I$875,8,FALSE))","v":""},{"$f":"IF(VLOOKUP(A539,Itinerário!$A$3:$I$875,9,FALSE)=0,\"\",VLOOKUP(A539,Itinerário!$A$3:$I$875,9,FALSE))","v":""}]
[537,{"$f":"VLOOKUP(A540,Itinerário!$A$3:$I$875,3,FALSE)","v":"JOÃO NICOLAU GONÇALVES"},{"$f":"VLOOKUP(A540,Itinerário!$A$3:$I$875,5,FALSE)","v":"DEZEMBRO"},{"$f":"IF(VLOOKUP(A540,Itinerário!$A$3:$I$875,6,FALSE)=0,\"\",VLOOKUP(A540,Itinerário!$A$3:$I$875,6,FALSE))","v":""},"00:00:00",{"$f":"IF(VLOOKUP(A540,Itinerário!$A$3:$I$875,7,FALSE)=0,\"\",VLOOKUP(A540,Itinerário!$A$3:$I$875,7,FALSE))","v":""},{"$f":"IF(VLOOKUP(A540,Itinerário!$A$3:$I$875,8,FALSE)=0,\"\",VLOOKUP(A540,Itinerário!$A$3:$I$875,8,FALSE))","v":""},{"$f":"IF(VLOOKUP(A540,Itinerário!$A$3:$I$875,9,FALSE)=0,\"\",VLOOKUP(A540,Itinerário!$A$3:$I$875,9,FALSE))","v":""}]
[538,{"$f":"VLOOKUP(A541,Itinerário!$A$3:$I$875,3,FALSE)","v":"JOÃO NICOLAU GONÇALVES"},{"$f":"VLOOKUP(A541,Itinerário!$A$3:$I$875,5,FALSE)","v":"DEZEMBRO"},{"$f":"IF(VLOOKUP(A541,Itinerário!$A$3:$I$875,6,FALSE)=0,\"\",VLOOKUP(A541,Itinerário!$A$3:$I$875,6,FALSE))","v":""},"00:00:00",{"$f":"IF(VLOOKUP(A541,Itinerário!$A$3:$I$875,7,FALSE)=0,\"\",VLOOKUP(A541,Itinerário!$A$3:$I$875,7,FALSE))","v":""},{"$f":"IF(VLOOKUP(A541,Itinerário!$A$3:$I$875,8,FALSE)=0,\"\",VLOOKUP(A541,Itinerário!$A$3:$I$875,8,FALSE))","v":""},{"$f":"IF(VLOOKUP(A541,Itinerário!$A$3:$I$875,9,FALSE)=0,\"\",VLOOKUP(A541,Itinerário!$A$3:$I$875,9,FALSE))","v":""}]
[539,{"$f":"VLOOKUP(A542,Itinerário!$A$3:$I$875,3,FALSE)","v":"JOÃO NICOLAU GONÇALVES"},{"$f":"VLOOKUP(A542,Itinerário!$A$3:$I$875,5,FALSE)","v":"DEZEMBRO"},{"$f":"IF(VLOOKUP(A542,Itinerário!$A$3:$I$875,6,FALSE)=0,\"\",VLOOKUP(A542,Itinerário!$A$3:$I$875,6,FALSE))","v":""},"00:00:00",{"$f":"IF(VLOOKUP(A542,Itinerário!$A$3:$I$875,7,FALSE)=0,\"\",VLOOKUP(A542,Itinerário!$A$3:$I$875,7,FALSE))","v":""},{"$f":"IF(VLOOKUP(A542,Itinerário!$A$3:$I$875,8,FALSE)=0,\"\",VLOOKUP(A542,Itinerário!$A$3:$I$875,8,FALSE))","v":""},{"$f":"IF(VLOOKUP(A542,Itinerário!$A$3:$I$875,9,FALSE)=0,\"\",VLOOKUP(A542,Itinerário!$A$3:$I$875,9,FALSE))","v":""}]
[540,{"$f":"VLOOKUP(A543,Itinerário!$A$3:$I$875,3,FALSE)","v":"JOÃO NICOLAU GONÇALVES"},{"$f":"VLOOKUP(A543,Itinerário!$A$3:$I$875,5,FALSE)","v":"DEZEMBRO"},{"$f":"IF(VLOOKUP(A543,Itinerário!$A$3:$I$875,6,FALSE)=0,\"\",VLOOKUP(A543,Itinerário!$A$3:$I$875,6,FALSE))","v":""},"00:00:00",{"$f":"IF(VLOOKUP(A543,Itinerário!$A$3:$I$875,7,FALSE)=0,\"\",VLOOKUP(A543,Itinerário!$A$3:$I$875,7,FALSE))","v":""},{"$f":"IF(VLOOKUP(A543,Itinerário!$A$3:$I$875,8,FALSE)=0,\"\",VLOOKUP(A543,Itinerário!$A$3:$I$875,8,FALSE))","v":""},{"$f":"IF(VLOOKUP(A543,Itinerário!$A$3:$I$875,9,FALSE)=0,\"\",VLOOKUP(A543,Itinerário!$A$3:$I$875,9,FALSE))","v":""}]
[541,{"$f":"VLOOKUP(A544,Itinerário!$A$3:$I$875,3,FALSE)","v":"JOEL MORAIS"},{"$f":"VLOOKUP(A544,Itinerário!$A$3:$I$875,5,FALSE)","v":"JULHO"},{"$f":"IF(VLOOKUP(A544,Itinerário!$A$3:$I$875,6,FALSE)=0,\"\",VLOOKUP(A544,Itinerário!$A$3:$I$875,6,FALSE))","v":1},"2018-07-01",{"$f":"IF(VLOOKUP(A544,Itinerário!$A$3:$I$875,7,FALSE)=0,\"\",VLOOKUP(A544,Itinerário!$A$3:$I$875,7,FALSE))","v":"TREINAMENTO GPS"},{"$f":"IF(VLOOKUP(A544,Itinerário!$A$3:$I$875,8,FALSE)=0,\"\",VLOOKUP(A544,Itinerário!$A$3:$I$875,8,FALSE))","v":"AC"},{"$f":"IF(VLOOKUP(A544,Itinerário!$A$3:$I$875,9,FALSE)=0,\"\",VLOOKUP(A544,Itinerário!$A$3:$I$875,9,FALSE))","v":"AC"}]
[542,{"$f":"VLOOKUP(A545,Itinerário!$A$3:$I$875,3,FALSE)","v":"JOEL MORAIS"},{"$f":"VLOOKUP(A545,Itinerário!$A$3:$I$875,5,FALSE)","v":"JULHO"},{"$f":"IF(VLOOKUP(A545,Itinerário!$A$3:$I$875,6,FALSE)=0,\"\",VLOOKUP(A545,Itinerário!$A$3:$I$875,6,FALSE))","v":7},"2018-07-07",{"$f":"IF(VLOOKUP(A545,Itinerário!$A$3:$I$875,7,FALSE)=0,\"\",VLOOKUP(A545,Itinerário!$A$3:$I$875,7,FALSE))","v":"CATRE"},{"$f":"IF(VLOOKUP(A545,Itinerário!$A$3:$I$875,8,FALSE)=0,\"\",VLOOKUP(A545,Itinerário!$A$3:$I$875,8,FALSE))","v":"CATRE"},{"$f":"IF(VLOOKUP(A545,Itinerário!$A$3:$I$875,9,FALSE)=0,\"\",VLOOKUP(A545,Itinerário!$A$3:$I$875,9,FALSE))","v":"CATRE"}]
[543,{"$f":"VLOOKUP(A546,Itinerário!$A$3:$I$875,3,FALSE)","v":"JOEL MORAIS"},{"$f":"VLOOKUP(A546,Itinerário!$A$3:$I$875,5,FALSE)","v":"JULHO"},{"$f":"IF(VLOOKUP(A546,Itinerário!$A$3:$I$875,6,FALSE)=0,\"\",VLOOKUP(A546,Itinerário!$A$3:$I$875,6,FALSE))","v":14},"2018-07-14",{"$f":"IF(VLOOKUP(A546,Itinerário!$A$3:$I$875,7,FALSE)=0,\"\",VLOOKUP(A546,Itinerário!$A$3:$I$875,7,FALSE))","v":"Investidura "},{"$f":"IF(VLOOKUP(A546,Itinerário!$A$3:$I$875,8,FALSE)=0,\"\",VLOOKUP(A546,Itinerário!$A$3:$I$875,8,FALSE))","v":"Dunas"},{"$f":"IF(VLOOKUP(A546,Itinerário!$A$3:$I$875,9,FALSE)=0,\"\",VLOOKUP(A546,Itinerário!$A$3:$I$875,9,FALSE))","v":"Ingleses"}]
[544,{"$f":"VLOOKUP(A547,Itinerário!$A$3:$I$875,3,FALSE)","v":"JOEL MORAIS"},{"$f":"VLOOKUP(A547,Itinerário!$A$3:$I$875,5,FALSE)","v":"JULHO"},{"$f":"IF(VLOOKUP(A547,Itinerário!$A$3:$I$875,6,FALSE)=0,\"\",VLOOKUP(A547,Itinerário!$A$3:$I$875,6,FALSE))","v":"14-15"},"00:00:00",{"$f":"IF(VLOOKUP(A547,Itinerário!$A$3:$I$875,7,FALSE)=0,\"\",VLOOKUP(A547,Itinerário!$A$3:$I$875,7,FALSE))","v":"Anciori Sul  - Distrital"},{"$f":"IF(VLOOKUP(A547,Itinerário!$A$3:$I$875,8,FALSE)=0,\"\",VLOOKUP(A547,Itinerário!$A$3:$I$875,8,FALSE))","v":""},{"$f":"IF(VLOOKUP(A547,Itinerário!$A$3:$I$875,9,FALSE)=0,\"\",VLOOKUP(A547,Itinerário!$A$3:$I$875,9,FALSE))","v":"São Martinho"}]
[545,{"$f":"VLOOKUP(A548,Itinerário!$A$3:$I$875,3,FALSE)","v":"JOEL MORAIS"},{"$f":"VLOOKUP(A548,Itinerário!$A$3:$I$875,5,FALSE)","v":"JULHO"},{"$f":"IF(VLOOKUP(A548,Itinerário!$A$3:$I$875,6,FALSE)=0,\"\",VLOOKUP(A548,Itinerário!$A$3:$I$875,6,FALSE))","v":15},"2018-07-15",{"$f":"IF(VLOOKUP(A548,Itinerário!$A$3:$I$875,7,FALSE)=0,\"\",VLOOKUP(A548,Itinerário!$A$3:$I$875,7,FALSE))","v":"Reunião de Diretores"},{"$f":"IF(VLOOKUP(A548,Itinerário!$A$3:$I$875,8,FALSE)=0,\"\",VLOOKUP(A548,Itinerário!$A$3:$I$875,8,FALSE))","v":"Imbituba"},{"$f":"IF(VLOOKUP(A548,Itinerário!$A$3:$I$875,9,FALSE)=0,\"\",VLOOKUP(A548,Itinerário!$A$3:$I$875,9,FALSE))","v":"Imbituba"}]
[546,{"$f":"VLOOKUP(A549,Itinerário!$A$3:$I$875,3,FALSE)","v":"JOEL MORAIS"},{"$f":"VLOOKUP(A549,Itinerário!$A$3:$I$875,5,FALSE)","v":"JULHO"},{"$f":"IF(VLOOKUP(A549,Itinerário!$A$3:$I$875,6,FALSE)=0,\"\",VLOOKUP(A549,Itinerário!$A$3:$I$875,6,FALSE))","v":21},"2018-07-21",{"$f":"IF(VLOOKUP(A549,Itinerário!$A$3:$I$875,7,FALSE)=0,\"\",VLOOKUP(A549,Itinerário!$A$3:$I$875,7,FALSE))","v":"Pregação"},{"$f":"IF(VLOOKUP(A549,Itinerário!$A$3:$I$875,8,FALSE)=0,\"\",VLOOKUP(A549,Itinerário!$A$3:$I$875,8,FALSE))","v":"Camboriú"},{"$f":"IF(VLOOKUP(A549,Itinerário!$A$3:$I$875,9,FALSE)=0,\"\",VLOOKUP(A549,Itinerário!$A$3:$I$875,9,FALSE))","v":"Camboriú"}]
[547,{"$f":"VLOOKUP(A550,Itinerário!$A$3:$I$875,3,FALSE)","v":"JOEL MORAIS"},{"$f":"VLOOKUP(A550,Itinerário!$A$3:$I$875,5,FALSE)","v":"JULHO"},{"$f":"IF(VLOOKUP(A550,Itinerário!$A$3:$I$875,6,FALSE)=0,\"\",VLOOKUP(A550,Itinerário!$A$3:$I$875,6,FALSE))","v":28},"2018-07-28",{"$f":"IF(VLOOKUP(A550,Itinerário!$A$3:$I$875,7,FALSE)=0,\"\",VLOOKUP(A550,Itinerário!$A$3:$I$875,7,FALSE))","v":"Congresso Mundial"},{"$f":"IF(VLOOKUP(A550,Itinerário!$A$3:$I$875,8,FALSE)=0,\"\",VLOOKUP(A550,Itinerário!$A$3:$I$875,8,FALSE))","v":"Kussel"},{"$f":"IF(VLOOKUP(A550,Itinerário!$A$3:$I$875,9,FALSE)=0,\"\",VLOOKUP(A550,Itinerário!$A$3:$I$875,9,FALSE))","v":"Alemanha"}]
[548,{"$f":"VLOOKUP(A551,Itinerário!$A$3:$I$875,3,FALSE)","v":"JOEL MORAIS"},{"$f":"VLOOKUP(A551,Itinerário!$A$3:$I$875,5,FALSE)","v":"JULHO"},{"$f":"IF(VLOOKUP(A551,Itinerário!$A$3:$I$875,6,FALSE)=0,\"\",VLOOKUP(A551,Itinerário!$A$3:$I$875,6,FALSE))","v":""},"00:00:00",{"$f":"IF(VLOOKUP(A551,Itinerário!$A$3:$I$875,7,FALSE)=0,\"\",VLOOKUP(A551,Itinerário!$A$3:$I$875,7,FALSE))","v":""},{"$f":"IF(VLOOKUP(A551,Itinerário!$A$3:$I$875,8,FALSE)=0,\"\",VLOOKUP(A551,Itinerário!$A$3:$I$875,8,FALSE))","v":""},{"$f":"IF(VLOOKUP(A551,Itinerário!$A$3:$I$875,9,FALSE)=0,\"\",VLOOKUP(A551,Itinerário!$A$3:$I$875,9,FALSE))","v":""}]
[549,{"$f":"VLOOKUP(A552,Itinerário!$A$3:$I$875,3,FALSE)","v":"JOEL MORAIS"},{"$f":"VLOOKUP(A552,Itinerário!$A$3:$I$875,5,FALSE)","v":"JULHO"},{"$f":"IF(VLOOKUP(A552,Itinerário!$A$3:$I$875,6,FALSE)=0,\"\",VLOOKUP(A552,Itinerário!$A$3:$I$875,6,FALSE))","v":""},"00:00:00",{"$f":"IF(VLOOKUP(A552,Itinerário!$A$3:$I$875,7,FALSE)=0,\"\",VLOOKUP(A552,Itinerário!$A$3:$I$875,7,FALSE))","v":""},{"$f":"IF(VLOOKUP(A552,Itinerário!$A$3:$I$875,8,FALSE)=0,\"\",VLOOKUP(A552,Itinerário!$A$3:$I$875,8,FALSE))","v":""},{"$f":"IF(VLOOKUP(A552,Itinerário!$A$3:$I$875,9,FALSE)=0,\"\",VLOOKUP(A552,Itinerário!$A$3:$I$875,9,FALSE))","v":""}]
[550,{"$f":"VLOOKUP(A553,Itinerário!$A$3:$I$875,3,FALSE)","v":"JOEL MORAIS"},{"$f":"VLOOKUP(A553,Itinerário!$A$3:$I$875,5,FALSE)","v":"JULHO"},{"$f":"IF(VLOOKUP(A553,Itinerário!$A$3:$I$875,6,FALSE)=0,\"\",VLOOKUP(A553,Itinerário!$A$3:$I$875,6,FALSE))","v":""},"00:00:00",{"$f":"IF(VLOOKUP(A553,Itinerário!$A$3:$I$875,7,FALSE)=0,\"\",VLOOKUP(A553,Itinerário!$A$3:$I$875,7,FALSE))","v":""},{"$f":"IF(VLOOKUP(A553,Itinerário!$A$3:$I$875,8,FALSE)=0,\"\",VLOOKUP(A553,Itinerário!$A$3:$I$875,8,FALSE))","v":""},{"$f":"IF(VLOOKUP(A553,Itinerário!$A$3:$I$875,9,FALSE)=0,\"\",VLOOKUP(A553,Itinerário!$A$3:$I$875,9,FALSE))","v":""}]
[551,{"$f":"VLOOKUP(A554,Itinerário!$A$3:$I$875,3,FALSE)","v":"JOEL MORAIS"},{"$f":"VLOOKUP(A554,Itinerário!$A$3:$I$875,5,FALSE)","v":"AGOSTO"},{"$f":"IF(VLOOKUP(A554,Itinerário!$A$3:$I$875,6,FALSE)=0,\"\",VLOOKUP(A554,Itinerário!$A$3:$I$875,6,FALSE))","v":"4 a 11"},"00:00:00",{"$f":"IF(VLOOKUP(A554,Itinerário!$A$3:$I$875,7,FALSE)=0,\"\",VLOOKUP(A554,Itinerário!$A$3:$I$875,7,FALSE))","v":"Congresso Mundial"},{"$f":"IF(VLOOKUP(A554,Itinerário!$A$3:$I$875,8,FALSE)=0,\"\",VLOOKUP(A554,Itinerário!$A$3:$I$875,8,FALSE))","v":"Kussel"},{"$f":"IF(VLOOKUP(A554,Itinerário!$A$3:$I$875,9,FALSE)=0,\"\",VLOOKUP(A554,Itinerário!$A$3:$I$875,9,FALSE))","v":"Alemanha"}]
[552,{"$f":"VLOOKUP(A555,Itinerário!$A$3:$I$875,3,FALSE)","v":"JOEL MORAIS"},{"$f":"VLOOKUP(A555,Itinerário!$A$3:$I$875,5,FALSE)","v":"AGOSTO"},{"$f":"IF(VLOOKUP(A555,Itinerário!$A$3:$I$875,6,FALSE)=0,\"\",VLOOKUP(A555,Itinerário!$A$3:$I$875,6,FALSE))","v":18},"2018-08-18",{"$f":"IF(VLOOKUP(A555,Itinerário!$A$3:$I$875,7,FALSE)=0,\"\",VLOOKUP(A555,Itinerário!$A$3:$I$875,7,FALSE))","v":"1º Hora Pregação"},{"$f":"IF(VLOOKUP(A555,Itinerário!$A$3:$I$875,8,FALSE)=0,\"\",VLOOKUP(A555,Itinerário!$A$3:$I$875,8,FALSE))","v":"Santo Amaro"},{"$f":"IF(VLOOKUP(A555,Itinerário!$A$3:$I$875,9,FALSE)=0,\"\",VLOOKUP(A555,Itinerário!$A$3:$I$875,9,FALSE))","v":"Caminho Novo"}]
[553,{"$f":"VLOOKUP(A556,Itinerário!$A$3:$I$875,3,FALSE)","v":"JOEL MORAIS"},{"$f":"VLOOKUP(A556,Itinerário!$A$3:$I$875,5,FALSE)","v":"AGOSTO"},{"$f":"IF(VLOOKUP(A556,Itinerário!$A$3:$I$875,6,FALSE)=0,\"\",VLOOKUP(A556,Itinerário!$A$3:$I$875,6,FALSE))","v":"18-19"},"00:00:00",{"$f":"IF(VLOOKUP(A556,Itinerário!$A$3:$I$875,7,FALSE)=0,\"\",VLOOKUP(A556,Itinerário!$A$3:$I$875,7,FALSE))","v":"Anciori Norte - Distrital em Itapema"},{"$f":"IF(VLOOKUP(A556,Itinerário!$A$3:$I$875,8,FALSE)=0,\"\",VLOOKUP(A556,Itinerário!$A$3:$I$875,8,FALSE))","v":""},{"$f":"IF(VLOOKUP(A556,Itinerário!$A$3:$I$875,9,FALSE)=0,\"\",VLOOKUP(A556,Itinerário!$A$3:$I$875,9,FALSE))","v":"Itapema"}]
[554,{"$f":"VLOOKUP(A557,Itinerário!$A$3:$I$875,3,FALSE)","v":"JOEL MORAIS"},{"$f":"VLOOKUP(A557,Itinerário!$A$3:$I$875,5,FALSE)","v":"AGOSTO"},{"$f":"IF(VLOOKUP(A557,Itinerário!$A$3:$I$875,6,FALSE)=0,\"\",VLOOKUP(A557,Itinerário!$A$3:$I$875,6,FALSE))","v":25},"2018-08-25",{"$f":"IF(VLOOKUP(A557,Itinerário!$A$3:$I$875,7,FALSE)=0,\"\",VLOOKUP(A557,Itinerário!$A$3:$I$875,7,FALSE))","v":"Pregação "},{"$f":"IF(VLOOKUP(A557,Itinerário!$A$3:$I$875,8,FALSE)=0,\"\",VLOOKUP(A557,Itinerário!$A$3:$I$875,8,FALSE))","v":"Azambuja"},{"$f":"IF(VLOOKUP(A557,Itinerário!$A$3:$I$875,9,FALSE)=0,\"\",VLOOKUP(A557,Itinerário!$A$3:$I$875,9,FALSE))","v":"Brusque"}]
[555,{"$f":"VLOOKUP(A558,Itinerário!$A$3:$I$875,3,FALSE)","v":"JOEL MORAIS"},{"$f":"VLOOKUP(A558,Itinerário!$A$3:$I$875,5,FALSE)","v":"AGOSTO"},{"$f":"IF(VLOOKUP(A558,Itinerário!$A$3:$I$875,6,FALSE)=0,\"\",VLOOKUP(A558,Itinerário!$A$3:$I$875,6,FALSE))","v":26},"2018-08-26",{"$f":"IF(VLOOKUP(A558,Itinerário!$A$3:$I$875,7,FALSE)=0,\"\",VLOOKUP(A558,Itinerário!$A$3:$I$875,7,FALSE))","v":"Olimpori - Distrital"},{"$f":"IF(VLOOKUP(A558,Itinerário!$A$3:$I$875,8,FALSE)=0,\"\",VLOOKUP(A558,Itinerário!$A$3:$I$875,8,FALSE))","v":""},{"$f":"IF(VLOOKUP(A558,Itinerário!$A$3:$I$875,9,FALSE)=0,\"\",VLOOKUP(A558,Itinerário!$A$3:$I$875,9,FALSE))","v":"Brusque"}]
[556,{"$f":"VLOOKUP(A559,Itinerário!$A$3:$I$875,3,FALSE)","v":"JOEL MORAIS"},{"$f":"VLOOKUP(A559,Itinerário!$A$3:$I$875,5,FALSE)","v":"AGOSTO"},{"$f":"IF(VLOOKUP(A559,Itinerário!$A$3:$I$875,6,FALSE)=0,\"\",VLOOKUP(A559,Itinerário!$A$3:$I$875,6,FALSE))","v":26},"2018-08-26",{"$f":"IF(VLOOKUP(A559,Itinerário!$A$3:$I$875,7,FALSE)=0,\"\",VLOOKUP(A559,Itinerário!$A$3:$I$875,7,FALSE))","v":"Comemoração"},{"$f":"IF(VLOOKUP(A559,Itinerário!$A$3:$I$875,8,FALSE)=0,\"\",VLOOKUP(A559,Itinerário!$A$3:$I$875,8,FALSE))","v":"Brilhante II"},{"$f":"IF(VLOOKUP(A559,Itinerário!$A$3:$I$875,9,FALSE)=0,\"\",VLOOKUP(A559,Itinerário!$A$3:$I$875,9,FALSE))","v":"Limoeiro"}]
[557,{"$f":"VLOOKUP(A560,Itinerário!$A$3:$I$875,3,FALSE)","v":"JOEL MORAIS"},{"$f":"VLOOKUP(A560,Itinerário!$A$3:$I$875,5,FALSE)","v":"AGOSTO"},{"$f":"IF(VLOOKUP(A560,Itinerário!$A$3:$I$875,6,FALSE)=0,\"\",VLOOKUP(A560,Itinerário!$A$3:$I$875,6,FALSE))","v":31},"2018-08-31",{"$f":"IF(VLOOKUP(A560,Itinerário!$A$3:$I$875,7,FALSE)=0,\"\",VLOOKUP(A560,Itinerário!$A$3:$I$875,7,FALSE))","v":"II Enduro"},{"$f":"IF(VLOOKUP(A560,Itinerário!$A$3:$I$875,8,FALSE)=0,\"\",VLOOKUP(A560,Itinerário!$A$3:$I$875,8,FALSE))","v":"Grão Pará"},{"$f":"IF(VLOOKUP(A560,Itinerário!$A$3:$I$875,9,FALSE)=0,\"\",VLOOKUP(A560,Itinerário!$A$3:$I$875,9,FALSE))","v":"São Martinho"}]
[558,{"$f":"VLOOKUP(A561,Itinerário!$A$3:$I$875,3,FALSE)","v":"JOEL MORAIS"},{"$f":"VLOOKUP(A561,Itinerário!$A$3:$I$875,5,FALSE)","v":"AGOSTO"},{"$f":"IF(VLOOKUP(A561,Itinerário!$A$3:$I$875,6,FALSE)=0,\"\",VLOOKUP(A561,Itinerário!$A$3:$I$875,6,FALSE))","v":""},"00:00:00",{"$f":"IF(VLOOKUP(A561,Itinerário!$A$3:$I$875,7,FALSE)=0,\"\",VLOOKUP(A561,Itinerário!$A$3:$I$875,7,FALSE))","v":""},{"$f":"IF(VLOOKUP(A561,Itinerário!$A$3:$I$875,8,FALSE)=0,\"\",VLOOKUP(A561,Itinerário!$A$3:$I$875,8,FALSE))","v":""},{"$f":"IF(VLOOKUP(A561,Itinerário!$A$3:$I$875,9,FALSE)=0,\"\",VLOOKUP(A561,Itinerário!$A$3:$I$875,9,FALSE))","v":""}]
[559,{"$f":"VLOOKUP(A562,Itinerário!$A$3:$I$875,3,FALSE)","v":"JOEL MORAIS"},{"$f":"VLOOKUP(A562,Itinerário!$A$3:$I$875,5,FALSE)","v":"AGOSTO"},{"$f":"IF(VLOOKUP(A562,Itinerário!$A$3:$I$875,6,FALSE)=0,\"\",VLOOKUP(A562,Itinerário!$A$3:$I$875,6,FALSE))","v":""},"00:00:00",{"$f":"IF(VLOOKUP(A562,Itinerário!$A$3:$I$875,7,FALSE)=0,\"\",VLOOKUP(A562,Itinerário!$A$3:$I$875,7,FALSE))","v":""},{"$f":"IF(VLOOKUP(A562,Itinerário!$A$3:$I$875,8,FALSE)=0,\"\",VLOOKUP(A562,Itinerário!$A$3:$I$875,8,FALSE))","v":""},{"$f":"IF(VLOOKUP(A562,Itinerário!$A$3:$I$875,9,FALSE)=0,\"\",VLOOKUP(A562,Itinerário!$A$3:$I$875,9,FALSE))","v":""}]
[560,{"$f":"VLOOKUP(A563,Itinerário!$A$3:$I$875,3,FALSE)","v":"JOEL MORAIS"},{"$f":"VLOOKUP(A563,Itinerário!$A$3:$I$875,5,FALSE)","v":"AGOSTO"},{"$f":"IF(VLOOKUP(A563,Itinerário!$A$3:$I$875,6,FALSE)=0,\"\",VLOOKUP(A563,Itinerário!$A$3:$I$875,6,FALSE))","v":""},"00:00:00",{"$f":"IF(VLOOKUP(A563,Itinerário!$A$3:$I$875,7,FALSE)=0,\"\",VLOOKUP(A563,Itinerário!$A$3:$I$875,7,FALSE))","v":""},{"$f":"IF(VLOOKUP(A563,Itinerário!$A$3:$I$875,8,FALSE)=0,\"\",VLOOKUP(A563,Itinerário!$A$3:$I$875,8,FALSE))","v":""},{"$f":"IF(VLOOKUP(A563,Itinerário!$A$3:$I$875,9,FALSE)=0,\"\",VLOOKUP(A563,Itinerário!$A$3:$I$875,9,FALSE))","v":""}]
[561,{"$f":"VLOOKUP(A564,Itinerário!$A$3:$I$875,3,FALSE)","v":"JOEL MORAIS"},{"$f":"VLOOKUP(A564,Itinerário!$A$3:$I$875,5,FALSE)","v":"SETEMBRO"},{"$f":"IF(VLOOKUP(A564,Itinerário!$A$3:$I$875,6,FALSE)=0,\"\",VLOOKUP(A564,Itinerário!$A$3:$I$875,6,FALSE))","v":"1 a 2"},"00:00:00",{"$f":"IF(VLOOKUP(A564,Itinerário!$A$3:$I$875,7,FALSE)=0,\"\",VLOOKUP(A564,Itinerário!$A$3:$I$875,7,FALSE))","v":"II Enduro"},{"$f":"IF(VLOOKUP(A564,Itinerário!$A$3:$I$875,8,FALSE)=0,\"\",VLOOKUP(A564,Itinerário!$A$3:$I$875,8,FALSE))","v":"Grão Pará"},{"$f":"IF(VLOOKUP(A564,Itinerário!$A$3:$I$875,9,FALSE)=0,\"\",VLOOKUP(A564,Itinerário!$A$3:$I$875,9,FALSE))","v":"São Martinho"}]
[562,{"$f":"VLOOKUP(A565,Itinerário!$A$3:$I$875,3,FALSE)","v":"JOEL MORAIS"},{"$f":"VLOOKUP(A565,Itinerário!$A$3:$I$875,5,FALSE)","v":"SETEMBRO"},{"$f":"IF(VLOOKUP(A565,Itinerário!$A$3:$I$875,6,FALSE)=0,\"\",VLOOKUP(A565,Itinerário!$A$3:$I$875,6,FALSE))","v":8},"2018-09-08",{"$f":"IF(VLOOKUP(A565,Itinerário!$A$3:$I$875,7,FALSE)=0,\"\",VLOOKUP(A565,Itinerário!$A$3:$I$875,7,FALSE))","v":"Pregação"},{"$f":"IF(VLOOKUP(A565,Itinerário!$A$3:$I$875,8,FALSE)=0,\"\",VLOOKUP(A565,Itinerário!$A$3:$I$875,8,FALSE))","v":"Porto de Itajaí"},{"$f":"IF(VLOOKUP(A565,Itinerário!$A$3:$I$875,9,FALSE)=0,\"\",VLOOKUP(A565,Itinerário!$A$3:$I$875,9,FALSE))","v":"Espaço Vida e Saúde"}]
[563,{"$f":"VLOOKUP(A566,Itinerário!$A$3:$I$875,3,FALSE)","v":"JOEL MORAIS"},{"$f":"VLOOKUP(A566,Itinerário!$A$3:$I$875,5,FALSE)","v":"SETEMBRO"},{"$f":"IF(VLOOKUP(A566,Itinerário!$A$3:$I$875,6,FALSE)=0,\"\",VLOOKUP(A566,Itinerário!$A$3:$I$875,6,FALSE))","v":9},"2018-09-09",{"$f":"IF(VLOOKUP(A566,Itinerário!$A$3:$I$875,7,FALSE)=0,\"\",VLOOKUP(A566,Itinerário!$A$3:$I$875,7,FALSE))","v":"Festival de Ordem Unida"},{"$f":"IF(VLOOKUP(A566,Itinerário!$A$3:$I$875,8,FALSE)=0,\"\",VLOOKUP(A566,Itinerário!$A$3:$I$875,8,FALSE))","v":"Estreito"},{"$f":"IF(VLOOKUP(A566,Itinerário!$A$3:$I$875,9,FALSE)=0,\"\",VLOOKUP(A566,Itinerário!$A$3:$I$875,9,FALSE))","v":"Estreito"}]
[564,{"$f":"VLOOKUP(A567,Itinerário!$A$3:$I$875,3,FALSE)","v":"JOEL MORAIS"},{"$f":"VLOOKUP(A567,Itinerário!$A$3:$I$875,5,FALSE)","v":"SETEMBRO"},{"$f":"IF(VLOOKUP(A567,Itinerário!$A$3:$I$875,6,FALSE)=0,\"\",VLOOKUP(A567,Itinerário!$A$3:$I$875,6,FALSE))","v":9},"2018-09-09",{"$f":"IF(VLOOKUP(A567,Itinerário!$A$3:$I$875,7,FALSE)=0,\"\",VLOOKUP(A567,Itinerário!$A$3:$I$875,7,FALSE))","v":"Culto"},{"$f":"IF(VLOOKUP(A567,Itinerário!$A$3:$I$875,8,FALSE)=0,\"\",VLOOKUP(A567,Itinerário!$A$3:$I$875,8,FALSE))","v":"Estreito"},{"$f":"IF(VLOOKUP(A567,Itinerário!$A$3:$I$875,9,FALSE)=0,\"\",VLOOKUP(A567,Itinerário!$A$3:$I$875,9,FALSE))","v":"Estreito"}]
[565,{"$f":"VLOOKUP(A568,Itinerário!$A$3:$I$875,3,FALSE)","v":"JOEL MORAIS"},{"$f":"VLOOKUP(A568,Itinerário!$A$3:$I$875,5,FALSE)","v":"SETEMBRO"},{"$f":"IF(VLOOKUP(A568,Itinerário!$A$3:$I$875,6,FALSE)=0,\"\",VLOOKUP(A568,Itinerário!$A$3:$I$875,6,FALSE))","v":14},"2018-09-14",{"$f":"IF(VLOOKUP(A568,Itinerário!$A$3:$I$875,7,FALSE)=0,\"\",VLOOKUP(A568,Itinerário!$A$3:$I$875,7,FALSE))","v":"RECILCLAGEM"},{"$f":"IF(VLOOKUP(A568,Itinerário!$A$3:$I$875,8,FALSE)=0,\"\",VLOOKUP(A568,Itinerário!$A$3:$I$875,8,FALSE))","v":"AC"},{"$f":"IF(VLOOKUP(A568,Itinerário!$A$3:$I$875,9,FALSE)=0,\"\",VLOOKUP(A568,Itinerário!$A$3:$I$875,9,FALSE))","v":"AC "}]
[566,{"$f":"VLOOKUP(A569,Itinerário!$A$3:$I$875,3,FALSE)","v":"JOEL MORAIS"},{"$f":"VLOOKUP(A569,Itinerário!$A$3:$I$875,5,FALSE)","v":"SETEMBRO"},{"$f":"IF(VLOOKUP(A569,Itinerário!$A$3:$I$875,6,FALSE)=0,\"\",VLOOKUP(A569,Itinerário!$A$3:$I$875,6,FALSE))","v":15},"2018-09-15",{"$f":"IF(VLOOKUP(A569,Itinerário!$A$3:$I$875,7,FALSE)=0,\"\",VLOOKUP(A569,Itinerário!$A$3:$I$875,7,FALSE))","v":"Dia Mundial "},{"$f":"IF(VLOOKUP(A569,Itinerário!$A$3:$I$875,8,FALSE)=0,\"\",VLOOKUP(A569,Itinerário!$A$3:$I$875,8,FALSE))","v":"Coloninha"},{"$f":"IF(VLOOKUP(A569,Itinerário!$A$3:$I$875,9,FALSE)=0,\"\",VLOOKUP(A569,Itinerário!$A$3:$I$875,9,FALSE))","v":"Araranguá"}]
[567,{"$f":"VLOOKUP(A570,Itinerário!$A$3:$I$875,3,FALSE)","v":"JOEL MORAIS"},{"$f":"VLOOKUP(A570,Itinerário!$A$3:$I$875,5,FALSE)","v":"SETEMBRO"},{"$f":"IF(VLOOKUP(A570,Itinerário!$A$3:$I$875,6,FALSE)=0,\"\",VLOOKUP(A570,Itinerário!$A$3:$I$875,6,FALSE))","v":22},"2018-09-22",{"$f":"IF(VLOOKUP(A570,Itinerário!$A$3:$I$875,7,FALSE)=0,\"\",VLOOKUP(A570,Itinerário!$A$3:$I$875,7,FALSE))","v":"Comemoração"},{"$f":"IF(VLOOKUP(A570,Itinerário!$A$3:$I$875,8,FALSE)=0,\"\",VLOOKUP(A570,Itinerário!$A$3:$I$875,8,FALSE))","v":"Jardim Eldorado"},{"$f":"IF(VLOOKUP(A570,Itinerário!$A$3:$I$875,9,FALSE)=0,\"\",VLOOKUP(A570,Itinerário!$A$3:$I$875,9,FALSE))","v":"Jardim Eldorado"}]
[568,{"$f":"VLOOKUP(A571,Itinerário!$A$3:$I$875,3,FALSE)","v":"JOEL MORAIS"},{"$f":"VLOOKUP(A571,Itinerário!$A$3:$I$875,5,FALSE)","v":"SETEMBRO"},{"$f":"IF(VLOOKUP(A571,Itinerário!$A$3:$I$875,6,FALSE)=0,\"\",VLOOKUP(A571,Itinerário!$A$3:$I$875,6,FALSE))","v":23},"2018-09-23",{"$f":"IF(VLOOKUP(A571,Itinerário!$A$3:$I$875,7,FALSE)=0,\"\",VLOOKUP(A571,Itinerário!$A$3:$I$875,7,FALSE))","v":"Especialoidades Samia "},{"$f":"IF(VLOOKUP(A571,Itinerário!$A$3:$I$875,8,FALSE)=0,\"\",VLOOKUP(A571,Itinerário!$A$3:$I$875,8,FALSE))","v":"Imbitiba"},{"$f":"IF(VLOOKUP(A571,Itinerário!$A$3:$I$875,9,FALSE)=0,\"\",VLOOKUP(A571,Itinerário!$A$3:$I$875,9,FALSE))","v":"Imbituba"}]
[569,{"$f":"VLOOKUP(A572,Itinerário!$A$3:$I$875,3,FALSE)","v":"JOEL MORAIS"},{"$f":"VLOOKUP(A572,Itinerário!$A$3:$I$875,5,FALSE)","v":"SETEMBRO"},{"$f":"IF(VLOOKUP(A572,Itinerário!$A$3:$I$875,6,FALSE)=0,\"\",VLOOKUP(A572,Itinerário!$A$3:$I$875,6,FALSE))","v":""},"00:00:00",{"$f":"IF(VLOOKUP(A572,Itinerário!$A$3:$I$875,7,FALSE)=0,\"\",VLOOKUP(A572,Itinerário!$A$3:$I$875,7,FALSE))","v":""},{"$f":"IF(VLOOKUP(A572,Itinerário!$A$3:$I$875,8,FALSE)=0,\"\",VLOOKUP(A572,Itinerário!$A$3:$I$875,8,FALSE))","v":""},{"$f":"IF(VLOOKUP(A572,Itinerário!$A$3:$I$875,9,FALSE)=0,\"\",VLOOKUP(A572,Itinerário!$A$3:$I$875,9,FALSE))","v":""}]
[570,{"$f":"VLOOKUP(A573,Itinerário!$A$3:$I$875,3,FALSE)","v":"JOEL MORAIS"},{"$f":"VLOOKUP(A573,Itinerário!$A$3:$I$875,5,FALSE)","v":"SETEMBRO"},{"$f":"IF(VLOOKUP(A573,Itinerário!$A$3:$I$875,6,FALSE)=0,\"\",VLOOKUP(A573,Itinerário!$A$3:$I$875,6,FALSE))","v":""},"00:00:00",{"$f":"IF(VLOOKUP(A573,Itinerário!$A$3:$I$875,7,FALSE)=0,\"\",VLOOKUP(A573,Itinerário!$A$3:$I$875,7,FALSE))","v":""},{"$f":"IF(VLOOKUP(A573,Itinerário!$A$3:$I$875,8,FALSE)=0,\"\",VLOOKUP(A573,Itinerário!$A$3:$I$875,8,FALSE))","v":""},{"$f":"IF(VLOOKUP(A573,Itinerário!$A$3:$I$875,9,FALSE)=0,\"\",VLOOKUP(A573,Itinerário!$A$3:$I$875,9,FALSE))","v":""}]
[571,{"$f":"VLOOKUP(A574,Itinerário!$A$3:$I$875,3,FALSE)","v":"JOEL MORAIS"},{"$f":"VLOOKUP(A574,Itinerário!$A$3:$I$875,5,FALSE)","v":"OUTUBRO"},{"$f":"IF(VLOOKUP(A574,Itinerário!$A$3:$I$875,6,FALSE)=0,\"\",VLOOKUP(A574,Itinerário!$A$3:$I$875,6,FALSE))","v":6},"2018-10-06",{"$f":"IF(VLOOKUP(A574,Itinerário!$A$3:$I$875,7,FALSE)=0,\"\",VLOOKUP(A574,Itinerário!$A$3:$I$875,7,FALSE))","v":"Sermão"},{"$f":"IF(VLOOKUP(A574,Itinerário!$A$3:$I$875,8,FALSE)=0,\"\",VLOOKUP(A574,Itinerário!$A$3:$I$875,8,FALSE))","v":"Itapema"},{"$f":"IF(VLOOKUP(A574,Itinerário!$A$3:$I$875,9,FALSE)=0,\"\",VLOOKUP(A574,Itinerário!$A$3:$I$875,9,FALSE))","v":"Itapema"}]
[572,{"$f":"VLOOKUP(A575,Itinerário!$A$3:$I$875,3,FALSE)","v":"JOEL MORAIS"},{"$f":"VLOOKUP(A575,Itinerário!$A$3:$I$875,5,FALSE)","v":"OUTUBRO"},{"$f":"IF(VLOOKUP(A575,Itinerário!$A$3:$I$875,6,FALSE)=0,\"\",VLOOKUP(A575,Itinerário!$A$3:$I$875,6,FALSE))","v":7},"2018-10-07",{"$f":"IF(VLOOKUP(A575,Itinerário!$A$3:$I$875,7,FALSE)=0,\"\",VLOOKUP(A575,Itinerário!$A$3:$I$875,7,FALSE))","v":"Plantador Intensivo"},{"$f":"IF(VLOOKUP(A575,Itinerário!$A$3:$I$875,8,FALSE)=0,\"\",VLOOKUP(A575,Itinerário!$A$3:$I$875,8,FALSE))","v":"CATRE"},{"$f":"IF(VLOOKUP(A575,Itinerário!$A$3:$I$875,9,FALSE)=0,\"\",VLOOKUP(A575,Itinerário!$A$3:$I$875,9,FALSE))","v":"CATRE"}]
[573,{"$f":"VLOOKUP(A576,Itinerário!$A$3:$I$875,3,FALSE)","v":"JOEL MORAIS"},{"$f":"VLOOKUP(A576,Itinerário!$A$3:$I$875,5,FALSE)","v":"OUTUBRO"},{"$f":"IF(VLOOKUP(A576,Itinerário!$A$3:$I$875,6,FALSE)=0,\"\",VLOOKUP(A576,Itinerário!$A$3:$I$875,6,FALSE))","v":"12 a 13"},"00:00:00",{"$f":"IF(VLOOKUP(A576,Itinerário!$A$3:$I$875,7,FALSE)=0,\"\",VLOOKUP(A576,Itinerário!$A$3:$I$875,7,FALSE))","v":"Camponi Norte"},{"$f":"IF(VLOOKUP(A576,Itinerário!$A$3:$I$875,8,FALSE)=0,\"\",VLOOKUP(A576,Itinerário!$A$3:$I$875,8,FALSE))","v":"Canelinha"},{"$f":"IF(VLOOKUP(A576,Itinerário!$A$3:$I$875,9,FALSE)=0,\"\",VLOOKUP(A576,Itinerário!$A$3:$I$875,9,FALSE))","v":"Tijucas"}]
[574,{"$f":"VLOOKUP(A577,Itinerário!$A$3:$I$875,3,FALSE)","v":"JOEL MORAIS"},{"$f":"VLOOKUP(A577,Itinerário!$A$3:$I$875,5,FALSE)","v":"OUTUBRO"},{"$f":"IF(VLOOKUP(A577,Itinerário!$A$3:$I$875,6,FALSE)=0,\"\",VLOOKUP(A577,Itinerário!$A$3:$I$875,6,FALSE))","v":13},"2018-10-13",{"$f":"IF(VLOOKUP(A577,Itinerário!$A$3:$I$875,7,FALSE)=0,\"\",VLOOKUP(A577,Itinerário!$A$3:$I$875,7,FALSE))","v":"Camponi Sul"},{"$f":"IF(VLOOKUP(A577,Itinerário!$A$3:$I$875,8,FALSE)=0,\"\",VLOOKUP(A577,Itinerário!$A$3:$I$875,8,FALSE))","v":""},{"$f":"IF(VLOOKUP(A577,Itinerário!$A$3:$I$875,9,FALSE)=0,\"\",VLOOKUP(A577,Itinerário!$A$3:$I$875,9,FALSE))","v":"Criciúma"}]
[575,{"$f":"VLOOKUP(A578,Itinerário!$A$3:$I$875,3,FALSE)","v":"JOEL MORAIS"},{"$f":"VLOOKUP(A578,Itinerário!$A$3:$I$875,5,FALSE)","v":"OUTUBRO"},{"$f":"IF(VLOOKUP(A578,Itinerário!$A$3:$I$875,6,FALSE)=0,\"\",VLOOKUP(A578,Itinerário!$A$3:$I$875,6,FALSE))","v":14},"2018-10-14",{"$f":"IF(VLOOKUP(A578,Itinerário!$A$3:$I$875,7,FALSE)=0,\"\",VLOOKUP(A578,Itinerário!$A$3:$I$875,7,FALSE))","v":"Camponi Serra"},{"$f":"IF(VLOOKUP(A578,Itinerário!$A$3:$I$875,8,FALSE)=0,\"\",VLOOKUP(A578,Itinerário!$A$3:$I$875,8,FALSE))","v":""},{"$f":"IF(VLOOKUP(A578,Itinerário!$A$3:$I$875,9,FALSE)=0,\"\",VLOOKUP(A578,Itinerário!$A$3:$I$875,9,FALSE))","v":"Lages "}]
[576,{"$f":"VLOOKUP(A579,Itinerário!$A$3:$I$875,3,FALSE)","v":"JOEL MORAIS"},{"$f":"VLOOKUP(A579,Itinerário!$A$3:$I$875,5,FALSE)","v":"OUTUBRO"},{"$f":"IF(VLOOKUP(A579,Itinerário!$A$3:$I$875,6,FALSE)=0,\"\",VLOOKUP(A579,Itinerário!$A$3:$I$875,6,FALSE))","v":19},"2018-10-19",{"$f":"IF(VLOOKUP(A579,Itinerário!$A$3:$I$875,7,FALSE)=0,\"\",VLOOKUP(A579,Itinerário!$A$3:$I$875,7,FALSE))","v":"??"},{"$f":"IF(VLOOKUP(A579,Itinerário!$A$3:$I$875,8,FALSE)=0,\"\",VLOOKUP(A579,Itinerário!$A$3:$I$875,8,FALSE))","v":""},{"$f":"IF(VLOOKUP(A579,Itinerário!$A$3:$I$875,9,FALSE)=0,\"\",VLOOKUP(A579,Itinerário!$A$3:$I$875,9,FALSE))","v":""}]
[577,{"$f":"VLOOKUP(A580,Itinerário!$A$3:$I$875,3,FALSE)","v":"JOEL MORAIS"},{"$f":"VLOOKUP(A580,Itinerário!$A$3:$I$875,5,FALSE)","v":"OUTUBRO"},{"$f":"IF(VLOOKUP(A580,Itinerário!$A$3:$I$875,6,FALSE)=0,\"\",VLOOKUP(A580,Itinerário!$A$3:$I$875,6,FALSE))","v":20},{"$f":"IFERROR(DATE(RIGHT($B$2,4),VLOOKUP(C580,$J$4:$K$15,2,FALSE),D580),0)","v":"2018-10-20"},{"$f":"IF(VLOOKUP(A580,Itinerário!$A$3:$I$875,7,FALSE)=0,\"\",VLOOKUP(A580,Itinerário!$A$3:$I$875,7,FALSE))","v":"??"},{"$f":"IF(VLOOKUP(A580,Itinerário!$A$3:$I$875,8,FALSE)=0,\"\",VLOOKUP(A580,Itinerário!$A$3:$I$875,8,FALSE))","v":""},{"$f":"IF(VLOOKUP(A580,Itinerário!$A$3:$I$875,9,FALSE)=0,\"\",VLOOKUP(A580,Itinerário!$A$3:$I$875,9,FALSE))","v":""}]
[578,{"$f":"VLOOKUP(A581,Itinerário!$A$3:$I$875,3,FALSE)","v":"JOEL MORAIS"},{"$f":"VLOOKUP(A581,Itinerário!$A$3:$I$875,5,FALSE)","v":"OUTUBRO"},{"$f":"IF(VLOOKUP(A581,Itinerário!$A$3:$I$875,6,FALSE)=0,\"\",VLOOKUP(A581,Itinerário!$A$3:$I$875,6,FALSE))","v":21},"2018-10-21",{"$f":"IF(VLOOKUP(A581,Itinerário!$A$3:$I$875,7,FALSE)=0,\"\",VLOOKUP(A581,Itinerário!$A$3:$I$875,7,FALSE))","v":"Olimpori 9 região"},{"$f":"IF(VLOOKUP(A581,Itinerário!$A$3:$I$875,8,FALSE)=0,\"\",VLOOKUP(A581,Itinerário!$A$3:$I$875,8,FALSE))","v":"Itajai"},{"$f":"IF(VLOOKUP(A581,Itinerário!$A$3:$I$875,9,FALSE)=0,\"\",VLOOKUP(A581,Itinerário!$A$3:$I$875,9,FALSE))","v":"Itajaí"}]
[579,{"$f":"VLOOKUP(A582,Itinerário!$A$3:$I$875,3,FALSE)","v":"JOEL MORAIS"},{"$f":"VLOOKUP(A582,Itinerário!$A$3:$I$875,5,FALSE)","v":"OUTUBRO"},{"$f":"IF(VLOOKUP(A582,Itinerário!$A$3:$I$875,6,FALSE)=0,\"\",VLOOKUP(A582,Itinerário!$A$3:$I$875,6,FALSE))","v":26},"2018-10-26",{"$f":"IF(VLOOKUP(A582,Itinerário!$A$3:$I$875,7,FALSE)=0,\"\",VLOOKUP(A582,Itinerário!$A$3:$I$875,7,FALSE))","v":"??"},{"$f":"IF(VLOOKUP(A582,Itinerário!$A$3:$I$875,8,FALSE)=0,\"\",VLOOKUP(A582,Itinerário!$A$3:$I$875,8,FALSE))","v":""},{"$f":"IF(VLOOKUP(A582,Itinerário!$A$3:$I$875,9,FALSE)=0,\"\",VLOOKUP(A582,Itinerário!$A$3:$I$875,9,FALSE))","v":""}]
[580,{"$f":"VLOOKUP(A583,Itinerário!$A$3:$I$875,3,FALSE)","v":"JOEL MORAIS"},{"$f":"VLOOKUP(A583,Itinerário!$A$3:$I$875,5,FALSE)","v":"OUTUBRO"},{"$f":"IF(VLOOKUP(A583,Itinerário!$A$3:$I$875,6,FALSE)=0,\"\",VLOOKUP(A583,Itinerário!$A$3:$I$875,6,FALSE))","v":28},"2018-10-28",{"$f":"IF(VLOOKUP(A583,Itinerário!$A$3:$I$875,7,FALSE)=0,\"\",VLOOKUP(A583,Itinerário!$A$3:$I$875,7,FALSE))","v":"??"},{"$f":"IF(VLOOKUP(A583,Itinerário!$A$3:$I$875,8,FALSE)=0,\"\",VLOOKUP(A583,Itinerário!$A$3:$I$875,8,FALSE))","v":""},{"$f":"IF(VLOOKUP(A583,Itinerário!$A$3:$I$875,9,FALSE)=0,\"\",VLOOKUP(A583,Itinerário!$A$3:$I$875,9,FALSE))","v":""}]
[581,{"$f":"VLOOKUP(A584,Itinerário!$A$3:$I$875,3,FALSE)","v":"JOEL MORAIS"},{"$f":"VLOOKUP(A584,Itinerário!$A$3:$I$875,5,FALSE)","v":"NOVEMBRO"},{"$f":"IF(VLOOKUP(A584,Itinerário!$A$3:$I$875,6,FALSE)=0,\"\",VLOOKUP(A584,Itinerário!$A$3:$I$875,6,FALSE))","v":1},"2018-11-01",{"$f":"IF(VLOOKUP(A584,Itinerário!$A$3:$I$875,7,FALSE)=0,\"\",VLOOKUP(A584,Itinerário!$A$3:$I$875,7,FALSE))","v":"Abertura Camponi 2ª  Região - Distrital"},{"$f":"IF(VLOOKUP(A584,Itinerário!$A$3:$I$875,8,FALSE)=0,\"\",VLOOKUP(A584,Itinerário!$A$3:$I$875,8,FALSE))","v":"??"},{"$f":"IF(VLOOKUP(A584,Itinerário!$A$3:$I$875,9,FALSE)=0,\"\",VLOOKUP(A584,Itinerário!$A$3:$I$875,9,FALSE))","v":"Ingleses"}]
[582,{"$f":"VLOOKUP(A585,Itinerário!$A$3:$I$875,3,FALSE)","v":"JOEL MORAIS"},{"$f":"VLOOKUP(A585,Itinerário!$A$3:$I$875,5,FALSE)","v":"NOVEMBRO"},{"$f":"IF(VLOOKUP(A585,Itinerário!$A$3:$I$875,6,FALSE)=0,\"\",VLOOKUP(A585,Itinerário!$A$3:$I$875,6,FALSE))","v":2},"2018-11-02",{"$f":"IF(VLOOKUP(A585,Itinerário!$A$3:$I$875,7,FALSE)=0,\"\",VLOOKUP(A585,Itinerário!$A$3:$I$875,7,FALSE))","v":"Aventuri ACP"},{"$f":"IF(VLOOKUP(A585,Itinerário!$A$3:$I$875,8,FALSE)=0,\"\",VLOOKUP(A585,Itinerário!$A$3:$I$875,8,FALSE))","v":"ACP"},{"$f":"IF(VLOOKUP(A585,Itinerário!$A$3:$I$875,9,FALSE)=0,\"\",VLOOKUP(A585,Itinerário!$A$3:$I$875,9,FALSE))","v":"ACP"}]
[583,{"$f":"VLOOKUP(A586,Itinerário!$A$3:$I$875,3,FALSE)","v":"JOEL MORAIS"},{"$f":"VLOOKUP(A586,Itinerário!$A$3:$I$875,5,FALSE)","v":"NOVEMBRO"},{"$f":"IF(VLOOKUP(A586,Itinerário!$A$3:$I$875,6,FALSE)=0,\"\",VLOOKUP(A586,Itinerário!$A$3:$I$875,6,FALSE))","v":3},"2018-11-03",{"$f":"IF(VLOOKUP(A586,Itinerário!$A$3:$I$875,7,FALSE)=0,\"\",VLOOKUP(A586,Itinerário!$A$3:$I$875,7,FALSE))","v":"Camponi Norte - Distrital"},{"$f":"IF(VLOOKUP(A586,Itinerário!$A$3:$I$875,8,FALSE)=0,\"\",VLOOKUP(A586,Itinerário!$A$3:$I$875,8,FALSE))","v":""},{"$f":"IF(VLOOKUP(A586,Itinerário!$A$3:$I$875,9,FALSE)=0,\"\",VLOOKUP(A586,Itinerário!$A$3:$I$875,9,FALSE))","v":"Balneário Camboriú"}]
[584,{"$f":"VLOOKUP(A587,Itinerário!$A$3:$I$875,3,FALSE)","v":"JOEL MORAIS"},{"$f":"VLOOKUP(A587,Itinerário!$A$3:$I$875,5,FALSE)","v":"NOVEMBRO"},{"$f":"IF(VLOOKUP(A587,Itinerário!$A$3:$I$875,6,FALSE)=0,\"\",VLOOKUP(A587,Itinerário!$A$3:$I$875,6,FALSE))","v":10},"2018-11-10",{"$f":"IF(VLOOKUP(A587,Itinerário!$A$3:$I$875,7,FALSE)=0,\"\",VLOOKUP(A587,Itinerário!$A$3:$I$875,7,FALSE))","v":"Investidura "},{"$f":"IF(VLOOKUP(A587,Itinerário!$A$3:$I$875,8,FALSE)=0,\"\",VLOOKUP(A587,Itinerário!$A$3:$I$875,8,FALSE))","v":"Joaçaba"},{"$f":"IF(VLOOKUP(A587,Itinerário!$A$3:$I$875,9,FALSE)=0,\"\",VLOOKUP(A587,Itinerário!$A$3:$I$875,9,FALSE))","v":"Joaçaba"}]
[585,{"$f":"VLOOKUP(A588,Itinerário!$A$3:$I$875,3,FALSE)","v":"JOEL MORAIS"},{"$f":"VLOOKUP(A588,Itinerário!$A$3:$I$875,5,FALSE)","v":"NOVEMBRO"},{"$f":"IF(VLOOKUP(A588,Itinerário!$A$3:$I$875,6,FALSE)=0,\"\",VLOOKUP(A588,Itinerário!$A$3:$I$875,6,FALSE))","v":16},"2018-11-16",{"$f":"IF(VLOOKUP(A588,Itinerário!$A$3:$I$875,7,FALSE)=0,\"\",VLOOKUP(A588,Itinerário!$A$3:$I$875,7,FALSE))","v":"Camponi  1ª Região"},{"$f":"IF(VLOOKUP(A588,Itinerário!$A$3:$I$875,8,FALSE)=0,\"\",VLOOKUP(A588,Itinerário!$A$3:$I$875,8,FALSE))","v":"ANC"},{"$f":"IF(VLOOKUP(A588,Itinerário!$A$3:$I$875,9,FALSE)=0,\"\",VLOOKUP(A588,Itinerário!$A$3:$I$875,9,FALSE))","v":"ANC"}]
[586,{"$f":"VLOOKUP(A589,Itinerário!$A$3:$I$875,3,FALSE)","v":"JOEL MORAIS"},{"$f":"VLOOKUP(A589,Itinerário!$A$3:$I$875,5,FALSE)","v":"NOVEMBRO"},{"$f":"IF(VLOOKUP(A589,Itinerário!$A$3:$I$875,6,FALSE)=0,\"\",VLOOKUP(A589,Itinerário!$A$3:$I$875,6,FALSE))","v":17},"2018-11-17",{"$f":"IF(VLOOKUP(A589,Itinerário!$A$3:$I$875,7,FALSE)=0,\"\",VLOOKUP(A589,Itinerário!$A$3:$I$875,7,FALSE))","v":"Campori de Jovens"},{"$f":"IF(VLOOKUP(A589,Itinerário!$A$3:$I$875,8,FALSE)=0,\"\",VLOOKUP(A589,Itinerário!$A$3:$I$875,8,FALSE))","v":"USB"},{"$f":"IF(VLOOKUP(A589,Itinerário!$A$3:$I$875,9,FALSE)=0,\"\",VLOOKUP(A589,Itinerário!$A$3:$I$875,9,FALSE))","v":"USB"}]
[587,{"$f":"VLOOKUP(A590,Itinerário!$A$3:$I$875,3,FALSE)","v":"JOEL MORAIS"},{"$f":"VLOOKUP(A590,Itinerário!$A$3:$I$875,5,FALSE)","v":"NOVEMBRO"},{"$f":"IF(VLOOKUP(A590,Itinerário!$A$3:$I$875,6,FALSE)=0,\"\",VLOOKUP(A590,Itinerário!$A$3:$I$875,6,FALSE))","v":"23-25"},"00:00:00",{"$f":"IF(VLOOKUP(A590,Itinerário!$A$3:$I$875,7,FALSE)=0,\"\",VLOOKUP(A590,Itinerário!$A$3:$I$875,7,FALSE))","v":"XIII Aventuri"},{"$f":"IF(VLOOKUP(A590,Itinerário!$A$3:$I$875,8,FALSE)=0,\"\",VLOOKUP(A590,Itinerário!$A$3:$I$875,8,FALSE))","v":"AC"},{"$f":"IF(VLOOKUP(A590,Itinerário!$A$3:$I$875,9,FALSE)=0,\"\",VLOOKUP(A590,Itinerário!$A$3:$I$875,9,FALSE))","v":"AC"}]
[588,{"$f":"VLOOKUP(A591,Itinerário!$A$3:$I$875,3,FALSE)","v":"JOEL MORAIS"},{"$f":"VLOOKUP(A591,Itinerário!$A$3:$I$875,5,FALSE)","v":"NOVEMBRO"},{"$f":"IF(VLOOKUP(A591,Itinerário!$A$3:$I$875,6,FALSE)=0,\"\",VLOOKUP(A591,Itinerário!$A$3:$I$875,6,FALSE))","v":""},"00:00:00",{"$f":"IF(VLOOKUP(A591,Itinerário!$A$3:$I$875,7,FALSE)=0,\"\",VLOOKUP(A591,Itinerário!$A$3:$I$875,7,FALSE))","v":""},{"$f":"IF(VLOOKUP(A591,Itinerário!$A$3:$I$875,8,FALSE)=0,\"\",VLOOKUP(A591,Itinerário!$A$3:$I$875,8,FALSE))","v":""},{"$f":"IF(VLOOKUP(A591,Itinerário!$A$3:$I$875,9,FALSE)=0,\"\",VLOOKUP(A591,Itinerário!$A$3:$I$875,9,FALSE))","v":""}]
[589,{"$f":"VLOOKUP(A592,Itinerário!$A$3:$I$875,3,FALSE)","v":"JOEL MORAIS"},{"$f":"VLOOKUP(A592,Itinerário!$A$3:$I$875,5,FALSE)","v":"NOVEMBRO"},{"$f":"IF(VLOOKUP(A592,Itinerário!$A$3:$I$875,6,FALSE)=0,\"\",VLOOKUP(A592,Itinerário!$A$3:$I$875,6,FALSE))","v":""},"00:00:00",{"$f":"IF(VLOOKUP(A592,Itinerário!$A$3:$I$875,7,FALSE)=0,\"\",VLOOKUP(A592,Itinerário!$A$3:$I$875,7,FALSE))","v":""},{"$f":"IF(VLOOKUP(A592,Itinerário!$A$3:$I$875,8,FALSE)=0,\"\",VLOOKUP(A592,Itinerário!$A$3:$I$875,8,FALSE))","v":""},{"$f":"IF(VLOOKUP(A592,Itinerário!$A$3:$I$875,9,FALSE)=0,\"\",VLOOKUP(A592,Itinerário!$A$3:$I$875,9,FALSE))","v":""}]
[590,{"$f":"VLOOKUP(A593,Itinerário!$A$3:$I$875,3,FALSE)","v":"JOEL MORAIS"},{"$f":"VLOOKUP(A593,Itinerário!$A$3:$I$875,5,FALSE)","v":"NOVEMBRO"},{"$f":"IF(VLOOKUP(A593,Itinerário!$A$3:$I$875,6,FALSE)=0,\"\",VLOOKUP(A593,Itinerário!$A$3:$I$875,6,FALSE))","v":""},"00:00:00",{"$f":"IF(VLOOKUP(A593,Itinerário!$A$3:$I$875,7,FALSE)=0,\"\",VLOOKUP(A593,Itinerário!$A$3:$I$875,7,FALSE))","v":""},{"$f":"IF(VLOOKUP(A593,Itinerário!$A$3:$I$875,8,FALSE)=0,\"\",VLOOKUP(A593,Itinerário!$A$3:$I$875,8,FALSE))","v":""},{"$f":"IF(VLOOKUP(A593,Itinerário!$A$3:$I$875,9,FALSE)=0,\"\",VLOOKUP(A593,Itinerário!$A$3:$I$875,9,FALSE))","v":""}]
[591,{"$f":"VLOOKUP(A594,Itinerário!$A$3:$I$875,3,FALSE)","v":"JOEL MORAIS"},{"$f":"VLOOKUP(A594,Itinerário!$A$3:$I$875,5,FALSE)","v":"DEZEMBRO"},{"$f":"IF(VLOOKUP(A594,Itinerário!$A$3:$I$875,6,FALSE)=0,\"\",VLOOKUP(A594,Itinerário!$A$3:$I$875,6,FALSE))","v":""},"00:00:00",{"$f":"IF(VLOOKUP(A594,Itinerário!$A$3:$I$875,7,FALSE)=0,\"\",VLOOKUP(A594,Itinerário!$A$3:$I$875,7,FALSE))","v":""},{"$f":"IF(VLOOKUP(A594,Itinerário!$A$3:$I$875,8,FALSE)=0,\"\",VLOOKUP(A594,Itinerário!$A$3:$I$875,8,FALSE))","v":""},{"$f":"IF(VLOOKUP(A594,Itinerário!$A$3:$I$875,9,FALSE)=0,\"\",VLOOKUP(A594,Itinerário!$A$3:$I$875,9,FALSE))","v":""}]
[592,{"$f":"VLOOKUP(A595,Itinerário!$A$3:$I$875,3,FALSE)","v":"JOEL MORAIS"},{"$f":"VLOOKUP(A595,Itinerário!$A$3:$I$875,5,FALSE)","v":"DEZEMBRO"},{"$f":"IF(VLOOKUP(A595,Itinerário!$A$3:$I$875,6,FALSE)=0,\"\",VLOOKUP(A595,Itinerário!$A$3:$I$875,6,FALSE))","v":""},"00:00:00",{"$f":"IF(VLOOKUP(A595,Itinerário!$A$3:$I$875,7,FALSE)=0,\"\",VLOOKUP(A595,Itinerário!$A$3:$I$875,7,FALSE))","v":""},{"$f":"IF(VLOOKUP(A595,Itinerário!$A$3:$I$875,8,FALSE)=0,\"\",VLOOKUP(A595,Itinerário!$A$3:$I$875,8,FALSE))","v":""},{"$f":"IF(VLOOKUP(A595,Itinerário!$A$3:$I$875,9,FALSE)=0,\"\",VLOOKUP(A595,Itinerário!$A$3:$I$875,9,FALSE))","v":""}]
[593,{"$f":"VLOOKUP(A596,Itinerário!$A$3:$I$875,3,FALSE)","v":"JOEL MORAIS"},{"$f":"VLOOKUP(A596,Itinerário!$A$3:$I$875,5,FALSE)","v":"DEZEMBRO"},{"$f":"IF(VLOOKUP(A596,Itinerário!$A$3:$I$875,6,FALSE)=0,\"\",VLOOKUP(A596,Itinerário!$A$3:$I$875,6,FALSE))","v":""},"00:00:00",{"$f":"IF(VLOOKUP(A596,Itinerário!$A$3:$I$875,7,FALSE)=0,\"\",VLOOKUP(A596,Itinerário!$A$3:$I$875,7,FALSE))","v":""},{"$f":"IF(VLOOKUP(A596,Itinerário!$A$3:$I$875,8,FALSE)=0,\"\",VLOOKUP(A596,Itinerário!$A$3:$I$875,8,FALSE))","v":""},{"$f":"IF(VLOOKUP(A596,Itinerário!$A$3:$I$875,9,FALSE)=0,\"\",VLOOKUP(A596,Itinerário!$A$3:$I$875,9,FALSE))","v":""}]
[594,{"$f":"VLOOKUP(A597,Itinerário!$A$3:$I$875,3,FALSE)","v":"JOEL MORAIS"},{"$f":"VLOOKUP(A597,Itinerário!$A$3:$I$875,5,FALSE)","v":"DEZEMBRO"},{"$f":"IF(VLOOKUP(A597,Itinerário!$A$3:$I$875,6,FALSE)=0,\"\",VLOOKUP(A597,Itinerário!$A$3:$I$875,6,FALSE))","v":""},"00:00:00",{"$f":"IF(VLOOKUP(A597,Itinerário!$A$3:$I$875,7,FALSE)=0,\"\",VLOOKUP(A597,Itinerário!$A$3:$I$875,7,FALSE))","v":""},{"$f":"IF(VLOOKUP(A597,Itinerário!$A$3:$I$875,8,FALSE)=0,\"\",VLOOKUP(A597,Itinerário!$A$3:$I$875,8,FALSE))","v":""},{"$f":"IF(VLOOKUP(A597,Itinerário!$A$3:$I$875,9,FALSE)=0,\"\",VLOOKUP(A597,Itinerário!$A$3:$I$875,9,FALSE))","v":""}]
[595,{"$f":"VLOOKUP(A598,Itinerário!$A$3:$I$875,3,FALSE)","v":"JOEL MORAIS"},{"$f":"VLOOKUP(A598,Itinerário!$A$3:$I$875,5,FALSE)","v":"DEZEMBRO"},{"$f":"IF(VLOOKUP(A598,Itinerário!$A$3:$I$875,6,FALSE)=0,\"\",VLOOKUP(A598,Itinerário!$A$3:$I$875,6,FALSE))","v":""},"00:00:00",{"$f":"IF(VLOOKUP(A598,Itinerário!$A$3:$I$875,7,FALSE)=0,\"\",VLOOKUP(A598,Itinerário!$A$3:$I$875,7,FALSE))","v":""},{"$f":"IF(VLOOKUP(A598,Itinerário!$A$3:$I$875,8,FALSE)=0,\"\",VLOOKUP(A598,Itinerário!$A$3:$I$875,8,FALSE))","v":""},{"$f":"IF(VLOOKUP(A598,Itinerário!$A$3:$I$875,9,FALSE)=0,\"\",VLOOKUP(A598,Itinerário!$A$3:$I$875,9,FALSE))","v":""}]
[596,{"$f":"VLOOKUP(A599,Itinerário!$A$3:$I$875,3,FALSE)","v":"JOEL MORAIS"},{"$f":"VLOOKUP(A599,Itinerário!$A$3:$I$875,5,FALSE)","v":"DEZEMBRO"},{"$f":"IF(VLOOKUP(A599,Itinerário!$A$3:$I$875,6,FALSE)=0,\"\",VLOOKUP(A599,Itinerário!$A$3:$I$875,6,FALSE))","v":""},"00:00:00",{"$f":"IF(VLOOKUP(A599,Itinerário!$A$3:$I$875,7,FALSE)=0,\"\",VLOOKUP(A599,Itinerário!$A$3:$I$875,7,FALSE))","v":""},{"$f":"IF(VLOOKUP(A599,Itinerário!$A$3:$I$875,8,FALSE)=0,\"\",VLOOKUP(A599,Itinerário!$A$3:$I$875,8,FALSE))","v":""},{"$f":"IF(VLOOKUP(A599,Itinerário!$A$3:$I$875,9,FALSE)=0,\"\",VLOOKUP(A599,Itinerário!$A$3:$I$875,9,FALSE))","v":""}]
[597,{"$f":"VLOOKUP(A600,Itinerário!$A$3:$I$875,3,FALSE)","v":"JOEL MORAIS"},{"$f":"VLOOKUP(A600,Itinerário!$A$3:$I$875,5,FALSE)","v":"DEZEMBRO"},{"$f":"IF(VLOOKUP(A600,Itinerário!$A$3:$I$875,6,FALSE)=0,\"\",VLOOKUP(A600,Itinerário!$A$3:$I$875,6,FALSE))","v":""},"00:00:00",{"$f":"IF(VLOOKUP(A600,Itinerário!$A$3:$I$875,7,FALSE)=0,\"\",VLOOKUP(A600,Itinerário!$A$3:$I$875,7,FALSE))","v":""},{"$f":"IF(VLOOKUP(A600,Itinerário!$A$3:$I$875,8,FALSE)=0,\"\",VLOOKUP(A600,Itinerário!$A$3:$I$875,8,FALSE))","v":""},{"$f":"IF(VLOOKUP(A600,Itinerário!$A$3:$I$875,9,FALSE)=0,\"\",VLOOKUP(A600,Itinerário!$A$3:$I$875,9,FALSE))","v":""}]
[598,{"$f":"VLOOKUP(A601,Itinerário!$A$3:$I$875,3,FALSE)","v":"JOEL MORAIS"},{"$f":"VLOOKUP(A601,Itinerário!$A$3:$I$875,5,FALSE)","v":"DEZEMBRO"},{"$f":"IF(VLOOKUP(A601,Itinerário!$A$3:$I$875,6,FALSE)=0,\"\",VLOOKUP(A601,Itinerário!$A$3:$I$875,6,FALSE))","v":""},"00:00:00",{"$f":"IF(VLOOKUP(A601,Itinerário!$A$3:$I$875,7,FALSE)=0,\"\",VLOOKUP(A601,Itinerário!$A$3:$I$875,7,FALSE))","v":""},{"$f":"IF(VLOOKUP(A601,Itinerário!$A$3:$I$875,8,FALSE)=0,\"\",VLOOKUP(A601,Itinerário!$A$3:$I$875,8,FALSE))","v":""},{"$f":"IF(VLOOKUP(A601,Itinerário!$A$3:$I$875,9,FALSE)=0,\"\",VLOOKUP(A601,Itinerário!$A$3:$I$875,9,FALSE))","v":""}]
[599,{"$f":"VLOOKUP(A602,Itinerário!$A$3:$I$875,3,FALSE)","v":"JOEL MORAIS"},{"$f":"VLOOKUP(A602,Itinerário!$A$3:$I$875,5,FALSE)","v":"DEZEMBRO"},{"$f":"IF(VLOOKUP(A602,Itinerário!$A$3:$I$875,6,FALSE)=0,\"\",VLOOKUP(A602,Itinerário!$A$3:$I$875,6,FALSE))","v":""},"00:00:00",{"$f":"IF(VLOOKUP(A602,Itinerário!$A$3:$I$875,7,FALSE)=0,\"\",VLOOKUP(A602,Itinerário!$A$3:$I$875,7,FALSE))","v":""},{"$f":"IF(VLOOKUP(A602,Itinerário!$A$3:$I$875,8,FALSE)=0,\"\",VLOOKUP(A602,Itinerário!$A$3:$I$875,8,FALSE))","v":""},{"$f":"IF(VLOOKUP(A602,Itinerário!$A$3:$I$875,9,FALSE)=0,\"\",VLOOKUP(A602,Itinerário!$A$3:$I$875,9,FALSE))","v":""}]
[600,{"$f":"VLOOKUP(A603,Itinerário!$A$3:$I$875,3,FALSE)","v":"JOEL MORAIS"},{"$f":"VLOOKUP(A603,Itinerário!$A$3:$I$875,5,FALSE)","v":"DEZEMBRO"},{"$f":"IF(VLOOKUP(A603,Itinerário!$A$3:$I$875,6,FALSE)=0,\"\",VLOOKUP(A603,Itinerário!$A$3:$I$875,6,FALSE))","v":""},"00:00:00",{"$f":"IF(VLOOKUP(A603,Itinerário!$A$3:$I$875,7,FALSE)=0,\"\",VLOOKUP(A603,Itinerário!$A$3:$I$875,7,FALSE))","v":""},{"$f":"IF(VLOOKUP(A603,Itinerário!$A$3:$I$875,8,FALSE)=0,\"\",VLOOKUP(A603,Itinerário!$A$3:$I$875,8,FALSE))","v":""},{"$f":"IF(VLOOKUP(A603,Itinerário!$A$3:$I$875,9,FALSE)=0,\"\",VLOOKUP(A603,Itinerário!$A$3:$I$875,9,FALSE))","v":""}]

{"sheet":"PDF-Email","index":2,"n_rows":56,"n_cols":10,"rows_kept":56,"cut":false,"hidden":false,"merged":[]}
[]
[null,null,null,null,"Você está vendo células com o interior vermelho na tabela?"]
["Prévia E-mail Antes de Enviar",null,"Yes",null,"Significa que existe dados errados."]
[]
[]
["Enviar","Planilhas","Nome do Arquivo","Para","Cc","Cco","Assunto","Anexar outros arquivos","Corpo do E-mail","Importante"]
["yes","Itinerário Envio",{"$f":"CONCATENATE(\"Itinerário \",VLOOKUP($D$9,$B$14:$G$54,2,FALSE))","v":"Itinerário Santa Helena"},{"$f":"VLOOKUP($D$9,$B$14:$G$54,4,FALSE)","v":"diego.schroeder@adventistas.org.br"},{"$f":"VLOOKUP($D$9,$B$14:$G$54,6,FALSE)","v":0},null,"Itinerário Departamentais 2° Trimestre de  2018",null,{"$f":"CONCATENATE(\"Boa tarde Pr. \",LEFT(VLOOKUP(D9,B14:G54,3,FALSE),SEARCH(\" \",VLOOKUP(D9,B14:G54,3,FALSE))),\"\n\nSegue em anexo as datas em que os departamentais e a administração da AC estarão em seu distrito\")","v":"Boa tarde Pr. Diego \n\nSegue em anexo as datas em que os departamentais e a administração da AC estarão em seu distrito"}]
[]
[null,null,null,34]
[]
[]
[]
[]
[null,null,"Distrito","Pastor","Email Pastor","Pastor Auxíliar","Email Pastor Auxíliar"]
[null,1,"Araranguá","Jorge Luiz Sousa da Rosa","jorge.rosa@adventistas.org.br"]
[null,2,"Balneário Camboriú","Elton Ricardo Viana de Andrade","elton.andrade@adventistas.org.br"]
[null,3,"Barreiros","Jonas Genesis Do Prado","jonas.prado@adventistas.org.br"]
[null,4,"Biguaçu","William Gomes Ferreira","wiliam.ferreira@adventistas.org.br"]
[null,5,"Bom Retiro","Rogério Mistura","rogerio.mistura@adventistas.org.br"]
[null,6,"Brusque","Oriel Pedroso","oriel.pedroso@adventistas.org.br"]
[null,7,"Camboriú","Halliwel Fontana Coitinho da Silva","halliwel.fontana@adventistas.org.br"]
[null,8,"Caminho Novo","Heber Rodrigues Souza","hebersouza2@gmail.com"]
[null,9,"Campinas","Daniel Fritoli","daniel.fritoli@adventistas.org.br"]
[null,10,"Criciúma","Lucas Vanderley Marçal Durão","lucas.durao@adventistas.org.br"]
[null,11,"Espaço Vida e Saúde","Marcelo Altamiro Coelho","marcelo.coelho@adventistas.org.br"]
[null,12,"Estreito","Sidnei da Rosa","sidnei.rosa@adventistas.org.br","Felipe Carlos Rufino","flprufino@gmail.com"]
[null,13,"Florianópolis","Jessé Anastácio de Souza","jesse.anastacio@adventistas.org.br"]
[null,14,"Garopaba","Vinicius Espindola Martins da Silva","vinicius.martins@adventistas.org.br"]
[null,15,"Içara","Fábio Henrique dos Santos Lopes","fabio.lopes@adventistas.org.br"]
[null,16,"Imbituba","Claiton Correa da Luz","claiton.luz@adventistas.org.br"]
[null,17,"Ingleses","Josemar Lima da Luz","josemar.luz@adventistas.org.br"]
[null,18,"Itajaí","Antonio Mendes Freitas Segundo","antonio.mendes@adventistas.org.br"]
[null,19,"Itapema","Roberto Vital Correa","roberto.correa@adventistas.org.br"]
[null,20,"Jardim Atlântico","Adelson Raul da Silva","adelson.silva@adventistas.org.br"]
[null,21,"Jardim Eldorado","Diogenes Mariano","diogenes.mariano@adventistas.org.br"]
[null,22,"Joaçaba","Edlei Aislan Pereira","edlei.pereira@adventistas.org.br"]
[null,23,"Lageado Baixo","Allan Davis Souza Lima de Moura","allan.moura@adventistas.org.br"]
[null,24,"Lages","Filipe Canarin","filipe.canarin@adventistas.org.br"]
[null,25,"Laguna","André Luiz de Oliveira","andre.duarte@adventistas.org.br"]
[null,26,"Limoeiro","Gabriel Thomaz Souza de Pasquale","gabriel.pasquale@adventistas.org.br"]
[null,27,"Navegantes","Benhur Orling Alves","benhur.orling@adventistas.org.br"]
[null,28,"Nova Brasília","Vagner Romualdo de Oliveira","vagner.oliveira@adventistas.org.br"]
[null,29,"Palhoça","Alex Escher","alex.escher@adventistas.org.br"]
[null,30,"Parque Lisboa","Dyotagnan Oliveira Maia","dyotagnan.maia@adventistas.org.br"]
[null,31,"Próspera","Jefferson dos Santos da Silva","jefferson.ssilva@adventistas.org.br"]
[null,32,"Revoredo","Jean Magnabosco","jean.magnabosco@adventistas.org.br"]
[null,33,"Rio Tavares","Cristiano Aparecido Batista da Silva","cristiano.batista@adventistas.org.br"]
[null,34,"Santa Helena","Diego Douglas Schroeder","diego.schroeder@adventistas.org.br"]
[null,35,"São Joaquim","Jair Tadeu Machado","jair.tadeu@adventistas.org.br"]
[null,36,"São Martinho","Fabio Rogerio de Queiroz","fabio.queiroz@adventistas.org.br"]
[null,37,"São Vicente","Eustaquio Andrade","eustaquio.andrade@adventistas.org.br"]
[null,38,"Sombrio","Reinaldo Teodoro de Almeida","reinaldo.almeida@adventistas.org.br"]
[null,39,"Tijucas","Emerson Tomaz de Oliveira","emerson.oliveira@adventistas.org.br"]
[null,40,"Tubarão","Mauricio Carlos de Sales","mauricio.sales@adventistas.org.br"]
[null,null,"Universitario","Tomaz Edison Abrantis da Silva","tomaz.silva@adventistas.org.br"]
[null,null,"Um ano em Missão","Paulo Ricardo de Souza","paulo.souza@adventistas.org.br"]