{"text_format":"1","workbook":"xlsx","n_sheets":3,"sheets":["Itinerário","Itinerário Envio","PDF-Email"],"not_rendered":{"charts":0,"images":2,"macros":1,"external_links":1,"defined_names":46,"comments":0,"pivot_tables":0},"unopened":[],"bounds":{"document_bytes":16777216,"sheet_cells":100000,"rows_first":2000,"rows_last":500,"rows_between":2000,"halvings":0,"cell_chars":16384,"cell_head_chars":4096},"cells_cut":0,"cells_raw":0,"read":"whole","date_system":"1900"}

{"sheet":"Itinerário","index":0,"n_rows":875,"n_cols":12,"rows_kept":875,"cut":false,"hidden":false,"merged":[[580,3,589,3],[620,3,629,3],[601,3,619,3],[590,3,600,3],[630,1,689,1],[630,3,639,3],[640,3,649,3],[650,3,659,3],[680,3,689,3],[670,3,679,3],[660,3,669,3],[548,1,629,1],[548,3,557,3],[558,3,579,3],[358,3,367,3],[368,1,427,1],[368,3,377,3],[378,3,387,3],[388,3,397,3],[418,3,427,3],[308,1,367,1],[308,3,317,3],[348,3,357,3],[338,3,347,3],[408,3,417,3],[398,3,407,3],[318,3,327,3],[328,3,337,3],[53,3,62,3],[3,1,62,1],[63,1,122,1],[73,3,82,3],[83,3,92,3],[33,3,42,3],[43,3,52,3],[93,3,102,3],[103,3,112,3],[113,3,122,3],[63,3,72,3],[0,1,0,8],[1,1,1,8],[3,3,12,3],[13,3,22,3],[23,3,32,3],[183,1,247,1],[183,3,192,3],[193,3,207,3],[208,3,217,3],[238,3,247,3],[228,3,237,3],[218,3,227,3],[123,1,182,1],[123,3,132,3],[133,3,142,3],[143,3,152,3],[173,3,182,3],[153,3,162,3],[163,3,172,3],[248,1,307,1],[248,3,257,3],[258,3,267,3],[268,3,277,3],[298,3,307,3],[288,3,297,3],[278,3,287,3],[528,3,537,3],[518,3,527,3],[428,1,487,1],[428,3,437,3],[438,3,447,3],[448,3,457,3],[478,3,487,3],[468,3,477,3],[458,3,467,3],[488,1,547,1],[488,3,497,3],[498,3,507,3],[538,3,547,3],[508,3,517,3],[690,1,749,1],[690,3,699,3],[700,3,709,3],[710,3,719,3],[740,3,749,3],[730,3,739,3],[720,3,729,3],[770,3,784,3],[805,3,814,3],[815,1,874,1],[815,3,824,3],[825,3,834,3],[835,3,844,3],[865,3,874,3],[750,1,814,1],[750,3,759,3],[760,3,769,3],[795,3,804,3],[785,3,794,3],[855,3,864,3],[845,3,854,3]]}
[null,"Associação Catarinense"]
[null,"Itinerário 2º Semestre de 2018"]
[null,"Depart.",null,"Mês",null,"Data","Atividade a Desempenhar","Igreja","Distrito",null,"IGREJA","DISTRITO"]
[1,"APOLO STREICHER ABRÁSCIO",{"$f":"IF(B4=0,C3,B4)","v":"APOLO STREICHER ABRÁSCIO"},"JULHO",{"$f":"IF(D4=0,E3,D4)","v":"JULHO"},7,"Pregação e visitação professores","Morro da Fumaça",{"$f":"IFERROR(VLOOKUP(H4,K3:L246,2,FALSE),\"\")","v":"Próspera"},null,"Águas Claras","Brusque"]
[2,null,{"$f":"IF(B5=0,C4,B5)","v":"APOLO STREICHER ABRÁSCIO"},null,{"$f":"IF(D5=0,E4,D5)","v":"JULHO"},8,"Pregação","Canasvieiras",{"$f":"IFERROR(VLOOKUP(H5,K4:L252,2,FALSE),\"\")","v":"Ingleses"},null,"Aguas Mornas","Caminho Novo"]
[3,null,"APOLO STREICHER ABRÁSCIO",null,"JULHO",14,"Pregação","Tubarão",{"$f":"IFERROR(VLOOKUP(H6,K5:L253,2,FALSE),\"\")","v":"Tubarão"},null,"Alfredo Wagner","Bom Retiro"]
[4,null,"APOLO STREICHER ABRÁSCIO",null,"JULHO",14,"Anciori","AC","AC",null,"Alto Arroio","Imbituba"]
[5,null,"APOLO STREICHER ABRÁSCIO",null,"JULHO",22,"Encontro Terceira Idade","Termas do Gravatal",{"$f":"IFERROR(VLOOKUP(H8,K7:L255,2,FALSE),\"\")","v":"São Martinho"},null,"Alto São Bento","Camboriú"]
[6,null,"APOLO STREICHER ABRÁSCIO",null,"JULHO",28,"Pregação e treinamento pela tarde","Palhoça","Palhoça",null,"Andrino","Tubarão"]
[7,null,"APOLO STREICHER ABRÁSCIO",null,"JULHO",null,null,null,{"$f":"IFERROR(VLOOKUP(H10,K9:L257,2,FALSE),\"\")","v":""},null,"Anita Garibaldi","Santa Helena"]
[8,null,"APOLO STREICHER ABRÁSCIO",null,"JULHO",null,null,null,"",null,"Antonio Carlos","Biguaçu"]
[9,null,"APOLO STREICHER ABRÁSCIO",null,"JULHO",null,null,null,"",null,"Araranguá","Araranguá"]
[10,null,"APOLO STREICHER ABRÁSCIO",null,"JULHO",null,null,null,"",null,"Araucária","Santa Helena"]
[11,null,"APOLO STREICHER ABRÁSCIO","AGOSTO",{"$f":"IF(D14=0,E13,D14)","v":"AGOSTO"},"3 e 4","Final de semana da família","Revoredo","Revoredo",null,"Areias","Barreiros"]
[12,null,"APOLO STREICHER ABRÁSCIO",null,{"$f":"IF(D15=0,E14,D15)","v":"AGOSTO"},5,"Pregação","Sambaqui","Universitario",null,"Areias do Meio","Biguaçu"]
[13,null,"APOLO STREICHER ABRÁSCIO",null,"AGOSTO",10,"Teorico Prático ","AC","AC",null,"Aririú","Palhoça"]
[14,null,"APOLO STREICHER ABRÁSCIO",null,"AGOSTO",11,"Pregação e visitação professores","Cabeçuda",{"$f":"IFERROR(VLOOKUP(H17,K16:L264,2,FALSE),\"\")","v":"Laguna"},null,"Armazem","São Martinho"]
[15,null,"APOLO STREICHER ABRÁSCIO",null,"AGOSTO",14,"PGL ","Balneário Camboriú",{"$f":"IFERROR(VLOOKUP(H18,K17:L265,2,FALSE),\"\")","v":"Balneário Camboriú"},null,"Azambuja","Brusque"]
[16,null,"APOLO STREICHER ABRÁSCIO",null,"AGOSTO",18,"Aniversário Igreja","Florianópolis",{"$f":"IFERROR(VLOOKUP(H19,K18:L266,2,FALSE),\"\")","v":"Florianópolis"},null,"Baía Sul","Florianópolis"]
[17,null,"APOLO STREICHER ABRÁSCIO",null,"AGOSTO",18,"Anciori","AC","AC",null,"Bairro Cigana","Laguna"]
{"$rows_left_out":856}
{"sheet":"Itinerário Envio","index":1,"n_rows":603,"n_cols":11,"rows_kept":603,"cut":false,"hidden":false,"merged":[[0,1,0,7],[1,1,1,7]]}
[null,"Associação Catarinense"]
[null,"Itinerário 2º Quadrimestre de 2018"]
["Colunas1","Depart.","Mês","Dia","Data","Atividade a Desempenhar","Igreja","Distrito"]
[1,{"$f":"VLOOKUP(A4,Itinerário!$A$3:$I$875,3,FALSE)","v":"APOLO STREICHER ABRÁSCIO"},{"$f":"VLOOKUP(A4,Itinerário!$A$3:$I$875,5,FALSE)","v":"JULHO"},{"$f":"IF(VLOOKUP(A4,Itinerário!$A$3:$I$875,6,FALSE)=0,\"\",VLOOKUP(A4,Itinerário!$A$3:$I$875,6,FALSE))","v":7},{"$f":"IFERROR(DATE(RIGHT($B$2,4),VLOOKUP(C4,$J$4:$K$15,2,FALSE),D4),0)","v":"2018-07-07"},{"$f":"IF(VLOOKUP(A4,Itinerário!$A$3:$I$875,7,FALSE)=0,\"\",VLOOKUP(A4,Itinerário!$A$3:$I$875,7,FALSE))","v":"Pregação e visitação professores"},{"$f":"IF(VLOOKUP(A4,Itinerário!$A$3:$I$875,8,FALSE)=0,\"\",VLOOKUP(A4,Itinerário!$A$3:$I$875,8,FALSE))","v":"Morro da Fumaça"},{"$f":"IF(VLOOKUP(A4,Itinerário!$A$3:$I$875,9,FALSE)=0,\"\",VLOOKUP(A4,Itinerário!$A$3:$I$875,9,FALSE))","v":"Próspera"},null,"JANEIRO",1]
[2,{"$f":"VLOOKUP(A5,Itinerário!$A$3:$I$875,3,FALSE)","v":"APOLO STREICHER ABRÁSCIO"},{"$f":"VLOOKUP(A5,Itinerário!$A$3:$I$875,5,FALSE)","v":"JULHO"},{"$f":"IF(VLOOKUP(A5,Itinerário!$A$3:$I$875,6,FALSE)=0,\"\",VLOOKUP(A5,Itinerário!$A$3:$I$875,6,FALSE))","v":8},{"$f":"IFERROR(DATE(RIGHT($B$2,4),VLOOKUP(C5,$J$4:$K$15,2,FALSE),D5),0)","v":"2018-07-08"},{"$f":"IF(VLOOKUP(A5,Itinerário!$A$3:$I$875,7,FALSE)=0,\"\",VLOOKUP(A5,Itinerário!$A$3:$I$875,7,FALSE))","v":"Pregação"},{"$f":"IF(VLOOKUP(A5,Itinerário!$A$3:$I$875,8,FALSE)=0,\"\",VLOOKUP(A5,Itinerário!$A$3:$I$875,8,FALSE))","v":"Canasvieiras"},{"$f":"IF(VLOOKUP(A5,Itinerário!$A$3:$I$875,9,FALSE)=0,\"\",VLOOKUP(A5,Itinerário!$A$3:$I$875,9,FALSE))","v":"Ingleses"},null,"FEVEREIRO",2]
[3,{"$f":"VLOOKUP(A6,Itinerário!$A$3:$I$875,3,FALSE)","v":"APOLO STREICHER ABRÁSCIO"},{"$f":"VLOOKUP(A6,Itinerário!$A$3:$I$875,5,FALSE)","v":"JULHO"},{"$f":"IF(VLOOKUP(A6,Itinerário!$A$3:$I$875,6,FALSE)=0,\"\",VLOOKUP(A6,Itinerário!$A$3:$I$875,6,FALSE))","v":14},"2018-07-14",{"$f":"IF(VLOOKUP(A6,Itinerário!$A$3:$I$875,7,FALSE)=0,\"\",VLOOKUP(A6,Itinerário!$A$3:$I$875,7,FALSE))","v":"Pregação"},{"$f":"IF(VLOOKUP(A6,Itinerário!$A$3:$I$875,8,FALSE)=0,\"\",VLOOKUP(A6,Itinerário!$A$3:$I$875,8,FALSE))","v":"Tubarão"},{"$f":"IF(VLOOKUP(A6,Itinerário!$A$3:$I$875,9,FALSE)=0,\"\",VLOOKUP(A6,Itinerário!$A$3:$I$875,9,FALSE))","v":"Tubarão"},null,"MARÇO",3]
[4,{"$f":"VLOOKUP(A7,Itinerário!$A$3:$I$875,3,FALSE)","v":"APOLO STREICHER ABRÁSCIO"},{"$f":"VLOOKUP(A7,Itinerário!$A$3:$I$875,5,FALSE)","v":"JULHO"},{"$f":"IF(VLOOKUP(A7,Itinerário!$A$3:$I$875,6,FALSE)=0,\"\",VLOOKUP(A7,Itinerário!$A$3:$I$875,6,FALSE))","v":14},"2018-07-14",{"$f":"IF(VLOOKUP(A7,Itinerário!$A$3:$I$875,7,FALSE)=0,\"\",VLOOKUP(A7,Itinerário!$A$3:$I$875,7,FALSE))","v":"Anciori"},{"$f":"IF(VLOOKUP(A7,Itinerário!$A$3:$I$875,8,FALSE)=0,\"\",VLOOKUP(A7,Itinerário!$A$3:$I$875,8,FALSE))","v":"AC"},{"$f":"IF(VLOOKUP(A7,Itinerário!$A$3:$I$875,9,FALSE)=0,\"\",VLOOKUP(A7,Itinerário!$A$3:$I$875,9,FALSE))","v":"AC"},null,"ABRIL",4]
[5,{"$f":"VLOOKUP(A8,Itinerário!$A$3:$I$875,3,FALSE)","v":"APOLO STREICHER ABRÁSCIO"},{"$f":"VLOOKUP(A8,Itinerário!$A$3:$I$875,5,FALSE)","v":"JULHO"},{"$f":"IF(VLOOKUP(A8,Itinerário!$A$3:$I$875,6,FALSE)=0,\"\",VLOOKUP(A8,Itinerário!$A$3:$I$875,6,FALSE))","v":22},"2018-07-22",{"$f":"IF(VLOOKUP(A8,Itinerário!$A$3:$I$875,7,FALSE)=0,\"\",VLOOKUP(A8,Itinerário!$A$3:$I$875,7,FALSE))","v":"Encontro Terceira Idade"},{"$f":"IF(VLOOKUP(A8,Itinerário!$A$3:$I$875,8,FALSE)=0,\"\",VLOOKUP(A8,Itinerário!$A$3:$I$875,8,FALSE))","v":"Termas do Gravatal"},{"$f":"IF(VLOOKUP(A8,Itinerário!$A$3:$I$875,9,FALSE)=0,\"\",VLOOKUP(A8,Itinerário!$A$3:$I$875,9,FALSE))","v":"São Martinho"},null,"MAIO",5]
[6,{"$f":"VLOOKUP(A9,Itinerário!$A$3:$I$875,3,FALSE)","v":"APOLO STREICHER ABRÁSCIO"},{"$f":"VLOOKUP(A9,Itinerário!$A$3:$I$875,5,FALSE)","v":"JULHO"},{"$f":"IF(VLOOKUP(A9,Itinerário!$A$3:$I$875,6,FALSE)=0,\"\",VLOOKUP(A9,Itinerário!$A$3:$I$875,6,FALSE))","v":28},"2018-07-28",{"$f":"IF(VLOOKUP(A9,Itinerário!$A$3:$I$875,7,FALSE)=0,\"\",VLOOKUP(A9,Itinerário!$A$3:$I$875,7,FALSE))","v":"Pregação e treinamento pela tarde"},{"$f":"IF(VLOOKUP(A9,Itinerário!$A$3:$I$875,8,FALSE)=0,\"\",VLOOKUP(A9,Itinerário!$A$3:$I$875,8,FALSE))","v":"Palhoça"},{"$f":"IF(VLOOKUP(A9,Itinerário!$A$3:$I$875,9,FALSE)=0,\"\",VLOOKUP(A9,Itinerário!$A$3:$I$875,9,FALSE))","v":"Palhoça"},null,"JUNHO",6]
[7,{"$f":"VLOOKUP(A10,Itinerário!$A$3:$I$875,3,FALSE)","v":"APOLO STREICHER ABRÁSCIO"},{"$f":"VLOOKUP(A10,Itinerário!$A$3:$I$875,5,FALSE)","v":"JULHO"},{"$f":"IF(VLOOKUP(A10,Itinerário!$A$3:$I$875,6,FALSE)=0,\"\",VLOOKUP(A10,Itinerário!$A$3:$I$875,6,FALSE))","v":""},"00:00:00",{"$f":"IF(VLOOKUP(A10,Itinerário!$A$3:$I$875,7,FALSE)=0,\"\",VLOOKUP(A10,Itinerário!$A$3:$I$875,7,FALSE))","v":""},{"$f":"IF(VLOOKUP(A10,Itinerário!$A$3:$I$875,8,FALSE)=0,\"\",VLOOKUP(A10,Itinerário!$A$3:$I$875,8,FALSE))","v":""},{"$f":"IF(VLOOKUP(A10,Itinerário!$A$3:$I$875,9,FALSE)=0,\"\",VLOOKUP(A10,Itinerário!$A$3:$I$875,9,FALSE))","v":""},null,"JULHO",7]
[8,{"$f":"VLOOKUP(A11,Itinerário!$A$3:$I$875,3,FALSE)","v":"APOLO STREICHER ABRÁSCIO"},{"$f":"VLOOKUP(A11,Itinerário!$A$3:$I$875,5,FALSE)","v":"JULHO"},{"$f":"IF(VLOOKUP(A11,Itinerário!$A$3:$I$875,6,FALSE)=0,\"\",VLOOKUP(A11,Itinerário!$A$3:$I$875,6,FALSE))","v":""},"00:00:00",{"$f":"IF(VLOOKUP(A11,Itinerário!$A$3:$I$875,7,FALSE)=0,\"\",VLOOKUP(A11,Itinerário!$A$3:$I$875,7,FALSE))","v":""},{"$f":"IF(VLOOKUP(A11,Itinerário!$A$3:$I$875,8,FALSE)=0,\"\",VLOOKUP(A11,Itinerário!$A$3:$I$875,8,FALSE))","v":""},{"$f":"IF(VLOOKUP(A11,Itinerário!$A$3:$I$875,9,FALSE)=0,\"\",VLOOKUP(A11,Itinerário!$A$3:$I$875,9,FALSE))","v":""},null,"AGOSTO",8]
[9,{"$f":"VLOOKUP(A12,Itinerário!$A$3:$I$875,3,FALSE)","v":"APOLO STREICHER ABRÁSCIO"},{"$f":"VLOOKUP(A12,Itinerário!$A$3:$I$875,5,FALSE)","v":"JULHO"},{"$f":"IF(VLOOKUP(A12,Itinerário!$A$3:$I$875,6,FALSE)=0,\"\",VLOOKUP(A12,Itinerário!$A$3:$I$875,6,FALSE))","v":""},"00:00:00",{"$f":"IF(VLOOKUP(A12,Itinerário!$A$3:$I$875,7,FALSE)=0,\"\",VLOOKUP(A12,Itinerário!$A$3:$I$875,7,FALSE))","v":""},{"$f":"IF(VLOOKUP(A12,Itinerário!$A$3:$I$875,8,FALSE)=0,\"\",VLOOKUP(A12,Itinerário!$A$3:$I$875,8,FALSE))","v":""},{"$f":"IF(VLOOKUP(A12,Itinerário!$A$3:$I$875,9,FALSE)=0,\"\",VLOOKUP(A12,Itinerário!$A$3:$I$875,9,FALSE))","v":""},null,"SETEMBRO",9]
[10,{"$f":"VLOOKUP(A13,Itinerário!$A$3:$I$875,3,FALSE)","v":"APOLO STREICHER ABRÁSCIO"},{"$f":"VLOOKUP(A13,Itinerário!$A$3:$I$875,5,FALSE)","v":"JULHO"},{"$f":"IF(VLOOKUP(A13,Itinerário!$A$3:$I$875,6,FALSE)=0,\"\",VLOOKUP(A13,Itinerário!$A$3:$I$875,6,FALSE))","v":""},"00:00:00",{"$f":"IF(VLOOKUP(A13,Itinerário!$A$3:$I$875,7,FALSE)=0,\"\",VLOOKUP(A13,Itinerário!$A$3:$I$875,7,FALSE))","v":""},{"$f":"IF(VLOOKUP(A13,Itinerário!$A$3:$I$875,8,FALSE)=0,\"\",VLOOKUP(A13,Itinerário!$A$3:$I$875,8,FALSE))","v":""},{"$f":"IF(VLOOKUP(A13,Itinerário!$A$3:$I$875,9,FALSE)=0,\"\",VLOOKUP(A13,Itinerário!$A$3:$I$875,9,FALSE))","v":""},null,"OUTUBRO",10]
[11,{"$f":"VLOOKUP(A14,Itinerário!$A$3:$I$875,3,FALSE)","v":"APOLO STREICHER ABRÁSCIO"},{"$f":"VLOOKUP(A14,Itinerário!$A$3:$I$875,5,FALSE)","v":"AGOSTO"},{"$f":"IF(VLOOKUP(A14,Itinerário!$A$3:$I$875,6,FALSE)=0,\"\",VLOOKUP(A14,Itinerário!$A$3:$I$875,6,FALSE))","v":"3 e 4"},"00:00:00",{"$f":"IF(VLOOKUP(A14,Itinerário!$A$3:$I$875,7,FALSE)=0,\"\",VLOOKUP(A14,Itinerário!$A$3:$I$875,7,FALSE))","v":"Final de semana da família"},{"$f":"IF(VLOOKUP(A14,Itinerário!$A$3:$I$875,8,FALSE)=0,\"\",VLOOKUP(A14,Itinerário!$A$3:$I$875,8,FALSE))","v":"Revoredo"},{"$f":"IF(VLOOKUP(A14,Itinerário!$A$3:$I$875,9,FALSE)=0,\"\",VLOOKUP(A14,Itinerário!$A$3:$I$875,9,FALSE))","v":"Revoredo"},null,"NOVEMBRO",11]
[12,{"$f":"VLOOKUP(A15,Itinerário!$A$3:$I$875,3,FALSE)","v":"APOLO STREICHER ABRÁSCIO"},{"$f":"VLOOKUP(A15,Itinerário!$A$3:$I$875,5,FALSE)","v":"AGOSTO"},{"$f":"IF(VLOOKUP(A15,Itinerário!$A$3:$I$875,6,FALSE)=0,\"\",VLOOKUP(A15,Itinerário!$A$3:$I$875,6,FALSE))","v":5},"2018-08-05",{"$f":"IF(VLOOKUP(A15,Itinerário!$A$3:$I$875,7,FALSE)=0,\"\",VLOOKUP(A15,Itinerário!$A$3:$I$875,7,FALSE))","v":"Pregação"},{"$f":"IF(VLOOKUP(A15,Itinerário!$A$3:$I$875,8,FALSE)=0,\"\",VLOOKUP(A15,Itinerário!$A$3:$I$875,8,FALSE))","v":"Sambaqui"},{"$f":"IF(VLOOKUP(A15,Itinerário!$A$3:$I$875,9,FALSE)=0,\"\",VLOOKUP(A15,Itinerário!$A$3:$I$875,9,FALSE))","v":"Universitario"},null,"DEZEMBRO",12]
[13,{"$f":"VLOOKUP(A16,Itinerário!$A$3:$I$875,3,FALSE)","v":"APOLO STREICHER ABRÁSCIO"},{"$f":"VLOOKUP(A16,Itinerário!$A$3:$I$875,5,FALSE)","v":"AGOSTO"},{"$f":"IF(VLOOKUP(A16,Itinerário!$A$3:$I$875,6,FALSE)=0,\"\",VLOOKUP(A16,Itinerário!$A$3:$I$875,6,FALSE))","v":10},"2018-08-10",{"$f":"IF(VLOOKUP(A16,Itinerário!$A$3:$I$875,7,FALSE)=0,\"\",VLOOKUP(A16,Itinerário!$A$3:$I$875,7,FALSE))","v":"Teorico Prático "},{"$f":"IF(VLOOKUP(A16,Itinerário!$A$3:$I$875,8,FALSE)=0,\"\",VLOOKUP(A16,Itinerário!$A$3:$I$875,8,FALSE))","v":"AC"},{"$f":"IF(VLOOKUP(A16,Itinerário!$A$3:$I$875,9,FALSE)=0,\"\",VLOOKUP(A16,Itinerário!$A$3:$I$875,9,FALSE))","v":"AC"}]
[14,{"$f":"VLOOKUP(A17,Itinerário!$A$3:$I$875,3,FALSE)","v":"APOLO STREICHER ABRÁSCIO"},{"$f":"VLOOKUP(A17,Itinerário!$A$3:$I$875,5,FALSE)","v":"AGOSTO"},{"$f":"IF(VLOOKUP(A17,Itinerário!$A$3:$I$875,6,FALSE)=0,\"\",VLOOKUP(A17,Itinerário!$A$3:$I$875,6,FALSE))","v":11},"2018-08-11",{"$f":"IF(VLOOKUP(A17,Itinerário!$A$3:$I$875,7,FALSE)=0,\"\",VLOOKUP(A17,Itinerário!$A$3:$I$875,7,FALSE))","v":"Pregação e visitação professores"},{"$f":"IF(VLOOKUP(A17,Itinerário!$A$3:$I$875,8,FALSE)=0,\"\",VLOOKUP(A17,Itinerário!$A$3:$I$875,8,FALSE))","v":"Cabeçuda"},{"$f":"IF(VLOOKUP(A17,Itinerário!$A$3:$I$875,9,FALSE)=0,\"\",VLOOKUP(A17,Itinerário!$A$3:$I$875,9,FALSE))","v":"Laguna"}]
[15,{"$f":"VLOOKUP(A18,Itinerário!$A$3:$I$875,3,FALSE)","v":"APOLO STREICHER ABRÁSCIO"},{"$f":"VLOOKUP(A18,Itinerário!$A$3:$I$875,5,FALSE)","v":"AGOSTO"},{"$f":"IF(VLOOKUP(A18,Itinerário!$A$3:$I$875,6,FALSE)=0,\"\",VLOOKUP(A18,Itinerário!$A$3:$I$875,6,FALSE))","v":14},"2018-08-14",{"$f":"IF(VLOOKUP(A18,Itinerário!$A$3:$I$875,7,FALSE)=0,\"\",VLOOKUP(A18,Itinerário!$A$3:$I$875,7,FALSE))","v":"PGL "},{"$f":"IF(VLOOKUP(A18,Itinerário!$A$3:$I$875,8,FALSE)=0,\"\",VLOOKUP(A18,Itinerário!$A$3:$I$875,8,FALSE))","v":"Balneário Camboriú"},{"$f":"IF(VLOOKUP(A18,Itinerário!$A$3:$I$875,9,FALSE)=0,\"\",VLOOKUP(A18,Itinerário!$A$3:$I$875,9,FALSE))","v":"Balneário Camboriú"}]
[16,{"$f":"VLOOKUP(A19,Itinerário!$A$3:$I$875,3,FALSE)","v":"APOLO STREICHER ABRÁSCIO"},{"$f":"VLOOKUP(A19,Itinerário!$A$3:$I$875,5,FALSE)","v":"AGOSTO"},{"$f":"IF(VLOOKUP(A19,Itinerário!$A$3:$I$875,6,FALSE)=0,\"\",VLOOKUP(A19,Itinerário!$A$3:$I$875,6,FALSE))","v":18},"2018-08-18",{"$f":"IF(VLOOKUP(A19,Itinerário!$A$3:$I$875,7,FALSE)=0,\"\",VLOOKUP(A19,Itinerário!$A$3:$I$875,7,FALSE))","v":"Aniversário Igreja"},{"$f":"IF(VLOOKUP(A19,Itinerário!$A$3:$I$875,8,FALSE)=0,\"\",VLOOKUP(A19,Itinerário!$A$3:$I$875,8,FALSE))","v":"Florianópolis"},{"$f":"IF(VLOOKUP(A19,Itinerário!$A$3:$I$875,9,FALSE)=0,\"\",VLOOKUP(A19,Itinerário!$A$3:$I$875,9,FALSE))","v":"Florianópolis"}]
[17,{"$f":"VLOOKUP(A20,Itinerário!$A$3:$I$875,3,FALSE)","v":"APOLO STREICHER ABRÁSCIO"},{"$f":"VLOOKUP(A20,Itinerário!$A$3:$I$875,5,FALSE)","v":"AGOSTO"},{"$f":"IF(VLOOKUP(A20,Itinerário!$A$3:$I$875,6,FALSE)=0,\"\",VLOOKUP(A20,Itinerário!$A$3:$I$875,6,FALSE))","v":18},"2018-08-18",{"$f":"IF(VLOOKUP(A20,Itinerário!$A$3:$I$875,7,FALSE)=0,\"\",VLOOKUP(A20,Itinerário!$A$3:$I$875,7,FALSE))","v":"Anciori"},{"$f":"IF(VLOOKUP(A20,Itinerário!$A$3:$I$875,8,FALSE)=0,\"\",VLOOKUP(A20,Itinerário!$A$3:$I$875,8,FALSE))","v":"AC"},{"$f":"IF(VLOOKUP(A20,Itinerário!$A$3:$I$875,9,FALSE)=0,\"\",VLOOKUP(A20,Itinerário!$A$3:$I$875,9,FALSE))","v":"AC"}]
{"$rows_left_out":584}
{"sheet":"PDF-Email","index":2,"n_rows":56,"n_cols":10,"rows_kept":56,"cut":false,"hidden":false,"merged":[]}
[]
[null,null,null,null,"Você está vendo células com o interior vermelho na tabela?"]
["Prévia E-mail Antes de Enviar",null,"Yes",null,"Significa que existe dados errados."]
[]
[]
["Enviar","Planilhas","Nome do Arquivo","Para","Cc","Cco","Assunto","Anexar outros arquivos","Corpo do E-mail","Importante"]
["yes","Itinerário Envio",{"$f":"CONCATENATE(\"Itinerário \",VLOOKUP($D$9,$B$14:$G$54,2,FALSE))","v":"Itinerário Santa Helena"},{"$f":"VLOOKUP($D$9,$B$14:$G$54,4,FALSE)","v":"diego.schroeder@adventistas.org.br"},{"$f":"VLOOKUP($D$9,$B$14:$G$54,6,FALSE)","v":0},null,"Itinerário Departamentais 2° Trimestre de  2018",null,{"$f":"CONCATENATE(\"Boa tarde Pr. \",LEFT(VLOOKUP(D9,B14:G54,3,FALSE),SEARCH(\" \",VLOOKUP(D9,B14:G54,3,FALSE))),\"\n\nSegue em anexo as datas em que os departamentais e a administração da AC estarão em seu distrito\")","v":"Boa tarde Pr. Diego \n\nSegue em anexo as datas em que os departamentais e a administração da AC estarão em seu distrito"}]
[]
[null,null,null,34]
[]
[]
[]
[]
[null,null,"Distrito","Pastor","Email Pastor","Pastor Auxíliar","Email Pastor Auxíliar"]
[null,1,"Araranguá","Jorge Luiz Sousa da Rosa","jorge.rosa@adventistas.org.br"]
[null,2,"Balneário Camboriú","Elton Ricardo Viana de Andrade","elton.andrade@adventistas.org.br"]
[null,3,"Barreiros","Jonas Genesis Do Prado","jonas.prado@adventistas.org.br"]
[null,4,"Biguaçu","William Gomes Ferreira","wiliam.ferreira@adventistas.org.br"]
[null,5,"Bom Retiro","Rogério Mistura","rogerio.mistura@adventistas.org.br"]
[null,6,"Brusque","Oriel Pedroso","oriel.pedroso@adventistas.org.br"]
{"$rows_left_out":36}